nixbot

builds

numtide/iets build #443 failed

branch e2e-flake-daemon · PR #203 · commit 7b1d59c44c · · took 2h 34m · eval 16s

eval warnings 2 kinds · 2 occurrences
  • warn setting 'accept-flake-config' is ignored: iets never applies a flake's nixConfig, so a flake that sets extra-substituters or allow-import-from-derivation there runs without them; put the settings in nix.conf ×1
  • warn setting 'plugin-files' is ignored: iets loads no plugins ×1

8 failed
failed attributes
status attribute duration
failed checks.aarch64-linux.fuzz-wire 42m 20s
iets-fuzz-wire-check: "doc" # Uses: 24 "\024\000\000\000\000\000\000\000" # Uses: 26 "\377\377\377\377\377\377\377\011" # Uses: 17 "\004\000\000\000" # Uses: 15 …
iets-fuzz-wire-check:
"doc" # Uses: 24
"\024\000\000\000\000\000\000\000" # Uses: 26
"\377\377\377\377\377\377\377\011" # Uses: 17
"\004\000\000\000" # Uses: 15
"flo" # Uses: 4
"ror" # Uses: 3
###### End of recommended dictionary. ######
Done 30802 runs in 31 second(s)
failed checks.aarch64-linux.nixpkgs-eval 8m 59s
iets-nextest-0.1.0: thread 'nixpkgs_drvs_match_nix' (1338) panicked at tests/nixpkgs_eval.rs:27:5: env -u NIX_CONFIG NIX_CONF_DIR="/nonexistent" NIX_USE …
iets-nextest-0.1.0:
    thread 'nixpkgs_drvs_match_nix' (1338) panicked at tests/nixpkgs_eval.rs:27:5:
    env -u NIX_CONFIG NIX_CONF_DIR="/nonexistent" NIX_USER_CONF_FILES="" "/nix/store/q9i0sg55vl1nb8xxg33q1ziml4qxgr0r-nix-eval-jobs-2.35.4/bin/nix-eval-jobs" "--store" "dummy://?read-only=false" "--impure" "--no-instantiate" "--workers" "4" "--arg" "nixpkgs" "/nix/store/61zfbhpgh5k6a8708l6mcap1kjbs3mz7-r5l65vg4gi4dnx54zkwagfb8jmlqniy5-source" "--arg" "limit" "null" "/build/source/tests/nixpkgs_eval.nix": error: creating directory "/homeless-shelter/.cache/nix": Permission denied
    note: run with `RUST_BACKTRACE=1` environment variable to display a backtrace
  Cancelling due to test failure: 
------------
     Summary [   0.235s] 1 test run: 0 passed, 1 failed, 0 skipped
        FAIL [   0.228s] (1/1) iets::nixpkgs_eval nixpkgs_drvs_match_nix
error: test run failed
failed checks.aarch64-linux.test 5m 5s
iets-nextest-0.1.0: SLOW [>180.000s] (---------) iets api::concurrent_eval::concurrent_eval_matches_sequential_eval SLOW [>240.000s] (---------) …
iets-nextest-0.1.0:
        SLOW [>180.000s] (---------) iets api::concurrent_eval::concurrent_eval_matches_sequential_eval
        SLOW [>240.000s] (---------) iets api::concurrent_eval::concurrent_eval_matches_sequential_eval
        PASS [ 244.159s] ( 636/1035) iets api::concurrent_eval::concurrent_eval_matches_sequential_eval
------------
     Summary [ 244.160s] 636/1035 tests run: 635 passed (2 slow), 1 failed, 6 skipped
        FAIL [   1.448s] ( 621/1035) iets::classic_build out_links_and_roots
warning: 399/1035 tests were not run due to test failure (run with --no-fail-fast to run all tests, or run with --max-fail)
error: test run failed
failed checks.x86_64-linux.conformance 37m 42s
… and 1 more failed derivation
… and 1 more failed derivation
failed checks.x86_64-linux.cross-riscv64 20m 29s
iets-riscv64-unknown-linux-gnu-0.1.0: ---------------------------------------------------------------------------------- decompressing cargo artifacts from /nix …
iets-riscv64-unknown-linux-gnu-0.1.0:
----------------------------------------------------------------------------------
decompressing cargo artifacts from /nix/store/3jzdq6pvpv4lnimvg8p2fqnr7gsqm9vj-iets-deps-riscv64-unknown-linux-gnu-0.1.0/target.tar.zst to target
will append /build/source/.cargo-home/config.toml with contents of /nix/store/ad0zq5zmrj5ri9k8m2ylc9015pjg95i7-vendor-cargo-deps/config.toml
default configurePhase, nothing to do
+++ command cargo --version
cargo 1.98.0 (797e8a9bc 2026-08-05)
+++ command cargo build --release --message-format json-render-diagnostics --locked
   Compiling iets v0.1.0 (/build/source)
failed checks.x86_64-linux.fuzz-nar 1h 11m
setup: these 3 derivations will be built: /nix/store/2im2zvc5jwgx6vhvp1dw7radfldv7n09-iets-fuzz-diff-0.0.0.drv /nix/store/db5dkfzybddq8dsci5f1c2pms6ni8rbm-i …
setup:
these 3 derivations will be built:
  /nix/store/2im2zvc5jwgx6vhvp1dw7radfldv7n09-iets-fuzz-diff-0.0.0.drv
  /nix/store/db5dkfzybddq8dsci5f1c2pms6ni8rbm-iets-fuzzers-0.0.0.drv
  /nix/store/fphvny650pj9d55rs8yyl3kshjwjpxnj-iets-fuzz-nar-check.drv
error: timed out after 1200 seconds
error: Cannot build '/nix/store/fphvny650pj9d55rs8yyl3kshjwjpxnj-iets-fuzz-nar-check.drv'.
       Reason: 1 dependency failed.
       Output paths:
         /nix/store/k67s2gpapcawxlqln5j7618731jqjll6-iets-fuzz-nar-check
failed checks.x86_64-linux.nixpkgs-eval 20m 21s
iets-nextest-0.1.0: +++ command cargo --version cargo 1.98.0 (797e8a9bc 2026-08-05) +++ command cargo nextest --version cargo-nextest 0.9.146 release: 0.9.146 h …
iets-nextest-0.1.0:
+++ command cargo --version
cargo 1.98.0 (797e8a9bc 2026-08-05)
+++ command cargo nextest --version
cargo-nextest 0.9.146
release: 0.9.146
host: x86_64-unknown-linux-gnu
+++ command cargo nextest run --cargo-profile release --run-ignored only -E 'binary(nixpkgs_eval)'
   Compiling iets v0.1.0 (/build/source)
failed checks.x86_64-linux.static 20m 31s
iets-static-x86_64-unknown-linux-musl-0.1.0: ---------------------------------------------------------------------------------- decompressing cargo artifacts fr …
iets-static-x86_64-unknown-linux-musl-0.1.0:
----------------------------------------------------------------------------------
decompressing cargo artifacts from /nix/store/0872gc48kymam8x4cf0ch8nx8zrr6474-iets-deps-static-x86_64-unknown-linux-musl-0.1.0/target.tar.zst to target
will append /build/source/.cargo-home/config.toml with contents of /nix/store/ad0zq5zmrj5ri9k8m2ylc9015pjg95i7-vendor-cargo-deps/config.toml
default configurePhase, nothing to do
+++ command cargo --version
cargo 1.98.0 (797e8a9bc 2026-08-05)
+++ command cargo build --release --message-format json-render-diagnostics --locked
   Compiling iets v0.1.0 (/build/source)
5 cancelled
cancelled attributes
status attribute duration
loading…
21 succeeded
succeeded attributes
status attribute duration
loading…
3 already built
skipped attributes
status attribute duration
loading…