nixbot

builds

numtide/iets build #442 failed

branch nix-compat-fixes · PR #201 · commit a4a73f1d82 · · took 1h 36m · eval 19s

eval warnings 2 kinds · 2 occurrences
  • warn setting 'accept-flake-config' is ignored: iets never applies a flake's nixConfig, so a flake that sets extra-substituters or allow-import-from-derivation there runs without them; put the settings in nix.conf ×1
  • warn setting 'plugin-files' is ignored: iets loads no plugins ×1

4 failed
failed attributes
status attribute duration
failed checks.aarch64-linux.nixpkgs-eval 10m 57s
iets-nextest-0.1.0: thread 'nixpkgs_drvs_match_nix' (1090) panicked at tests/nixpkgs_eval.rs:27:5: env -u NIX_CONFIG NIX_CONF_DIR="/nonexistent" NIX_USE …
iets-nextest-0.1.0:
    thread 'nixpkgs_drvs_match_nix' (1090) panicked at tests/nixpkgs_eval.rs:27:5:
    env -u NIX_CONFIG NIX_CONF_DIR="/nonexistent" NIX_USER_CONF_FILES="" "/nix/store/q9i0sg55vl1nb8xxg33q1ziml4qxgr0r-nix-eval-jobs-2.35.4/bin/nix-eval-jobs" "--store" "dummy://?read-only=false" "--impure" "--no-instantiate" "--workers" "4" "--arg" "nixpkgs" "/nix/store/61zfbhpgh5k6a8708l6mcap1kjbs3mz7-r5l65vg4gi4dnx54zkwagfb8jmlqniy5-source" "--arg" "limit" "null" "/build/source/tests/nixpkgs_eval.nix": error: creating directory "/homeless-shelter/.cache/nix": Permission denied
    note: run with `RUST_BACKTRACE=1` environment variable to display a backtrace
  Cancelling due to test failure: 
------------
     Summary [   0.196s] 1 test run: 0 passed, 1 failed, 0 skipped
        FAIL [   0.193s] (1/1) iets::nixpkgs_eval nixpkgs_drvs_match_nix
error: test run failed
failed checks.aarch64-linux.test 9m 11s
iets-nextest-0.1.0: PASS [ 375.355s] (637/984) iets api::concurrent_eval::concurrent_eval_matches_sequential_eval ------------ Summary [ 375.358s] …
iets-nextest-0.1.0:
        PASS [ 375.355s] (637/984) iets api::concurrent_eval::concurrent_eval_matches_sequential_eval
------------
     Summary [ 375.358s] 637/984 tests run: 634 passed (2 slow), 3 failed, 6 skipped
        FAIL [   0.287s] (622/984) iets::e2e_build dry_run_over_a_tree
        FAIL [   0.655s] (625/984) iets::e2e_build a_tree_builds_past_a_failure
        FAIL [   0.727s] (628/984) iets::e2e_build one_root
warning: 347/984 tests were not run due to test failure (run with --no-fail-fast to run all tests, or run with --max-fail)
error: test run failed
failed checks.x86_64-linux.cross-riscv64 37m 56s
iets-riscv64-unknown-linux-gnu-0.1.0: ---------------------------------------------------------------------------------- decompressing cargo artifacts from /nix …
iets-riscv64-unknown-linux-gnu-0.1.0:
----------------------------------------------------------------------------------
decompressing cargo artifacts from /nix/store/3jzdq6pvpv4lnimvg8p2fqnr7gsqm9vj-iets-deps-riscv64-unknown-linux-gnu-0.1.0/target.tar.zst to target
will append /build/source/.cargo-home/config.toml with contents of /nix/store/ad0zq5zmrj5ri9k8m2ylc9015pjg95i7-vendor-cargo-deps/config.toml
default configurePhase, nothing to do
+++ command cargo --version
cargo 1.98.0 (797e8a9bc 2026-08-05)
+++ command cargo build --release --message-format json-render-diagnostics --locked
   Compiling iets v0.1.0 (/build/source)
failed checks.x86_64-linux.nixpkgs-eval 7m 19s
iets-nextest-0.1.0: thread 'nixpkgs_drvs_match_nix' (1146) panicked at tests/nixpkgs_eval.rs:27:5: env -u NIX_CONFIG NIX_CONF_DIR="/nonexistent" NIX_USE …
iets-nextest-0.1.0:
    thread 'nixpkgs_drvs_match_nix' (1146) panicked at tests/nixpkgs_eval.rs:27:5:
    env -u NIX_CONFIG NIX_CONF_DIR="/nonexistent" NIX_USER_CONF_FILES="" "/nix/store/7vpxiq5ilyp8i789xr82q4jdg2wy4hca-nix-eval-jobs-2.35.4/bin/nix-eval-jobs" "--store" "dummy://?read-only=false" "--impure" "--no-instantiate" "--workers" "4" "--arg" "nixpkgs" "/nix/store/61zfbhpgh5k6a8708l6mcap1kjbs3mz7-r5l65vg4gi4dnx54zkwagfb8jmlqniy5-source" "--arg" "limit" "null" "/build/source/tests/nixpkgs_eval.nix": error: creating directory "/homeless-shelter/.cache/nix": Permission denied
    note: run with `RUST_BACKTRACE=1` environment variable to display a backtrace
  Cancelling due to test failure: 
------------
     Summary [   0.195s] 1 test run: 0 passed, 1 failed, 0 skipped
        FAIL [   0.173s] (1/1) iets::nixpkgs_eval nixpkgs_drvs_match_nix
error: test run failed
34 succeeded
succeeded attributes
status attribute duration
loading…
3 already built
skipped attributes
status attribute duration
loading…