nixbot

builds

numtide/iets build #444 failed

branch e2e-fixture · PR #202 · commit f310624705 · · took 2s · eval 16s

3 failed
failed attributes
status attribute duration
failed checks.aarch64-linux.nixpkgs-eval 6m 40s
iets-nextest-0.1.0: thread 'nixpkgs_drvs_match_nix' (1183) panicked at tests/nixpkgs_eval.rs:27:5: env -u NIX_CONFIG NIX_CONF_DIR="/nonexistent" NIX_USE …
iets-nextest-0.1.0:
    thread 'nixpkgs_drvs_match_nix' (1183) panicked at tests/nixpkgs_eval.rs:27:5:
    env -u NIX_CONFIG NIX_CONF_DIR="/nonexistent" NIX_USER_CONF_FILES="" "/nix/store/q9i0sg55vl1nb8xxg33q1ziml4qxgr0r-nix-eval-jobs-2.35.4/bin/nix-eval-jobs" "--store" "dummy://?read-only=false" "--impure" "--no-instantiate" "--workers" "4" "--arg" "nixpkgs" "/nix/store/61zfbhpgh5k6a8708l6mcap1kjbs3mz7-r5l65vg4gi4dnx54zkwagfb8jmlqniy5-source" "--arg" "limit" "null" "/build/source/tests/nixpkgs_eval.nix": error: creating directory "/homeless-shelter/.cache/nix": Permission denied
    note: run with `RUST_BACKTRACE=1` environment variable to display a backtrace
  Cancelling due to test failure: 
------------
     Summary [   0.099s] 1 test run: 0 passed, 1 failed, 0 skipped
        FAIL [   0.098s] (1/1) iets::nixpkgs_eval nixpkgs_drvs_match_nix
error: test run failed
failed checks.x86_64-linux.conformance 1h 8m
nix-conformance-iets: SKIP lang/eval-okay-closure.nix SKIP lang/eval-okay-functionargs.nix
nix-conformance-iets:
SKIP lang/eval-okay-closure.nix
SKIP lang/eval-okay-functionargs.nix
failed checks.x86_64-linux.nixpkgs-eval 20m 22s
iets-nextest-0.1.0: +++ command cargo --version cargo 1.98.0 (797e8a9bc 2026-08-05) +++ command cargo nextest --version cargo-nextest 0.9.146 release: 0.9.146 h …
iets-nextest-0.1.0:
+++ command cargo --version
cargo 1.98.0 (797e8a9bc 2026-08-05)
+++ command cargo nextest --version
cargo-nextest 0.9.146
release: 0.9.146
host: x86_64-unknown-linux-gnu
+++ command cargo nextest run --cargo-profile release --run-ignored only -E 'binary(nixpkgs_eval)'
   Compiling iets v0.1.0 (/build/source)
7 cancelled
cancelled attributes
status attribute duration
loading…
25 succeeded
succeeded attributes
status attribute duration
loading…
3 already built
skipped attributes
status attribute duration
loading…