codex-0.164.0
checks.x86_64-linux.pkgs-codex-acp
· build #8948
· raw
1attached to the build already running on this worker2bld1: building i7ycw5kc4j3ki9sy6lsp53q3hy4dmc7s-codex-0.164.0.drv3Using versionCheckHook
unpackPhase
4unpacking source archive /nix/store/10pdz4z8bfg35ysd7aqrhnzdkijpmmwb-source5source root is source/codex-rs6Executing cargoSetupPostUnpackHook7Finished cargoSetupPostUnpackHook8unpackPhase completed in 2 minutes 31 secondspatchPhase
9applying patch /nix/store/yl1g5zgms31fd33ayqwzra3l9djcpkjm-daemon-nix-store.patch10patching file app-server-daemon/src/prepare_install.rs11Hunk #1 succeeded at 78 (offset 2 lines).12Hunk #2 succeeded at 112 (offset 2 lines).13Hunk #3 succeeded at 233 (offset 6 lines).14Hunk #4 FAILED at 276.15Hunk #5 FAILED at 350.162 out of 5 hunks FAILED -- saving rejects to file app-server-daemon/src/prepare_install.rs.rej