failed attributes
| status |
attribute |
duration |
| failed |
checks.aarch64-darwin.pkgs-codex
|
1m 58s |
codex-0.164.0:
applying patch /nix/store/yl1g5zgms31fd33ayqwzra3l9djcpkjm-daemon-nix-store.patch
patching file app-server-daemon/src/prepare_install.rs
Hunk #1 …
codex-0.164.0:
applying patch /nix/store/yl1g5zgms31fd33ayqwzra3l9djcpkjm-daemon-nix-store.patch
patching file app-server-daemon/src/prepare_install.rs
Hunk #1 succeeded at 78 (offset 2 lines).
Hunk #2 succeeded at 112 (offset 2 lines).
Hunk #3 succeeded at 233 (offset 6 lines).
Hunk #4 FAILED at 276.
Hunk #5 FAILED at 350.
2 out of 5 hunks FAILED -- saving rejects to file app-server-daemon/src/prepare_install.rs.rej
|
| failed |
checks.aarch64-darwin.pkgs-codex-acp
|
1m 34s |
codex-0.164.0:
applying patch /nix/store/yl1g5zgms31fd33ayqwzra3l9djcpkjm-daemon-nix-store.patch
patching file app-server-daemon/src/prepare_install.rs
Hunk #1 …
codex-0.164.0:
applying patch /nix/store/yl1g5zgms31fd33ayqwzra3l9djcpkjm-daemon-nix-store.patch
patching file app-server-daemon/src/prepare_install.rs
Hunk #1 succeeded at 78 (offset 2 lines).
Hunk #2 succeeded at 112 (offset 2 lines).
Hunk #3 succeeded at 233 (offset 6 lines).
Hunk #4 FAILED at 276.
Hunk #5 FAILED at 350.
2 out of 5 hunks FAILED -- saving rejects to file app-server-daemon/src/prepare_install.rs.rej
|
| failed |
checks.aarch64-darwin.pkgs-oh-my-codex
|
34s |
codex-0.164.0:
applying patch /nix/store/yl1g5zgms31fd33ayqwzra3l9djcpkjm-daemon-nix-store.patch
patching file app-server-daemon/src/prepare_install.rs
Hunk #1 …
codex-0.164.0:
applying patch /nix/store/yl1g5zgms31fd33ayqwzra3l9djcpkjm-daemon-nix-store.patch
patching file app-server-daemon/src/prepare_install.rs
Hunk #1 succeeded at 78 (offset 2 lines).
Hunk #2 succeeded at 112 (offset 2 lines).
Hunk #3 succeeded at 233 (offset 6 lines).
Hunk #4 FAILED at 276.
Hunk #5 FAILED at 350.
2 out of 5 hunks FAILED -- saving rejects to file app-server-daemon/src/prepare_install.rs.rej
|
| failed |
checks.aarch64-darwin.pkgs-t3code
|
49s |
codex-0.164.0:
applying patch /nix/store/yl1g5zgms31fd33ayqwzra3l9djcpkjm-daemon-nix-store.patch
patching file app-server-daemon/src/prepare_install.rs
Hunk #1 …
codex-0.164.0:
applying patch /nix/store/yl1g5zgms31fd33ayqwzra3l9djcpkjm-daemon-nix-store.patch
patching file app-server-daemon/src/prepare_install.rs
Hunk #1 succeeded at 78 (offset 2 lines).
Hunk #2 succeeded at 112 (offset 2 lines).
Hunk #3 succeeded at 233 (offset 6 lines).
Hunk #4 FAILED at 276.
Hunk #5 FAILED at 350.
2 out of 5 hunks FAILED -- saving rejects to file app-server-daemon/src/prepare_install.rs.rej
|
| failed |
checks.aarch64-darwin.pkgs-t3code-desktop
|
2m 5s |
codex-0.164.0:
applying patch /nix/store/yl1g5zgms31fd33ayqwzra3l9djcpkjm-daemon-nix-store.patch
patching file app-server-daemon/src/prepare_install.rs
Hunk #1 …
codex-0.164.0:
applying patch /nix/store/yl1g5zgms31fd33ayqwzra3l9djcpkjm-daemon-nix-store.patch
patching file app-server-daemon/src/prepare_install.rs
Hunk #1 succeeded at 78 (offset 2 lines).
Hunk #2 succeeded at 112 (offset 2 lines).
Hunk #3 succeeded at 233 (offset 6 lines).
Hunk #4 FAILED at 276.
Hunk #5 FAILED at 350.
2 out of 5 hunks FAILED -- saving rejects to file app-server-daemon/src/prepare_install.rs.rej
|
| failed |
checks.aarch64-linux.pkgs-codex
|
44s |
codex-0.164.0:
applying patch /nix/store/yl1g5zgms31fd33ayqwzra3l9djcpkjm-daemon-nix-store.patch
patching file app-server-daemon/src/prepare_install.rs
Hunk #1 …
codex-0.164.0:
applying patch /nix/store/yl1g5zgms31fd33ayqwzra3l9djcpkjm-daemon-nix-store.patch
patching file app-server-daemon/src/prepare_install.rs
Hunk #1 succeeded at 78 (offset 2 lines).
Hunk #2 succeeded at 112 (offset 2 lines).
Hunk #3 succeeded at 233 (offset 6 lines).
Hunk #4 FAILED at 276.
Hunk #5 FAILED at 350.
2 out of 5 hunks FAILED -- saving rejects to file app-server-daemon/src/prepare_install.rs.rej
|
| failed |
checks.aarch64-linux.pkgs-codex-acp
|
56s |
codex-0.164.0:
applying patch /nix/store/yl1g5zgms31fd33ayqwzra3l9djcpkjm-daemon-nix-store.patch
patching file app-server-daemon/src/prepare_install.rs
Hunk #1 …
codex-0.164.0:
applying patch /nix/store/yl1g5zgms31fd33ayqwzra3l9djcpkjm-daemon-nix-store.patch
patching file app-server-daemon/src/prepare_install.rs
Hunk #1 succeeded at 78 (offset 2 lines).
Hunk #2 succeeded at 112 (offset 2 lines).
Hunk #3 succeeded at 233 (offset 6 lines).
Hunk #4 FAILED at 276.
Hunk #5 FAILED at 350.
2 out of 5 hunks FAILED -- saving rejects to file app-server-daemon/src/prepare_install.rs.rej
|
| failed |
checks.aarch64-linux.pkgs-oh-my-codex
|
50s |
codex-0.164.0:
applying patch /nix/store/yl1g5zgms31fd33ayqwzra3l9djcpkjm-daemon-nix-store.patch
patching file app-server-daemon/src/prepare_install.rs
Hunk #1 …
codex-0.164.0:
applying patch /nix/store/yl1g5zgms31fd33ayqwzra3l9djcpkjm-daemon-nix-store.patch
patching file app-server-daemon/src/prepare_install.rs
Hunk #1 succeeded at 78 (offset 2 lines).
Hunk #2 succeeded at 112 (offset 2 lines).
Hunk #3 succeeded at 233 (offset 6 lines).
Hunk #4 FAILED at 276.
Hunk #5 FAILED at 350.
2 out of 5 hunks FAILED -- saving rejects to file app-server-daemon/src/prepare_install.rs.rej
|
| failed |
checks.aarch64-linux.pkgs-t3code
|
30s |
codex-0.164.0:
applying patch /nix/store/yl1g5zgms31fd33ayqwzra3l9djcpkjm-daemon-nix-store.patch
patching file app-server-daemon/src/prepare_install.rs
Hunk #1 …
codex-0.164.0:
applying patch /nix/store/yl1g5zgms31fd33ayqwzra3l9djcpkjm-daemon-nix-store.patch
patching file app-server-daemon/src/prepare_install.rs
Hunk #1 succeeded at 78 (offset 2 lines).
Hunk #2 succeeded at 112 (offset 2 lines).
Hunk #3 succeeded at 233 (offset 6 lines).
Hunk #4 FAILED at 276.
Hunk #5 FAILED at 350.
2 out of 5 hunks FAILED -- saving rejects to file app-server-daemon/src/prepare_install.rs.rej
|
| failed |
checks.aarch64-linux.pkgs-t3code-desktop
|
25s |
codex-0.164.0:
applying patch /nix/store/yl1g5zgms31fd33ayqwzra3l9djcpkjm-daemon-nix-store.patch
patching file app-server-daemon/src/prepare_install.rs
Hunk #1 …
codex-0.164.0:
applying patch /nix/store/yl1g5zgms31fd33ayqwzra3l9djcpkjm-daemon-nix-store.patch
patching file app-server-daemon/src/prepare_install.rs
Hunk #1 succeeded at 78 (offset 2 lines).
Hunk #2 succeeded at 112 (offset 2 lines).
Hunk #3 succeeded at 233 (offset 6 lines).
Hunk #4 FAILED at 276.
Hunk #5 FAILED at 350.
2 out of 5 hunks FAILED -- saving rejects to file app-server-daemon/src/prepare_install.rs.rej
|
| failed |
checks.aarch64-linux.treefmt
|
15s |
treefmt-check:
elastic-arm-04535f05: building 4g4d9mdav7bvzvss8zhvrvy6h8i6lwvw-treefmt-check.drv
traversed 555 files
emitted 374 files for processing
formatted …
treefmt-check:
elastic-arm-04535f05: building 4g4d9mdav7bvzvss8zhvrvy6h8i6lwvw-treefmt-check.drv
traversed 555 files
emitted 374 files for processing
formatted 374 files (0 changed) in 3.828s
|
| failed |
checks.x86_64-linux.pkgs-codex
|
3m 2s |
setup:
/nix/store/8yv4f7k9phr5nri7z1sb3pm4f40q5wlb-openssl-3.5.8-bin
/nix/store/hc6mxys4iyawmwiyaixkcl9izjrqmr2q-openssl-3.5.8-dev
/nix/store/wpw9kk7qfndb …
setup:
/nix/store/8yv4f7k9phr5nri7z1sb3pm4f40q5wlb-openssl-3.5.8-bin
/nix/store/hc6mxys4iyawmwiyaixkcl9izjrqmr2q-openssl-3.5.8-dev
/nix/store/wpw9kk7qfndblw2017byjydbqq32sj01-pkg-config-0.29.2
/nix/store/b9izmrfjp0qnnyahdwwrzdwi87s1h179-pkg-config-wrapper-0.29.2
/nix/store/10pdz4z8bfg35ysd7aqrhnzdkijpmmwb-source
/nix/store/z9frqkiiaj50jq1v099n5ndp1zykp7cz-src_binding-152.2.0.rs
warning: ignoring the client-specified setting 'store', because it is a restricted setting and you are not a trusted user
error: dependency 'i7ycw5kc4j3ki9sy6lsp53q3hy4dmc7s-codex-0.164.0.drv' failed
|
| failed |
checks.x86_64-linux.pkgs-codex-acp
|
3m 2s |
setup:
don't know how to build these paths:
/nix/store/acyp1jnvb4ycj52jxg5lw2k2vnr09hbd-check-codex-acp.drv
warning: ignoring the client-specified setting 'st …
setup:
don't know how to build these paths:
/nix/store/acyp1jnvb4ycj52jxg5lw2k2vnr09hbd-check-codex-acp.drv
warning: ignoring the client-specified setting 'store', because it is a restricted setting and you are not a trusted user
error: dependency 'rjz7k4cl3kixpafin6nshp0sk4w5shbm-codex-acp-2.2.2.drv' failed
|
| failed |
checks.x86_64-linux.pkgs-oh-my-codex
|
2m 37s |
setup:
don't know how to build these paths:
/nix/store/p5rrlgz1ksrg7my9g1ccyj2grxvznjnw-check-oh-my-codex.drv
warning: ignoring the client-specified setting ' …
setup:
don't know how to build these paths:
/nix/store/p5rrlgz1ksrg7my9g1ccyj2grxvznjnw-check-oh-my-codex.drv
warning: ignoring the client-specified setting 'store', because it is a restricted setting and you are not a trusted user
error: dependency '5pf0dq1xnqn5v4p2mbhy7jhj3xv8dfjh-oh-my-codex-0.21.33.drv' failed
|
| failed |
checks.x86_64-linux.pkgs-t3code
|
2m 37s |
setup:
don't know how to build these paths:
/nix/store/bravwzkrqjbx5w8zaxcriksyd0rgvl1p-check-t3code.drv
warning: ignoring the client-specified setting 'store …
setup:
don't know how to build these paths:
/nix/store/bravwzkrqjbx5w8zaxcriksyd0rgvl1p-check-t3code.drv
warning: ignoring the client-specified setting 'store', because it is a restricted setting and you are not a trusted user
error: dependency 's7y9b92k0qpz9qaw2c39cd9jhxwckrzr-t3code-0.1.2.drv' failed
|
| failed |
checks.x86_64-linux.pkgs-t3code-desktop
|
2m 37s |
setup:
don't know how to build these paths:
/nix/store/s2s5207j55p4bjhwpbf1iysvffyk07fl-check-t3code-desktop.drv
warning: ignoring the client-specified settin …
setup:
don't know how to build these paths:
/nix/store/s2s5207j55p4bjhwpbf1iysvffyk07fl-check-t3code-desktop.drv
warning: ignoring the client-specified setting 'store', because it is a restricted setting and you are not a trusted user
error: dependency 'rvlcqr44hsh7s4gcpx8lvjkibl9m315m-t3code-desktop.drv' failed
|