setup
checks.aarch64-linux.pkgs-t3code
· build #8948
· raw
1these 3 derivations will be built:2 /nix/store/xnskb8vv56g9igl6q9wmhhh089i2id80-codex-0.164.0.drv3 /nix/store/lpzpxgm7mwmm1aka7nc7sz0p89wvia3g-t3code-0.1.2.drv4 /nix/store/6g79dwb6x1fv9qvjm67r4whbwwjlbnxi-check-t3code.drv5error: build of '/nix/store/xnskb8vv56g9igl6q9wmhhh089i2id80-codex-0.164.0.drv' on 'grpc://farm.numtide.com:50051?client-cert=/run/secrets/vars/per-machine/bld1/nix-farm-ci/crt&client-key=/run/secrets/vars/per-machine/bld1/nix-farm-ci/key&connect-timeout=22&system=aarch64-linux' failed: Cannot build '/nix/store/xnskb8vv56g9igl6q9wmhhh089i2id80-codex-0.164.0.drv'.6 Reason: builder failed with exit code 1.7 Output paths:8 /nix/store/6haz05qcsyyzygmiyjfya0ji5n85w2c9-codex-0.164.09 Last 15 log lines:10 > Using versionCheckHook11 > Running phase: unpackPhase12 > unpacking source archive /nix/store/10pdz4z8bfg35ysd7aqrhnzdkijpmmwb-source13 > source root is source/codex-rs14 > Executing cargoSetupPostUnpackHook15 > Finished cargoSetupPostUnpackHook16 > Running phase: patchPhase17 > applying patch /nix/store/yl1g5zgms31fd33ayqwzra3l9djcpkjm-daemon-nix-store.patch18 > patching file app-server-daemon/src/prepare_install.rs19 > Hunk #1 succeeded at 78 (offset 2 lines).20 > Hunk #2 succeeded at 112 (offset 2 lines).21 > Hunk #3 succeeded at 233 (offset 6 lines).22 > Hunk #4 FAILED at 276.23 > Hunk #5 FAILED at 350.24 > 2 out of 5 hunks FAILED -- saving rejects to file app-server-daemon/src/prepare_install.rs.rej25 For full logs, run:26 nix log /nix/store/xnskb8vv56g9igl6q9wmhhh089i2id80-codex-0.164.0.drv27error: Cannot build '/nix/store/xnskb8vv56g9igl6q9wmhhh089i2id80-codex-0.164.0.drv'.28 Reason: builder failed with exit code 1.29 Output paths:30 /nix/store/6haz05qcsyyzygmiyjfya0ji5n85w2c9-codex-0.164.031error: Cannot build '/nix/store/lpzpxgm7mwmm1aka7nc7sz0p89wvia3g-t3code-0.1.2.drv'.32 Reason: 1 dependency failed.33 Output paths:34 /nix/store/g1naqpdrzicmx031qi44ii9ji5l0sqg1-t3code-0.1.235 /nix/store/lil07f1pf70xhrg0lx4bdnj1wgy6csz6-t3code-0.1.2-desktop36error: Cannot build '/nix/store/6g79dwb6x1fv9qvjm67r4whbwwjlbnxi-check-t3code.drv'.37 Reason: 1 dependency failed.38 Output paths:39 /nix/store/6b5vsivnsmr539ll6j6gfk01gs3nmvk5-check-t3code