setup
checks.aarch64-linux.pkgs-codex
· build #8948
· raw
1these 2 derivations will be built:2 /nix/store/xnskb8vv56g9igl6q9wmhhh089i2id80-codex-0.164.0.drv3 /nix/store/jqw4v3pw90v04wszyrh2hv4haga1mhxb-check-codex.drv4error: build of '/nix/store/xnskb8vv56g9igl6q9wmhhh089i2id80-codex-0.164.0.drv' on 'grpc://farm.numtide.com:50051?client-cert=/run/secrets/vars/per-machine/bld1/nix-farm-ci/crt&client-key=/run/secrets/vars/per-machine/bld1/nix-farm-ci/key&connect-timeout=21&system=aarch64-linux' failed: Cannot build '/nix/store/xnskb8vv56g9igl6q9wmhhh089i2id80-codex-0.164.0.drv'.5 Reason: builder failed with exit code 1.6 Output paths:7 /nix/store/6haz05qcsyyzygmiyjfya0ji5n85w2c9-codex-0.164.08 Last 15 log lines:9 > Using versionCheckHook10 > Running phase: unpackPhase11 > unpacking source archive /nix/store/10pdz4z8bfg35ysd7aqrhnzdkijpmmwb-source12 > source root is source/codex-rs13 > Executing cargoSetupPostUnpackHook14 > Finished cargoSetupPostUnpackHook15 > Running phase: patchPhase16 > applying patch /nix/store/yl1g5zgms31fd33ayqwzra3l9djcpkjm-daemon-nix-store.patch17 > patching file app-server-daemon/src/prepare_install.rs18 > Hunk #1 succeeded at 78 (offset 2 lines).19 > Hunk #2 succeeded at 112 (offset 2 lines).20 > Hunk #3 succeeded at 233 (offset 6 lines).21 > Hunk #4 FAILED at 276.22 > Hunk #5 FAILED at 350.23 > 2 out of 5 hunks FAILED -- saving rejects to file app-server-daemon/src/prepare_install.rs.rej24 For full logs, run:25 nix log /nix/store/xnskb8vv56g9igl6q9wmhhh089i2id80-codex-0.164.0.drv26error: Cannot build '/nix/store/xnskb8vv56g9igl6q9wmhhh089i2id80-codex-0.164.0.drv'.27 Reason: builder failed with exit code 1.28 Output paths:29 /nix/store/6haz05qcsyyzygmiyjfya0ji5n85w2c9-codex-0.164.030error: Cannot build '/nix/store/jqw4v3pw90v04wszyrh2hv4haga1mhxb-check-codex.drv'.31 Reason: 1 dependency failed.32 Output paths:33 /nix/store/n4gyggwkddbkircv07smfhfv63zzwgjx-check-codex