setup
checks.aarch64-darwin.pkgs-t3code
· build #8948
· raw
1these 3 derivations will be built:2 /nix/store/ns7rcdbjq9nqiqi6fr06k0bxkl8g58ym-codex-0.164.0.drv3 /nix/store/x6p7jlgcjl9xipagsg27b8746g8ni30a-t3code-0.1.2.drv4 /nix/store/yr798spk3m5b3jzgrhg0wqg7y5kbls7m-check-t3code.drv5error: build of '/nix/store/ns7rcdbjq9nqiqi6fr06k0bxkl8g58ym-codex-0.164.0.drv' on 'grpc://farm.numtide.com:50051?client-cert=/run/secrets/vars/per-machine/bld1/nix-farm-ci/crt&client-key=/run/secrets/vars/per-machine/bld1/nix-farm-ci/key&connect-timeout=21&system=aarch64-darwin' failed: Cannot build '/nix/store/ns7rcdbjq9nqiqi6fr06k0bxkl8g58ym-codex-0.164.0.drv'.6 Reason: builder failed with exit code 1.7 Output paths:8 /nix/store/isi3zxd82p1akgz3f00kaavrcfj0z332-codex-0.164.09 Last 15 log lines:10 > Using versionCheckHook11 > Running phase: unpackPhase12 > unpacking source archive /nix/store/10pdz4z8bfg35ysd7aqrhnzdkijpmmwb-source13 > source root is source/codex-rs14 > Executing cargoSetupPostUnpackHook15 > Finished cargoSetupPostUnpackHook16 > Running phase: patchPhase17 > applying patch /nix/store/yl1g5zgms31fd33ayqwzra3l9djcpkjm-daemon-nix-store.patch18 > patching file app-server-daemon/src/prepare_install.rs19 > Hunk #1 succeeded at 78 (offset 2 lines).20 > Hunk #2 succeeded at 112 (offset 2 lines).21 > Hunk #3 succeeded at 233 (offset 6 lines).22 > Hunk #4 FAILED at 276.23 > Hunk #5 FAILED at 350.24 > 2 out of 5 hunks FAILED -- saving rejects to file app-server-daemon/src/prepare_install.rs.rej25 For full logs, run:26 nix log /nix/store/ns7rcdbjq9nqiqi6fr06k0bxkl8g58ym-codex-0.164.0.drv27error: Cannot build '/nix/store/ns7rcdbjq9nqiqi6fr06k0bxkl8g58ym-codex-0.164.0.drv'.28 Reason: builder failed with exit code 1.29 Output paths:30 /nix/store/isi3zxd82p1akgz3f00kaavrcfj0z332-codex-0.164.031error: Cannot build '/nix/store/x6p7jlgcjl9xipagsg27b8746g8ni30a-t3code-0.1.2.drv'.32 Reason: 1 dependency failed.33 Output paths:34 /nix/store/p26xzf7xsiaz0xqv0w9i467pxf5da0m3-t3code-0.1.235 /nix/store/x52pfwzwfvxzgil7c47jdbf1b0hry61b-t3code-0.1.2-desktop36error: Cannot build '/nix/store/yr798spk3m5b3jzgrhg0wqg7y5kbls7m-check-t3code.drv'.37 Reason: 1 dependency failed.38 Output paths:39 /nix/store/g8nv2ljbn0kyqxb0gziqfb81ajidvnjl-check-t3code