nixbot

builds

failed mcptoon-0.8.25 checks.x86_64-linux.pkgs-mcptoon · build #8431 · raw

1Sourcing python-remove-tests-dir-hook2Sourcing python-catch-conflicts-hook.sh3Sourcing python-remove-bin-bytecode-hook.sh4Sourcing pypa-build-hook5Using pypaBuildPhase6Sourcing python-runtime-deps-check-hook7Using pythonRuntimeDepsCheckHook8Sourcing pypa-install-hook9Using pypaInstallPhase10Sourcing python-imports-check-hook.sh11Using pythonImportsCheckPhase12Sourcing python-namespaces-hook13Sourcing python-catch-conflicts-hook.sh14Sourcing pytest-check-hook15Using pytestCheckPhase
unpackPhase
16unpacking source archive /nix/store/laz7gp7b4q0jjzb9mpx5wdri6pl0ph1n-source17source root is source18setting SOURCE_DATE_EPOCH to timestamp 315619200 of file "source/tests/test_xdg.py"
configurePhase
19no configure script, doing nothing
buildPhase
20Executing pypaBuildPhase21Creating a wheel...22pypa build flags: --no-isolation --outdir dist/ --wheel23* Getting build dependencies for wheel...24/nix/store/fiwq290ghcn0zx89nkqvjfi5a0g5nd13-python3.14-setuptools-83.0.0/lib/python3.14/site-packages/setuptools/config/_apply_pyprojecttoml.py:82: SetuptoolsDeprecationWarning: `project.license` as a TOML table is deprecated25!!2627 ********************************************************************************28 Please use a simple string containing a SPDX expression for `project.license`. You can also use `project.license-files`. (Both options available on setuptools>=77.0.0).2930 By 2027-Feb-18, you need to update your project and remove deprecated calls31 or your builds will no longer be supported.3233 See https://packaging.python.org/en/latest/guides/writing-pyproject-toml/#license for details.34 ********************************************************************************3536!!37 corresp(dist, value, root_dir)38/nix/store/fiwq290ghcn0zx89nkqvjfi5a0g5nd13-python3.14-setuptools-83.0.0/lib/python3.14/site-packages/setuptools/config/_apply_pyprojecttoml.py:61: SetuptoolsDeprecationWarning: License classifiers are deprecated.39!!4041 ********************************************************************************42 Please consider removing the following classifiers in favor of a SPDX license expression:4344 License :: OSI Approved :: Apache Software License4546 See https://packaging.python.org/en/latest/guides/writing-pyproject-toml/#license for details.47 ********************************************************************************4849!!50 dist._finalize_license_expression()51/nix/store/fiwq290ghcn0zx89nkqvjfi5a0g5nd13-python3.14-setuptools-83.0.0/lib/python3.14/site-packages/setuptools/dist.py:765: SetuptoolsDeprecationWarning: License classifiers are deprecated.52!!5354 ********************************************************************************55 Please consider removing the following classifiers in favor of a SPDX license expression:5657 License :: OSI Approved :: Apache Software License5859 See https://packaging.python.org/en/latest/guides/writing-pyproject-toml/#license for details.60 ********************************************************************************6162!!63 self._finalize_license_expression()64running egg_info65creating src/mcptoon.egg-info66writing src/mcptoon.egg-info/PKG-INFO67writing dependency_links to src/mcptoon.egg-info/dependency_links.txt68writing entry points to src/mcptoon.egg-info/entry_points.txt69writing requirements to src/mcptoon.egg-info/requires.txt70writing top-level names to src/mcptoon.egg-info/top_level.txt71writing manifest file 'src/mcptoon.egg-info/SOURCES.txt'72reading manifest file 'src/mcptoon.egg-info/SOURCES.txt'73adding license file 'LICENSE'74adding license file 'NOTICE'75writing manifest file 'src/mcptoon.egg-info/SOURCES.txt'76* Building wheel...77/nix/store/fiwq290ghcn0zx89nkqvjfi5a0g5nd13-python3.14-setuptools-83.0.0/lib/python3.14/site-packages/setuptools/config/_apply_pyprojecttoml.py:82: SetuptoolsDeprecationWarning: `project.license` as a TOML table is deprecated78!!7980 ********************************************************************************81 Please use a simple string containing a SPDX expression for `project.license`. You can also use `project.license-files`. (Both options available on setuptools>=77.0.0).8283 By 2027-Feb-18, you need to update your project and remove deprecated calls84 or your builds will no longer be supported.8586 See https://packaging.python.org/en/latest/guides/writing-pyproject-toml/#license for details.87 ********************************************************************************8889!!90 corresp(dist, value, root_dir)91/nix/store/fiwq290ghcn0zx89nkqvjfi5a0g5nd13-python3.14-setuptools-83.0.0/lib/python3.14/site-packages/setuptools/config/_apply_pyprojecttoml.py:61: SetuptoolsDeprecationWarning: License classifiers are deprecated.92!!9394 ********************************************************************************95 Please consider removing the following classifiers in favor of a SPDX license expression:9697 License :: OSI Approved :: Apache Software License9899 See https://packaging.python.org/en/latest/guides/writing-pyproject-toml/#license for details.100 ********************************************************************************101102!!103 dist._finalize_license_expression()104/nix/store/fiwq290ghcn0zx89nkqvjfi5a0g5nd13-python3.14-setuptools-83.0.0/lib/python3.14/site-packages/setuptools/dist.py:765: SetuptoolsDeprecationWarning: License classifiers are deprecated.105!!106107 ********************************************************************************108 Please consider removing the following classifiers in favor of a SPDX license expression:109110 License :: OSI Approved :: Apache Software License111112 See https://packaging.python.org/en/latest/guides/writing-pyproject-toml/#license for details.113 ********************************************************************************114115!!116 self._finalize_license_expression()117running bdist_wheel118running build119running build_py120creating build/lib/mcptoon121copying src/mcptoon/health.py -> build/lib/mcptoon122copying src/mcptoon/session_log.py -> build/lib/mcptoon123copying src/mcptoon/serve.py -> build/lib/mcptoon124copying src/mcptoon/packs.py -> build/lib/mcptoon125copying src/mcptoon/compressor.py -> build/lib/mcptoon126copying src/mcptoon/update.py -> build/lib/mcptoon127copying src/mcptoon/footer.py -> build/lib/mcptoon128copying src/mcptoon/usage.py -> build/lib/mcptoon129copying src/mcptoon/report.py -> build/lib/mcptoon130copying src/mcptoon/savings.py -> build/lib/mcptoon131copying src/mcptoon/ccr.py -> build/lib/mcptoon132copying src/mcptoon/mode.py -> build/lib/mcptoon133copying src/mcptoon/config.py -> build/lib/mcptoon134copying src/mcptoon/__init__.py -> build/lib/mcptoon135copying src/mcptoon/router.py -> build/lib/mcptoon136copying src/mcptoon/headers.py -> build/lib/mcptoon137copying src/mcptoon/floodguard.py -> build/lib/mcptoon138copying src/mcptoon/cli.py -> build/lib/mcptoon139copying src/mcptoon/manifest.py -> build/lib/mcptoon140copying src/mcptoon/watch.py -> build/lib/mcptoon141copying src/mcptoon/sync.py -> build/lib/mcptoon142copying src/mcptoon/demo_server.py -> build/lib/mcptoon143copying src/mcptoon/bench.py -> build/lib/mcptoon144copying src/mcptoon/cache.py -> build/lib/mcptoon145copying src/mcptoon/exec_sandbox.py -> build/lib/mcptoon146copying src/mcptoon/native_tools.py -> build/lib/mcptoon147copying src/mcptoon/skills.py -> build/lib/mcptoon148copying src/mcptoon/client.py -> build/lib/mcptoon149copying src/mcptoon/toon_vendored.py -> build/lib/mcptoon150copying src/mcptoon/bench_tokens.py -> build/lib/mcptoon151copying src/mcptoon/discover.py -> build/lib/mcptoon152copying src/mcptoon/docs.py -> build/lib/mcptoon153copying src/mcptoon/schema_simplifier.py -> build/lib/mcptoon154copying src/mcptoon/installer.py -> build/lib/mcptoon155copying src/mcptoon/kb.py -> build/lib/mcptoon156copying src/mcptoon/output.py -> build/lib/mcptoon157copying src/mcptoon/plugin.py -> build/lib/mcptoon158copying src/mcptoon/welcome.py -> build/lib/mcptoon159copying src/mcptoon/__main__.py -> build/lib/mcptoon160copying src/mcptoon/demo.py -> build/lib/mcptoon161copying src/mcptoon/errors.py -> build/lib/mcptoon162creating build/lib/mcptoon/_toon163copying src/mcptoon/_toon/encoders.py -> build/lib/mcptoon/_toon164copying src/mcptoon/_toon/primitives.py -> build/lib/mcptoon/_toon165copying src/mcptoon/_toon/decoder.py -> build/lib/mcptoon/_toon166copying src/mcptoon/_toon/constants.py -> build/lib/mcptoon/_toon167copying src/mcptoon/_toon/normalize.py -> build/lib/mcptoon/_toon168copying src/mcptoon/_toon/types.py -> build/lib/mcptoon/_toon169copying src/mcptoon/_toon/writer.py -> build/lib/mcptoon/_toon170copying src/mcptoon/_toon/encoder.py -> build/lib/mcptoon/_toon171copying src/mcptoon/_toon/__init__.py -> build/lib/mcptoon/_toon172running egg_info173writing src/mcptoon.egg-info/PKG-INFO174writing dependency_links to src/mcptoon.egg-info/dependency_links.txt175writing entry points to src/mcptoon.egg-info/entry_points.txt176writing requirements to src/mcptoon.egg-info/requires.txt177writing top-level names to src/mcptoon.egg-info/top_level.txt178reading manifest file 'src/mcptoon.egg-info/SOURCES.txt'179adding license file 'LICENSE'180adding license file 'NOTICE'181writing manifest file 'src/mcptoon.egg-info/SOURCES.txt'182copying src/mcptoon/packs.json -> build/lib/mcptoon183creating build/lib/mcptoon/skill184copying src/mcptoon/skill/SKILL.md -> build/lib/mcptoon/skill185installing to build/bdist.linux-x86_64/wheel186running install187running install_lib188creating build/bdist.linux-x86_64/wheel189creating build/bdist.linux-x86_64/wheel/mcptoon190copying build/lib/mcptoon/compressor.py -> build/bdist.linux-x86_64/wheel/./mcptoon191copying build/lib/mcptoon/client.py -> build/bdist.linux-x86_64/wheel/./mcptoon192copying build/lib/mcptoon/skills.py -> build/bdist.linux-x86_64/wheel/./mcptoon193copying build/lib/mcptoon/savings.py -> build/bdist.linux-x86_64/wheel/./mcptoon194copying build/lib/mcptoon/session_log.py -> build/bdist.linux-x86_64/wheel/./mcptoon195copying build/lib/mcptoon/kb.py -> build/bdist.linux-x86_64/wheel/./mcptoon196copying build/lib/mcptoon/headers.py -> build/bdist.linux-x86_64/wheel/./mcptoon197copying build/lib/mcptoon/schema_simplifier.py -> build/bdist.linux-x86_64/wheel/./mcptoon198copying build/lib/mcptoon/mode.py -> build/bdist.linux-x86_64/wheel/./mcptoon199copying build/lib/mcptoon/errors.py -> build/bdist.linux-x86_64/wheel/./mcptoon200copying build/lib/mcptoon/packs.py -> build/bdist.linux-x86_64/wheel/./mcptoon201copying build/lib/mcptoon/serve.py -> build/bdist.linux-x86_64/wheel/./mcptoon202copying build/lib/mcptoon/packs.json -> build/bdist.linux-x86_64/wheel/./mcptoon203copying build/lib/mcptoon/__init__.py -> build/bdist.linux-x86_64/wheel/./mcptoon204copying build/lib/mcptoon/plugin.py -> build/bdist.linux-x86_64/wheel/./mcptoon205copying build/lib/mcptoon/output.py -> build/bdist.linux-x86_64/wheel/./mcptoon206copying build/lib/mcptoon/usage.py -> build/bdist.linux-x86_64/wheel/./mcptoon207copying build/lib/mcptoon/installer.py -> build/bdist.linux-x86_64/wheel/./mcptoon208copying build/lib/mcptoon/ccr.py -> build/bdist.linux-x86_64/wheel/./mcptoon209copying build/lib/mcptoon/manifest.py -> build/bdist.linux-x86_64/wheel/./mcptoon210copying build/lib/mcptoon/demo_server.py -> build/bdist.linux-x86_64/wheel/./mcptoon211copying build/lib/mcptoon/welcome.py -> build/bdist.linux-x86_64/wheel/./mcptoon212copying build/lib/mcptoon/toon_vendored.py -> build/bdist.linux-x86_64/wheel/./mcptoon213copying build/lib/mcptoon/footer.py -> build/bdist.linux-x86_64/wheel/./mcptoon214copying build/lib/mcptoon/floodguard.py -> build/bdist.linux-x86_64/wheel/./mcptoon215copying build/lib/mcptoon/update.py -> build/bdist.linux-x86_64/wheel/./mcptoon216copying build/lib/mcptoon/docs.py -> build/bdist.linux-x86_64/wheel/./mcptoon217creating build/bdist.linux-x86_64/wheel/mcptoon/skill218copying build/lib/mcptoon/skill/SKILL.md -> build/bdist.linux-x86_64/wheel/./mcptoon/skill219creating build/bdist.linux-x86_64/wheel/mcptoon/_toon220copying build/lib/mcptoon/_toon/encoder.py -> build/bdist.linux-x86_64/wheel/./mcptoon/_toon221copying build/lib/mcptoon/_toon/encoders.py -> build/bdist.linux-x86_64/wheel/./mcptoon/_toon222copying build/lib/mcptoon/_toon/__init__.py -> build/bdist.linux-x86_64/wheel/./mcptoon/_toon223copying build/lib/mcptoon/_toon/types.py -> build/bdist.linux-x86_64/wheel/./mcptoon/_toon224copying build/lib/mcptoon/_toon/normalize.py -> build/bdist.linux-x86_64/wheel/./mcptoon/_toon225copying build/lib/mcptoon/_toon/decoder.py -> build/bdist.linux-x86_64/wheel/./mcptoon/_toon226copying build/lib/mcptoon/_toon/constants.py -> build/bdist.linux-x86_64/wheel/./mcptoon/_toon227copying build/lib/mcptoon/_toon/writer.py -> build/bdist.linux-x86_64/wheel/./mcptoon/_toon228copying build/lib/mcptoon/_toon/primitives.py -> build/bdist.linux-x86_64/wheel/./mcptoon/_toon229copying build/lib/mcptoon/demo.py -> build/bdist.linux-x86_64/wheel/./mcptoon230copying build/lib/mcptoon/cli.py -> build/bdist.linux-x86_64/wheel/./mcptoon231copying build/lib/mcptoon/health.py -> build/bdist.linux-x86_64/wheel/./mcptoon232copying build/lib/mcptoon/router.py -> build/bdist.linux-x86_64/wheel/./mcptoon233copying build/lib/mcptoon/bench.py -> build/bdist.linux-x86_64/wheel/./mcptoon234copying build/lib/mcptoon/sync.py -> build/bdist.linux-x86_64/wheel/./mcptoon235copying build/lib/mcptoon/bench_tokens.py -> build/bdist.linux-x86_64/wheel/./mcptoon236copying build/lib/mcptoon/watch.py -> build/bdist.linux-x86_64/wheel/./mcptoon237copying build/lib/mcptoon/discover.py -> build/bdist.linux-x86_64/wheel/./mcptoon238copying build/lib/mcptoon/config.py -> build/bdist.linux-x86_64/wheel/./mcptoon239copying build/lib/mcptoon/native_tools.py -> build/bdist.linux-x86_64/wheel/./mcptoon240copying build/lib/mcptoon/exec_sandbox.py -> build/bdist.linux-x86_64/wheel/./mcptoon241copying build/lib/mcptoon/report.py -> build/bdist.linux-x86_64/wheel/./mcptoon242copying build/lib/mcptoon/__main__.py -> build/bdist.linux-x86_64/wheel/./mcptoon243copying build/lib/mcptoon/cache.py -> build/bdist.linux-x86_64/wheel/./mcptoon244running install_egg_info245Copying src/mcptoon.egg-info to build/bdist.linux-x86_64/wheel/./mcptoon-0.8.25-py3.14.egg-info246running install_scripts247creating build/bdist.linux-x86_64/wheel/mcptoon-0.8.25.dist-info/WHEEL248creating '/build/source/dist/.tmp-qo622xm_/mcptoon-0.8.25-py3-none-any.whl' and adding 'build/bdist.linux-x86_64/wheel' to it249adding 'mcptoon/__init__.py'250adding 'mcptoon/__main__.py'251adding 'mcptoon/bench.py'252adding 'mcptoon/bench_tokens.py'253adding 'mcptoon/cache.py'254adding 'mcptoon/ccr.py'255adding 'mcptoon/cli.py'256adding 'mcptoon/client.py'257adding 'mcptoon/compressor.py'258adding 'mcptoon/config.py'259adding 'mcptoon/demo.py'260adding 'mcptoon/demo_server.py'261adding 'mcptoon/discover.py'262adding 'mcptoon/docs.py'263adding 'mcptoon/errors.py'264adding 'mcptoon/exec_sandbox.py'265adding 'mcptoon/floodguard.py'266adding 'mcptoon/footer.py'267adding 'mcptoon/headers.py'268adding 'mcptoon/health.py'269adding 'mcptoon/installer.py'270adding 'mcptoon/kb.py'271adding 'mcptoon/manifest.py'272adding 'mcptoon/mode.py'273adding 'mcptoon/native_tools.py'274adding 'mcptoon/output.py'275adding 'mcptoon/packs.json'276adding 'mcptoon/packs.py'277adding 'mcptoon/plugin.py'278adding 'mcptoon/report.py'279adding 'mcptoon/router.py'280adding 'mcptoon/savings.py'281adding 'mcptoon/schema_simplifier.py'282adding 'mcptoon/serve.py'283adding 'mcptoon/session_log.py'284adding 'mcptoon/skills.py'285adding 'mcptoon/sync.py'286adding 'mcptoon/toon_vendored.py'287adding 'mcptoon/update.py'288adding 'mcptoon/usage.py'289adding 'mcptoon/watch.py'290adding 'mcptoon/welcome.py'291adding 'mcptoon/_toon/__init__.py'292adding 'mcptoon/_toon/constants.py'293adding 'mcptoon/_toon/decoder.py'294adding 'mcptoon/_toon/encoder.py'295adding 'mcptoon/_toon/encoders.py'296adding 'mcptoon/_toon/normalize.py'297adding 'mcptoon/_toon/primitives.py'298adding 'mcptoon/_toon/types.py'299adding 'mcptoon/_toon/writer.py'300adding 'mcptoon/skill/SKILL.md'301adding 'mcptoon-0.8.25.dist-info/licenses/LICENSE'302adding 'mcptoon-0.8.25.dist-info/licenses/NOTICE'303adding 'mcptoon-0.8.25.dist-info/METADATA'304adding 'mcptoon-0.8.25.dist-info/WHEEL'305adding 'mcptoon-0.8.25.dist-info/entry_points.txt'306adding 'mcptoon-0.8.25.dist-info/top_level.txt'307adding 'mcptoon-0.8.25.dist-info/RECORD'308removing build/bdist.linux-x86_64/wheel309Successfully built mcptoon-0.8.25-py3-none-any.whl310Finished creating a wheel...311Finished executing pypaBuildPhase
pythonRuntimeDepsCheckHook
312Executing pythonRuntimeDepsCheck313Checking runtime dependencies for mcptoon-0.8.25-py3-none-any.whl314Finished executing pythonRuntimeDepsCheck
installPhase
315Executing pypaInstallPhase316Successfully installed mcptoon-0.8.25-py3-none-any.whl317Finished executing pypaInstallPhase
pythonOutputDistPhase
318Executing pythonOutputDistPhase319Finished executing pythonOutputDistPhase
fixupPhase
320shrinking RPATHs of ELF executables and libraries in /nix/store/7gn3k31mgbwdwf1q3y858vihljh9vsnw-mcptoon-0.8.25321checking for references to /build/ in /nix/store/7gn3k31mgbwdwf1q3y858vihljh9vsnw-mcptoon-0.8.25...322patching script interpreter paths in /nix/store/7gn3k31mgbwdwf1q3y858vihljh9vsnw-mcptoon-0.8.25323stripping (with command strip and flags -S -p) in /nix/store/7gn3k31mgbwdwf1q3y858vihljh9vsnw-mcptoon-0.8.25/lib /nix/store/7gn3k31mgbwdwf1q3y858vihljh9vsnw-mcptoon-0.8.25/bin324shrinking RPATHs of ELF executables and libraries in /nix/store/bpm3hyk1pa44xcjpfbli1j44qiy9swp3-mcptoon-0.8.25-dist325checking for references to /build/ in /nix/store/bpm3hyk1pa44xcjpfbli1j44qiy9swp3-mcptoon-0.8.25-dist...326patching script interpreter paths in /nix/store/bpm3hyk1pa44xcjpfbli1j44qiy9swp3-mcptoon-0.8.25-dist327Rewriting #!/nix/store/lb41b0anx1f98y9y5s9mdv97gjgsq740-python3-3.14.7/bin/python3.14 to #!/nix/store/lb41b0anx1f98y9y5s9mdv97gjgsq740-python3-3.14.7328wrapping `/nix/store/7gn3k31mgbwdwf1q3y858vihljh9vsnw-mcptoon-0.8.25/bin/mcptoon'...329Executing pythonRemoveTestsDir330Finished executing pythonRemoveTestsDir
installCheckPhase
331no Makefile or custom installCheckPhase, doing nothing
pythonImportsCheckPhase
332Executing pythonImportsCheckPhase333Check whether the following modules can be imported: mcptoon
pytestCheckPhase
334Executing pytestCheckPhase335pytest flags: -m pytest -k not\ \(test_search_registry_returns_list\)\ and\ not\ \(test_search_smithery_returns_list\)\ and\ not\ \(test_search_mcp_registry_returns_list\)\ and\ not\ \(test_packaged_path_resolves_to_the_copy_on_disk\)\ and\ not\ \(test_the_node_warning_is_not_the_headline\)\ and\ not\ \(test_process_died_includes_stderr\)\ and\ not\ \(test_a_module_without_main_is_not_runnable\)336============================= test session starts ==============================337platform linux -- Python 3.14.7, pytest-9.1.1, pluggy-1.6.0338rootdir: /build/source339configfile: pyproject.toml340testpaths: tests341collected 2673 items / 7 deselected / 2666 selected 342343tests/test_activity_presence.py ................................... [ 1%]344tests/test_add_url_validation.py .............. [ 1%]345tests/test_bench.py .............. [ 2%]346tests/test_bench_tokens.py ....ss.. [ 2%]347tests/test_benchmark_repro.py sss........... [ 3%]348tests/test_cache.py ........ [ 3%]349tests/test_calculator.py .......................... [ 4%]350tests/test_call_policy_health_guards.py ......... [ 4%]351tests/test_ccr.py ...................... [ 5%]352tests/test_ccr_http_session.py ....... [ 5%]353tests/test_ccr_lossless.py .......................... [ 6%]354tests/test_claude_plugin_package.py ............. [ 7%]355tests/test_cli_credit.py ........................ [ 8%]356tests/test_cli_credit_more.py ......... [ 8%]357tests/test_cli_exit_codes.py .... [ 8%]358tests/test_cli_flags.py ................... [ 9%]359tests/test_cli_smoke.py ....... [ 9%]360tests/test_cli_stdin_encoding.py ....... [ 9%]361tests/test_cli_suggestions.py .... [ 10%]362tests/test_client.py .............................. [ 11%]363tests/test_command_coverage.py ......... [ 11%]364tests/test_completion.py ........... [ 12%]365tests/test_compressor.py .................................. [ 13%]366tests/test_config.py .................... [ 14%]367tests/test_config_atomic_and_unset.py ............ [ 14%]368tests/test_dead_server_diagnostics.py .. [ 14%]369tests/test_demo.py ..................... [ 15%]370tests/test_demo_dead_package.py ....... [ 15%]371tests/test_demo_server.py .............................................. [ 17%]372..... [ 17%]373tests/test_dir_isolation.py ... [ 17%]374tests/test_discover.py .......................................... [ 19%]375tests/test_docs.py .............................................. [ 20%]376tests/test_doctor_errors.py ............ [ 21%]377tests/test_doctor_json_config_strip_remove_multi.py ....... [ 21%]378tests/test_doctor_star_hint.py ....... [ 21%]379tests/test_doctor_statusline.py .... [ 22%]380tests/test_empty_machine_output.py ...... [ 22%]381tests/test_envelope.py ........ [ 22%]382tests/test_error_streams.py ........... [ 22%]383tests/test_exec_sandbox.py ................. [ 23%]384tests/test_exit_codes.py ......................... [ 24%]385tests/test_exit_codes_and_headers.py ......... [ 24%]386tests/test_fallback_json.py ...... [ 25%]387tests/test_faq_page.py ... [ 25%]388tests/test_floodguard.py ........ [ 25%]389tests/test_footer_broadcast.py ......................................... [ 27%]390........ [ 27%]391tests/test_footprint_claims.py ............ [ 27%]392tests/test_gemini_manifest.py ...... [ 28%]393tests/test_health.py .............. [ 28%]394tests/test_help_per_command.py ....... [ 28%]395tests/test_help_shortcircuit.py ......... [ 29%]396tests/test_honest_counts.py ................ [ 29%]397tests/test_http_user_agent.py ......... [ 30%]398tests/test_import.py ..................... [ 30%]399tests/test_inspect_list_help_version.py ........ [ 31%]400tests/test_installer_registry.py ................................. [ 32%]401tests/test_json_schema_version.py ......s [ 32%]402tests/test_kb.py ................... [ 33%]403tests/test_lang.py .............................. [ 34%]404tests/test_list_manifest_toggle_flags.py ......... [ 34%]405tests/test_llms_txt.py ...... [ 35%]406tests/test_machine_readable_output.py .......................... [ 36%]407tests/test_manifest.py .. [ 36%]408tests/test_mode_delivery_surfaces.py ................................... [ 37%]409.................F [ 38%]410tests/test_mode_recommend.py ............. [ 38%]411tests/test_native_tools.py ............................................. [ 40%]412........................ [ 41%]413tests/test_next_step_works.py .................. [ 41%]414tests/test_output.py ................................................... [ 43%]415........................................................................ [ 46%]416................ [ 47%]417tests/test_percent_caliber.py .... [ 47%]418tests/test_plugin_install.py .......... [ 47%]419tests/test_plugin_scan.py ............................... [ 48%]420tests/test_policy_clear_missing.py .. [ 48%]421tests/test_policy_json_retrieve_exit.py ..... [ 49%]422tests/test_policy_overrides.py ................ [ 49%]423tests/test_presence.py ................................................. [ 51%]424............... [ 52%]425tests/test_presence_discoverability.py ...... [ 52%]426tests/test_presence_i18n.py .......... [ 52%]427tests/test_presence_native.py ............. [ 53%]428tests/test_presence_round10.py ............... [ 53%]429tests/test_presence_round11.py ............... [ 54%]430tests/test_presence_round5.py ................ [ 54%]431tests/test_presence_round6.py ............ [ 55%]432tests/test_presence_round7.py ............. [ 55%]433tests/test_presence_round8.py ............ [ 56%]434tests/test_presence_round9.py .................... [ 57%]435tests/test_quickstart_guidance.py .... [ 57%]436tests/test_readme_links.py ... [ 57%]437tests/test_registry_sync.py ............. [ 57%]438tests/test_release_tooling.py ... [ 57%]439tests/test_remove_clears_cache.py ... [ 57%]440tests/test_report.py ..................... [ 58%]441tests/test_reversible.py ............................................... [ 60%]442............................. [ 61%]443tests/test_router.py .............................................. [ 63%]444tests/test_savings.py .......... [ 63%]445tests/test_schema_call_e2e.py .. [ 63%]446tests/test_search.py ................................... [ 65%]447tests/test_search_head_envelope_toggle.py ........ [ 65%]448tests/test_select_cli.py .... [ 65%]449tests/test_select_engine.py ................. [ 66%]450tests/test_select_head.py ... [ 66%]451tests/test_self_entry_guard.py ............... [ 66%]452tests/test_serve.py .................................................... [ 68%]453.............. [ 69%]454tests/test_serve_perf.py .......... [ 69%]455tests/test_serve_prompts.py ........ [ 70%]456tests/test_session_log.py ............... [ 70%]457tests/test_skill_package.py ..............s...................... [ 71%]458tests/test_skill_packs.py ................ [ 72%]459tests/test_skill_search.py .......... [ 72%]460tests/test_skills.py ................................................... [ 74%]461.....................ss................................................. [ 77%]462................................................................... [ 80%]463tests/test_smart_compress_e2e.py .................. [ 80%]464tests/test_smart_reachability.py ..... [ 80%]465tests/test_source_tracked.py sss [ 81%]466tests/test_stats_toggle.py ......... [ 81%]467tests/test_status_skills_staleness.py .... [ 81%]468tests/test_statusline_install.py ....................... [ 82%]469tests/test_stderr_pipe_deadlock.py .... [ 82%]470tests/test_subprocess_encoding.py . [ 82%]471tests/test_sync.py ..................................................... [ 84%]472................................................... [ 86%]473tests/test_sync_claims_tree.py ...... [ 86%]474tests/test_tier_claims_consistent.py .... [ 86%]475tests/test_toml_config.py .......................... [ 87%]476tests/test_toon_cross_validate.py ............................... [ 89%]477tests/test_typo_and_flag_validation.py ......... [ 89%]478tests/test_uninstall_end_to_end.py .......... [ 89%]479tests/test_update.py .................... [ 90%]480tests/test_ux_enhancements.py .............................. [ 91%]481tests/test_v02_features.py .................................... [ 92%]482tests/test_v04_features.py ................ [ 93%]483tests/test_v05_features.py ...................... [ 94%]484tests/test_v072_delight.py .....................s.. [ 95%]485tests/test_v073_http_security.py .............................. [ 96%]486tests/test_v074_stdio_timeout.py ............ [ 96%]487tests/test_v076_stateless_serve.py ................... [ 97%]488tests/test_v07_spec2026.py ..................... [ 98%]489tests/test_v081_env_headers.py ............. [ 98%]490tests/test_watch.py .................. [ 99%]491tests/test_xdg.py ............. [100%]492493=================================== FAILURES ===================================494_________________ test_changelog_has_unreleased_delivery_mode __________________495496 def test_changelog_has_unreleased_delivery_mode():497 from pathlib import Path498 root = Path(__file__).resolve().parents[1]499 md = (root / "CHANGELOG.md").read_text(encoding="utf-8")500> assert "## [Unreleased]" in md501E AssertionError: assert '## [Unreleased]' in '# Changelog\n\nAll notable changes to mcptoon will be documented in this file.\n\nThe format is based on [Keep a Chan...n- No reconnection logic for dropped stdio connections\n- Schema cache is not invalidated when server config changes\n'502503tests/test_mode_delivery_surfaces.py:730: AssertionError504=============================== warnings summary ===============================505../../nix/store/v0axk356l7kzmgfdwprgrys2a02l9amk-python3.14-pytest-9.1.1/lib/python3.14/site-packages/_pytest/config/__init__.py:1464506 /nix/store/v0axk356l7kzmgfdwprgrys2a02l9amk-python3.14-pytest-9.1.1/lib/python3.14/site-packages/_pytest/config/__init__.py:1464: PytestConfigWarning: Unknown config option: timeout507 508 self._warn_or_fail_if_strict(f"Unknown config option: {key}\n")509510../../nix/store/v0axk356l7kzmgfdwprgrys2a02l9amk-python3.14-pytest-9.1.1/lib/python3.14/site-packages/_pytest/config/__init__.py:1464511 /nix/store/v0axk356l7kzmgfdwprgrys2a02l9amk-python3.14-pytest-9.1.1/lib/python3.14/site-packages/_pytest/config/__init__.py:1464: PytestConfigWarning: Unknown config option: timeout_method512 513 self._warn_or_fail_if_strict(f"Unknown config option: {key}\n")514515-- Docs: https://docs.pytest.org/en/stable/how-to/capture-warnings.html516=========================== short test summary info ============================517FAILED tests/test_mode_delivery_surfaces.py::test_changelog_has_unreleased_delivery_mode - AssertionError: assert '## [Unreleased]' in '# Changelog\n\nAll notable cha...518= 1 failed, 2652 passed, 13 skipped, 7 deselected, 2 warnings in 123.86s (0:02:03) =