nixbot

builds

numtide/llm-agents.nix build #8431 failed

branch main · PR #11144 · commit ec6a4cd2bf · · took 2m 38s · eval 10s

eval warnings 2 kinds · 2 occurrences
  • warn setting 'accept-flake-config' is ignored: iets never applies a flake's nixConfig, so a flake that sets extra-substituters or allow-import-from-derivation there runs without them; put the settings in nix.conf ×1
  • warn setting 'plugin-files' is ignored: iets loads no plugins ×1

3 failed
failed attributes
status attribute duration
failed checks.aarch64-darwin.pkgs-mcptoon 2m 9s
mcptoon-0.8.25: self._warn_or_fail_if_strict(f"Unknown config option: {key}\n") ../../../../../store/cp1hsk9pigafw8kz9xpa6s697019hlq1-python3.14-pytest-9.1. …
mcptoon-0.8.25:
    self._warn_or_fail_if_strict(f"Unknown config option: {key}\n")
../../../../../store/cp1hsk9pigafw8kz9xpa6s697019hlq1-python3.14-pytest-9.1.1/lib/python3.14/site-packages/_pytest/config/__init__.py:1464
  /nix/store/cp1hsk9pigafw8kz9xpa6s697019hlq1-python3.14-pytest-9.1.1/lib/python3.14/site-packages/_pytest/config/__init__.py:1464: PytestConfigWarning: Unknown config option: timeout_method
    self._warn_or_fail_if_strict(f"Unknown config option: {key}\n")
-- Docs: https://docs.pytest.org/en/stable/how-to/capture-warnings.html
=========================== short test summary info ============================
FAILED tests/test_mode_delivery_surfaces.py::test_changelog_has_unreleased_delivery_mode - AssertionError: assert '## [Unreleased]' in '# Changelog\n\nAll notable cha...
= 1 failed, 2651 passed, 14 skipped, 7 deselected, 2 warnings in 124.78s (0:02:04) =
failed checks.aarch64-linux.pkgs-mcptoon 2m 27s
mcptoon-0.8.25: self._warn_or_fail_if_strict(f"Unknown config option: {key}\n") ../../nix/store/0zm37a70sfgc2zwgbwv9kv75hlv5d4lc-python3.14-pytest-9.1.1/lib …
mcptoon-0.8.25:
    self._warn_or_fail_if_strict(f"Unknown config option: {key}\n")
../../nix/store/0zm37a70sfgc2zwgbwv9kv75hlv5d4lc-python3.14-pytest-9.1.1/lib/python3.14/site-packages/_pytest/config/__init__.py:1464
  /nix/store/0zm37a70sfgc2zwgbwv9kv75hlv5d4lc-python3.14-pytest-9.1.1/lib/python3.14/site-packages/_pytest/config/__init__.py:1464: PytestConfigWarning: Unknown config option: timeout_method
    self._warn_or_fail_if_strict(f"Unknown config option: {key}\n")
-- Docs: https://docs.pytest.org/en/stable/how-to/capture-warnings.html
=========================== short test summary info ============================
FAILED tests/test_mode_delivery_surfaces.py::test_changelog_has_unreleased_delivery_mode - AssertionError: assert '## [Unreleased]' in '# Changelog\n\nAll notable cha...
= 1 failed, 2652 passed, 13 skipped, 7 deselected, 2 warnings in 138.86s (0:02:18) =
failed checks.x86_64-linux.pkgs-mcptoon 2m 8s
mcptoon-0.8.25: self._warn_or_fail_if_strict(f"Unknown config option: {key}\n") ../../nix/store/v0axk356l7kzmgfdwprgrys2a02l9amk-python3.14-pytest-9.1.1/lib …
mcptoon-0.8.25:
    self._warn_or_fail_if_strict(f"Unknown config option: {key}\n")
../../nix/store/v0axk356l7kzmgfdwprgrys2a02l9amk-python3.14-pytest-9.1.1/lib/python3.14/site-packages/_pytest/config/__init__.py:1464
  /nix/store/v0axk356l7kzmgfdwprgrys2a02l9amk-python3.14-pytest-9.1.1/lib/python3.14/site-packages/_pytest/config/__init__.py:1464: PytestConfigWarning: Unknown config option: timeout_method
    self._warn_or_fail_if_strict(f"Unknown config option: {key}\n")
-- Docs: https://docs.pytest.org/en/stable/how-to/capture-warnings.html
=========================== short test summary info ============================
FAILED tests/test_mode_delivery_surfaces.py::test_changelog_has_unreleased_delivery_mode - AssertionError: assert '## [Unreleased]' in '# Changelog\n\nAll notable cha...
= 1 failed, 2652 passed, 13 skipped, 7 deselected, 2 warnings in 123.86s (0:02:03) =
13 succeeded
succeeded attributes
status attribute duration
loading…
681 already built
skipped attributes
status attribute duration
loading…