setup
checks.x86_64-linux.pkgs-mcptoon
· build #8431
· raw
1these 2 derivations will be built:2 /nix/store/9zn3n45h0hiwgzq7c686g7wwh809x4db-mcptoon-0.8.25.drv3 /nix/store/q5460l85qx6jh1irsm1l2ii96b05axf0-check-mcptoon.drv4error: Cannot build '/nix/store/9zn3n45h0hiwgzq7c686g7wwh809x4db-mcptoon-0.8.25.drv'.5 Reason: builder failed with exit code 1.6 Output paths:7 /nix/store/7gn3k31mgbwdwf1q3y858vihljh9vsnw-mcptoon-0.8.258 /nix/store/bpm3hyk1pa44xcjpfbli1j44qiy9swp3-mcptoon-0.8.25-dist9 Last 25 log lines:10 > _________________ test_changelog_has_unreleased_delivery_mode __________________11 >12 > def test_changelog_has_unreleased_delivery_mode():13 > from pathlib import Path14 > root = Path(__file__).resolve().parents[1]15 > md = (root / "CHANGELOG.md").read_text(encoding="utf-8")16 > > assert "## [Unreleased]" in md17 > E AssertionError: assert '## [Unreleased]' in '# Changelog\n\nAll notable changes to mcptoon will be documented in this file.\n\nThe format is based on [Keep a Chan...n- No reconnection logic for dropped stdio connections\n- Schema cache is not invalidated when server config changes\n'18 >19 > tests/test_mode_delivery_surfaces.py:730: AssertionError20 > =============================== warnings summary ===============================21 > ../../nix/store/v0axk356l7kzmgfdwprgrys2a02l9amk-python3.14-pytest-9.1.1/lib/python3.14/site-packages/_pytest/config/__init__.py:146422 > /nix/store/v0axk356l7kzmgfdwprgrys2a02l9amk-python3.14-pytest-9.1.1/lib/python3.14/site-packages/_pytest/config/__init__.py:1464: PytestConfigWarning: Unknown config option: timeout23 >24 > self._warn_or_fail_if_strict(f"Unknown config option: {key}\n")25 >26 > ../../nix/store/v0axk356l7kzmgfdwprgrys2a02l9amk-python3.14-pytest-9.1.1/lib/python3.14/site-packages/_pytest/config/__init__.py:146427 > /nix/store/v0axk356l7kzmgfdwprgrys2a02l9amk-python3.14-pytest-9.1.1/lib/python3.14/site-packages/_pytest/config/__init__.py:1464: PytestConfigWarning: Unknown config option: timeout_method28 >29 > self._warn_or_fail_if_strict(f"Unknown config option: {key}\n")30 >31 > -- Docs: https://docs.pytest.org/en/stable/how-to/capture-warnings.html32 > =========================== short test summary info ============================33 > FAILED tests/test_mode_delivery_surfaces.py::test_changelog_has_unreleased_delivery_mode - AssertionError: assert '## [Unreleased]' in '# Changelog\n\nAll notable cha...34 > = 1 failed, 2652 passed, 13 skipped, 7 deselected, 2 warnings in 123.86s (0:02:03) =35 For full logs, run:36 nix log /nix/store/9zn3n45h0hiwgzq7c686g7wwh809x4db-mcptoon-0.8.25.drv37error: Cannot build '/nix/store/q5460l85qx6jh1irsm1l2ii96b05axf0-check-mcptoon.drv'.38 Reason: 1 dependency failed.39 Output paths:40 /nix/store/4mj3nadxsiqwmdipfhw072r1zpm67yry-check-mcptoon