nixbot

builds

failed mcptoon-0.8.25 checks.aarch64-darwin.pkgs-mcptoon · build #8431 · raw

1mac02: building b1cghdkg8zfbbn913lz7m5gwpkqjysyv-mcptoon-0.8.25.drv2Sourcing python-remove-tests-dir-hook3Sourcing python-catch-conflicts-hook.sh4Sourcing python-remove-bin-bytecode-hook.sh5Sourcing pypa-build-hook6Using pypaBuildPhase7Sourcing python-runtime-deps-check-hook8Using pythonRuntimeDepsCheckHook9Sourcing pypa-install-hook10Using pypaInstallPhase11Sourcing python-imports-check-hook.sh12Using pythonImportsCheckPhase13Sourcing python-namespaces-hook14Sourcing python-catch-conflicts-hook.sh15Sourcing pytest-check-hook16Using pytestCheckPhase
unpackPhase
17unpacking source archive /nix/store/laz7gp7b4q0jjzb9mpx5wdri6pl0ph1n-source18source root is source19setting SOURCE_DATE_EPOCH to timestamp 315619200 of file "source/tests/test_xdg.py"
configurePhase
20no configure script, doing nothing
buildPhase
21Executing pypaBuildPhase22Creating a wheel...23pypa build flags: --no-isolation --outdir dist/ --wheel24* Getting build dependencies for wheel...25/nix/store/cp6vhcyg8bna8rrmnamn75ii070diafk-python3.14-setuptools-83.0.0/lib/python3.14/site-packages/setuptools/config/_apply_pyprojecttoml.py:82: SetuptoolsDeprecationWarning: `project.license` as a TOML table is deprecated26!!2728 ********************************************************************************29 Please use a simple string containing a SPDX expression for `project.license`. You can also use `project.license-files`. (Both options available on setuptools>=77.0.0).3031 By 2027-Feb-18, you need to update your project and remove deprecated calls32 or your builds will no longer be supported.3334 See https://packaging.python.org/en/latest/guides/writing-pyproject-toml/#license for details.35 ********************************************************************************3637!!38 corresp(dist, value, root_dir)39/nix/store/cp6vhcyg8bna8rrmnamn75ii070diafk-python3.14-setuptools-83.0.0/lib/python3.14/site-packages/setuptools/config/_apply_pyprojecttoml.py:61: SetuptoolsDeprecationWarning: License classifiers are deprecated.40!!4142 ********************************************************************************43 Please consider removing the following classifiers in favor of a SPDX license expression:4445 License :: OSI Approved :: Apache Software License4647 See https://packaging.python.org/en/latest/guides/writing-pyproject-toml/#license for details.48 ********************************************************************************4950!!51 dist._finalize_license_expression()52/nix/store/cp6vhcyg8bna8rrmnamn75ii070diafk-python3.14-setuptools-83.0.0/lib/python3.14/site-packages/setuptools/dist.py:765: SetuptoolsDeprecationWarning: License classifiers are deprecated.53!!5455 ********************************************************************************56 Please consider removing the following classifiers in favor of a SPDX license expression:5758 License :: OSI Approved :: Apache Software License5960 See https://packaging.python.org/en/latest/guides/writing-pyproject-toml/#license for details.61 ********************************************************************************6263!!64 self._finalize_license_expression()65running egg_info66creating src/mcptoon.egg-info67writing src/mcptoon.egg-info/PKG-INFO68writing dependency_links to src/mcptoon.egg-info/dependency_links.txt69writing entry points to src/mcptoon.egg-info/entry_points.txt70writing requirements to src/mcptoon.egg-info/requires.txt71writing top-level names to src/mcptoon.egg-info/top_level.txt72writing manifest file 'src/mcptoon.egg-info/SOURCES.txt'73reading manifest file 'src/mcptoon.egg-info/SOURCES.txt'74adding license file 'LICENSE'75adding license file 'NOTICE'76writing manifest file 'src/mcptoon.egg-info/SOURCES.txt'77* Building wheel...78/nix/store/cp6vhcyg8bna8rrmnamn75ii070diafk-python3.14-setuptools-83.0.0/lib/python3.14/site-packages/setuptools/config/_apply_pyprojecttoml.py:82: SetuptoolsDeprecationWarning: `project.license` as a TOML table is deprecated79!!8081 ********************************************************************************82 Please use a simple string containing a SPDX expression for `project.license`. You can also use `project.license-files`. (Both options available on setuptools>=77.0.0).8384 By 2027-Feb-18, you need to update your project and remove deprecated calls85 or your builds will no longer be supported.8687 See https://packaging.python.org/en/latest/guides/writing-pyproject-toml/#license for details.88 ********************************************************************************8990!!91 corresp(dist, value, root_dir)92/nix/store/cp6vhcyg8bna8rrmnamn75ii070diafk-python3.14-setuptools-83.0.0/lib/python3.14/site-packages/setuptools/config/_apply_pyprojecttoml.py:61: SetuptoolsDeprecationWarning: License classifiers are deprecated.93!!9495 ********************************************************************************96 Please consider removing the following classifiers in favor of a SPDX license expression:9798 License :: OSI Approved :: Apache Software License99100 See https://packaging.python.org/en/latest/guides/writing-pyproject-toml/#license for details.101 ********************************************************************************102103!!104 dist._finalize_license_expression()105/nix/store/cp6vhcyg8bna8rrmnamn75ii070diafk-python3.14-setuptools-83.0.0/lib/python3.14/site-packages/setuptools/dist.py:765: SetuptoolsDeprecationWarning: License classifiers are deprecated.106!!107108 ********************************************************************************109 Please consider removing the following classifiers in favor of a SPDX license expression:110111 License :: OSI Approved :: Apache Software License112113 See https://packaging.python.org/en/latest/guides/writing-pyproject-toml/#license for details.114 ********************************************************************************115116!!117 self._finalize_license_expression()118running bdist_wheel119running build120running build_py121creating build/lib/mcptoon122copying src/mcptoon/floodguard.py -> build/lib/mcptoon123copying src/mcptoon/update.py -> build/lib/mcptoon124copying src/mcptoon/sync.py -> build/lib/mcptoon125copying src/mcptoon/config.py -> build/lib/mcptoon126copying src/mcptoon/skills.py -> build/lib/mcptoon127copying src/mcptoon/manifest.py -> build/lib/mcptoon128copying src/mcptoon/health.py -> build/lib/mcptoon129copying src/mcptoon/discover.py -> build/lib/mcptoon130copying src/mcptoon/client.py -> build/lib/mcptoon131copying src/mcptoon/cache.py -> build/lib/mcptoon132copying src/mcptoon/__init__.py -> build/lib/mcptoon133copying src/mcptoon/docs.py -> build/lib/mcptoon134copying src/mcptoon/serve.py -> build/lib/mcptoon135copying src/mcptoon/native_tools.py -> build/lib/mcptoon136copying src/mcptoon/bench.py -> build/lib/mcptoon137copying src/mcptoon/mode.py -> build/lib/mcptoon138copying src/mcptoon/installer.py -> build/lib/mcptoon139copying src/mcptoon/savings.py -> build/lib/mcptoon140copying src/mcptoon/ccr.py -> build/lib/mcptoon141copying src/mcptoon/bench_tokens.py -> build/lib/mcptoon142copying src/mcptoon/cli.py -> build/lib/mcptoon143copying src/mcptoon/footer.py -> build/lib/mcptoon144copying src/mcptoon/toon_vendored.py -> build/lib/mcptoon145copying src/mcptoon/plugin.py -> build/lib/mcptoon146copying src/mcptoon/compressor.py -> build/lib/mcptoon147copying src/mcptoon/errors.py -> build/lib/mcptoon148copying src/mcptoon/session_log.py -> build/lib/mcptoon149copying src/mcptoon/watch.py -> build/lib/mcptoon150copying src/mcptoon/demo_server.py -> build/lib/mcptoon151copying src/mcptoon/welcome.py -> build/lib/mcptoon152copying src/mcptoon/headers.py -> build/lib/mcptoon153copying src/mcptoon/router.py -> build/lib/mcptoon154copying src/mcptoon/demo.py -> build/lib/mcptoon155copying src/mcptoon/exec_sandbox.py -> build/lib/mcptoon156copying src/mcptoon/schema_simplifier.py -> build/lib/mcptoon157copying src/mcptoon/usage.py -> build/lib/mcptoon158copying src/mcptoon/packs.py -> build/lib/mcptoon159copying src/mcptoon/__main__.py -> build/lib/mcptoon160copying src/mcptoon/report.py -> build/lib/mcptoon161copying src/mcptoon/output.py -> build/lib/mcptoon162copying src/mcptoon/kb.py -> build/lib/mcptoon163creating build/lib/mcptoon/_toon164copying src/mcptoon/_toon/decoder.py -> build/lib/mcptoon/_toon165copying src/mcptoon/_toon/primitives.py -> build/lib/mcptoon/_toon166copying src/mcptoon/_toon/normalize.py -> build/lib/mcptoon/_toon167copying src/mcptoon/_toon/constants.py -> build/lib/mcptoon/_toon168copying src/mcptoon/_toon/__init__.py -> build/lib/mcptoon/_toon169copying src/mcptoon/_toon/encoders.py -> build/lib/mcptoon/_toon170copying src/mcptoon/_toon/types.py -> build/lib/mcptoon/_toon171copying src/mcptoon/_toon/encoder.py -> build/lib/mcptoon/_toon172copying src/mcptoon/_toon/writer.py -> build/lib/mcptoon/_toon173running egg_info174writing src/mcptoon.egg-info/PKG-INFO175writing dependency_links to src/mcptoon.egg-info/dependency_links.txt176writing entry points to src/mcptoon.egg-info/entry_points.txt177writing requirements to src/mcptoon.egg-info/requires.txt178writing top-level names to src/mcptoon.egg-info/top_level.txt179reading manifest file 'src/mcptoon.egg-info/SOURCES.txt'180adding license file 'LICENSE'181adding license file 'NOTICE'182writing manifest file 'src/mcptoon.egg-info/SOURCES.txt'183copying src/mcptoon/packs.json -> build/lib/mcptoon184creating build/lib/mcptoon/skill185copying src/mcptoon/skill/SKILL.md -> build/lib/mcptoon/skill186installing to build/bdist.macosx-14.0-arm64/wheel187running install188running install_lib189creating build/bdist.macosx-14.0-arm64/wheel190creating build/bdist.macosx-14.0-arm64/wheel/mcptoon191copying build/lib/mcptoon/floodguard.py -> build/bdist.macosx-14.0-arm64/wheel/./mcptoon192copying build/lib/mcptoon/update.py -> build/bdist.macosx-14.0-arm64/wheel/./mcptoon193copying build/lib/mcptoon/sync.py -> build/bdist.macosx-14.0-arm64/wheel/./mcptoon194copying build/lib/mcptoon/config.py -> build/bdist.macosx-14.0-arm64/wheel/./mcptoon195creating build/bdist.macosx-14.0-arm64/wheel/mcptoon/skill196copying build/lib/mcptoon/skill/SKILL.md -> build/bdist.macosx-14.0-arm64/wheel/./mcptoon/skill197copying build/lib/mcptoon/skills.py -> build/bdist.macosx-14.0-arm64/wheel/./mcptoon198copying build/lib/mcptoon/manifest.py -> build/bdist.macosx-14.0-arm64/wheel/./mcptoon199copying build/lib/mcptoon/health.py -> build/bdist.macosx-14.0-arm64/wheel/./mcptoon200copying build/lib/mcptoon/discover.py -> build/bdist.macosx-14.0-arm64/wheel/./mcptoon201copying build/lib/mcptoon/client.py -> build/bdist.macosx-14.0-arm64/wheel/./mcptoon202copying build/lib/mcptoon/packs.json -> build/bdist.macosx-14.0-arm64/wheel/./mcptoon203copying build/lib/mcptoon/cache.py -> build/bdist.macosx-14.0-arm64/wheel/./mcptoon204copying build/lib/mcptoon/__init__.py -> build/bdist.macosx-14.0-arm64/wheel/./mcptoon205copying build/lib/mcptoon/docs.py -> build/bdist.macosx-14.0-arm64/wheel/./mcptoon206copying build/lib/mcptoon/serve.py -> build/bdist.macosx-14.0-arm64/wheel/./mcptoon207copying build/lib/mcptoon/native_tools.py -> build/bdist.macosx-14.0-arm64/wheel/./mcptoon208creating build/bdist.macosx-14.0-arm64/wheel/mcptoon/_toon209copying build/lib/mcptoon/_toon/decoder.py -> build/bdist.macosx-14.0-arm64/wheel/./mcptoon/_toon210copying build/lib/mcptoon/_toon/primitives.py -> build/bdist.macosx-14.0-arm64/wheel/./mcptoon/_toon211copying build/lib/mcptoon/_toon/normalize.py -> build/bdist.macosx-14.0-arm64/wheel/./mcptoon/_toon212copying build/lib/mcptoon/_toon/constants.py -> build/bdist.macosx-14.0-arm64/wheel/./mcptoon/_toon213copying build/lib/mcptoon/_toon/__init__.py -> build/bdist.macosx-14.0-arm64/wheel/./mcptoon/_toon214copying build/lib/mcptoon/_toon/encoders.py -> build/bdist.macosx-14.0-arm64/wheel/./mcptoon/_toon215copying build/lib/mcptoon/_toon/types.py -> build/bdist.macosx-14.0-arm64/wheel/./mcptoon/_toon216copying build/lib/mcptoon/_toon/encoder.py -> build/bdist.macosx-14.0-arm64/wheel/./mcptoon/_toon217copying build/lib/mcptoon/_toon/writer.py -> build/bdist.macosx-14.0-arm64/wheel/./mcptoon/_toon218copying build/lib/mcptoon/bench.py -> build/bdist.macosx-14.0-arm64/wheel/./mcptoon219copying build/lib/mcptoon/mode.py -> build/bdist.macosx-14.0-arm64/wheel/./mcptoon220copying build/lib/mcptoon/installer.py -> build/bdist.macosx-14.0-arm64/wheel/./mcptoon221copying build/lib/mcptoon/savings.py -> build/bdist.macosx-14.0-arm64/wheel/./mcptoon222copying build/lib/mcptoon/ccr.py -> build/bdist.macosx-14.0-arm64/wheel/./mcptoon223copying build/lib/mcptoon/bench_tokens.py -> build/bdist.macosx-14.0-arm64/wheel/./mcptoon224copying build/lib/mcptoon/cli.py -> build/bdist.macosx-14.0-arm64/wheel/./mcptoon225copying build/lib/mcptoon/footer.py -> build/bdist.macosx-14.0-arm64/wheel/./mcptoon226copying build/lib/mcptoon/toon_vendored.py -> build/bdist.macosx-14.0-arm64/wheel/./mcptoon227copying build/lib/mcptoon/plugin.py -> build/bdist.macosx-14.0-arm64/wheel/./mcptoon228copying build/lib/mcptoon/compressor.py -> build/bdist.macosx-14.0-arm64/wheel/./mcptoon229copying build/lib/mcptoon/errors.py -> build/bdist.macosx-14.0-arm64/wheel/./mcptoon230copying build/lib/mcptoon/session_log.py -> build/bdist.macosx-14.0-arm64/wheel/./mcptoon231copying build/lib/mcptoon/watch.py -> build/bdist.macosx-14.0-arm64/wheel/./mcptoon232copying build/lib/mcptoon/demo_server.py -> build/bdist.macosx-14.0-arm64/wheel/./mcptoon233copying build/lib/mcptoon/welcome.py -> build/bdist.macosx-14.0-arm64/wheel/./mcptoon234copying build/lib/mcptoon/headers.py -> build/bdist.macosx-14.0-arm64/wheel/./mcptoon235copying build/lib/mcptoon/router.py -> build/bdist.macosx-14.0-arm64/wheel/./mcptoon236copying build/lib/mcptoon/demo.py -> build/bdist.macosx-14.0-arm64/wheel/./mcptoon237copying build/lib/mcptoon/exec_sandbox.py -> build/bdist.macosx-14.0-arm64/wheel/./mcptoon238copying build/lib/mcptoon/schema_simplifier.py -> build/bdist.macosx-14.0-arm64/wheel/./mcptoon239copying build/lib/mcptoon/usage.py -> build/bdist.macosx-14.0-arm64/wheel/./mcptoon240copying build/lib/mcptoon/packs.py -> build/bdist.macosx-14.0-arm64/wheel/./mcptoon241copying build/lib/mcptoon/__main__.py -> build/bdist.macosx-14.0-arm64/wheel/./mcptoon242copying build/lib/mcptoon/report.py -> build/bdist.macosx-14.0-arm64/wheel/./mcptoon243copying build/lib/mcptoon/output.py -> build/bdist.macosx-14.0-arm64/wheel/./mcptoon244copying build/lib/mcptoon/kb.py -> build/bdist.macosx-14.0-arm64/wheel/./mcptoon245running install_egg_info246Copying src/mcptoon.egg-info to build/bdist.macosx-14.0-arm64/wheel/./mcptoon-0.8.25-py3.14.egg-info247running install_scripts248creating build/bdist.macosx-14.0-arm64/wheel/mcptoon-0.8.25.dist-info/WHEEL249creating '/nix/var/nix/builds/nix-32890-599417684/source/dist/.tmp-tjtsejzf/mcptoon-0.8.25-py3-none-any.whl' and adding 'build/bdist.macosx-14.0-arm64/wheel' to it250adding 'mcptoon/__init__.py'251adding 'mcptoon/__main__.py'252adding 'mcptoon/bench.py'253adding 'mcptoon/bench_tokens.py'254adding 'mcptoon/cache.py'255adding 'mcptoon/ccr.py'256adding 'mcptoon/cli.py'257adding 'mcptoon/client.py'258adding 'mcptoon/compressor.py'259adding 'mcptoon/config.py'260adding 'mcptoon/demo.py'261adding 'mcptoon/demo_server.py'262adding 'mcptoon/discover.py'263adding 'mcptoon/docs.py'264adding 'mcptoon/errors.py'265adding 'mcptoon/exec_sandbox.py'266adding 'mcptoon/floodguard.py'267adding 'mcptoon/footer.py'268adding 'mcptoon/headers.py'269adding 'mcptoon/health.py'270adding 'mcptoon/installer.py'271adding 'mcptoon/kb.py'272adding 'mcptoon/manifest.py'273adding 'mcptoon/mode.py'274adding 'mcptoon/native_tools.py'275adding 'mcptoon/output.py'276adding 'mcptoon/packs.json'277adding 'mcptoon/packs.py'278adding 'mcptoon/plugin.py'279adding 'mcptoon/report.py'280adding 'mcptoon/router.py'281adding 'mcptoon/savings.py'282adding 'mcptoon/schema_simplifier.py'283adding 'mcptoon/serve.py'284adding 'mcptoon/session_log.py'285adding 'mcptoon/skills.py'286adding 'mcptoon/sync.py'287adding 'mcptoon/toon_vendored.py'288adding 'mcptoon/update.py'289adding 'mcptoon/usage.py'290adding 'mcptoon/watch.py'291adding 'mcptoon/welcome.py'292adding 'mcptoon/_toon/__init__.py'293adding 'mcptoon/_toon/constants.py'294adding 'mcptoon/_toon/decoder.py'295adding 'mcptoon/_toon/encoder.py'296adding 'mcptoon/_toon/encoders.py'297adding 'mcptoon/_toon/normalize.py'298adding 'mcptoon/_toon/primitives.py'299adding 'mcptoon/_toon/types.py'300adding 'mcptoon/_toon/writer.py'301adding 'mcptoon/skill/SKILL.md'302adding 'mcptoon-0.8.25.dist-info/licenses/LICENSE'303adding 'mcptoon-0.8.25.dist-info/licenses/NOTICE'304adding 'mcptoon-0.8.25.dist-info/METADATA'305adding 'mcptoon-0.8.25.dist-info/WHEEL'306adding 'mcptoon-0.8.25.dist-info/entry_points.txt'307adding 'mcptoon-0.8.25.dist-info/top_level.txt'308adding 'mcptoon-0.8.25.dist-info/RECORD'309removing build/bdist.macosx-14.0-arm64/wheel310Successfully built mcptoon-0.8.25-py3-none-any.whl311Finished creating a wheel...312Finished executing pypaBuildPhase
pythonRuntimeDepsCheckHook
313Executing pythonRuntimeDepsCheck314Checking runtime dependencies for mcptoon-0.8.25-py3-none-any.whl315Finished executing pythonRuntimeDepsCheck
installPhase
316Executing pypaInstallPhase317Successfully installed mcptoon-0.8.25-py3-none-any.whl318Finished executing pypaInstallPhase
pythonOutputDistPhase
319Executing pythonOutputDistPhase320Finished executing pythonOutputDistPhase
fixupPhase
321checking for references to /nix/var/nix/builds/nix-32890-599417684/ in /nix/store/1fjy9z0nssppp2bvjm3x5y58csnz2a11-mcptoon-0.8.25...322patching script interpreter paths in /nix/store/1fjy9z0nssppp2bvjm3x5y58csnz2a11-mcptoon-0.8.25323stripping (with command strip and flags -S) in /nix/store/1fjy9z0nssppp2bvjm3x5y58csnz2a11-mcptoon-0.8.25/lib /nix/store/1fjy9z0nssppp2bvjm3x5y58csnz2a11-mcptoon-0.8.25/bin324checking for references to /nix/var/nix/builds/nix-32890-599417684/ in /nix/store/jw50gfsqhs6kl60lq7b8z7kgpjggnidg-mcptoon-0.8.25-dist...325patching script interpreter paths in /nix/store/jw50gfsqhs6kl60lq7b8z7kgpjggnidg-mcptoon-0.8.25-dist326Rewriting #!/nix/store/0kcws5blwbdyxqxjd1w8hjipz61xny3k-python3-3.14.7/bin/python3.14 to #!/nix/store/0kcws5blwbdyxqxjd1w8hjipz61xny3k-python3-3.14.7327wrapping `/nix/store/1fjy9z0nssppp2bvjm3x5y58csnz2a11-mcptoon-0.8.25/bin/mcptoon'...328Executing pythonRemoveTestsDir329Finished executing pythonRemoveTestsDir
installCheckPhase
330no Makefile or custom installCheckPhase, doing nothing
pythonImportsCheckPhase
331Executing pythonImportsCheckPhase332Check whether the following modules can be imported: mcptoon
pytestCheckPhase
333Executing pytestCheckPhase334pytest flags: -m pytest -k not\ \(test_search_registry_returns_list\)\ and\ not\ \(test_search_smithery_returns_list\)\ and\ not\ \(test_search_mcp_registry_returns_list\)\ and\ not\ \(test_packaged_path_resolves_to_the_copy_on_disk\)\ and\ not\ \(test_the_node_warning_is_not_the_headline\)\ and\ not\ \(test_process_died_includes_stderr\)\ and\ not\ \(test_a_module_without_main_is_not_runnable\)335============================= test session starts ==============================336platform darwin -- Python 3.14.7, pytest-9.1.1, pluggy-1.6.0337rootdir: /nix/var/nix/builds/nix-32890-599417684/source338configfile: pyproject.toml339testpaths: tests340collected 2673 items / 7 deselected / 2666 selected 341342tests/test_activity_presence.py ................................... [ 1%]343tests/test_add_url_validation.py .............. [ 1%]344tests/test_bench.py .............. [ 2%]345tests/test_bench_tokens.py ....ss.. [ 2%]346tests/test_benchmark_repro.py sss........... [ 3%]347tests/test_cache.py ........ [ 3%]348tests/test_calculator.py .......................... [ 4%]349tests/test_call_policy_health_guards.py ......... [ 4%]350tests/test_ccr.py ...................... [ 5%]351tests/test_ccr_http_session.py ....... [ 5%]352tests/test_ccr_lossless.py .......................... [ 6%]353tests/test_claude_plugin_package.py ............. [ 7%]354tests/test_cli_credit.py ........................ [ 8%]355tests/test_cli_credit_more.py ......... [ 8%]356tests/test_cli_exit_codes.py .... [ 8%]357tests/test_cli_flags.py ................... [ 9%]358tests/test_cli_smoke.py ....... [ 9%]359tests/test_cli_stdin_encoding.py ....... [ 9%]360tests/test_cli_suggestions.py .... [ 10%]361tests/test_client.py .............................. [ 11%]362tests/test_command_coverage.py ......... [ 11%]363tests/test_completion.py ........... [ 12%]364tests/test_compressor.py .................................. [ 13%]365tests/test_config.py .................... [ 14%]366tests/test_config_atomic_and_unset.py ............ [ 14%]367tests/test_dead_server_diagnostics.py .. [ 14%]368tests/test_demo.py ..................... [ 15%]369tests/test_demo_dead_package.py ....... [ 15%]370tests/test_demo_server.py .............................................. [ 17%]371..... [ 17%]372tests/test_dir_isolation.py ... [ 17%]373tests/test_discover.py .......................................... [ 19%]374tests/test_docs.py .............................................. [ 20%]375tests/test_doctor_errors.py ............ [ 21%]376tests/test_doctor_json_config_strip_remove_multi.py ....... [ 21%]377tests/test_doctor_star_hint.py ....... [ 21%]378tests/test_doctor_statusline.py .... [ 22%]379tests/test_empty_machine_output.py ...... [ 22%]380tests/test_envelope.py ........ [ 22%]381tests/test_error_streams.py ........... [ 22%]382tests/test_exec_sandbox.py ................. [ 23%]383tests/test_exit_codes.py ......................... [ 24%]384tests/test_exit_codes_and_headers.py ......... [ 24%]385tests/test_fallback_json.py ...... [ 25%]386tests/test_faq_page.py ... [ 25%]387tests/test_floodguard.py ........ [ 25%]388tests/test_footer_broadcast.py ......................................... [ 27%]389........ [ 27%]390tests/test_footprint_claims.py ............ [ 27%]391tests/test_gemini_manifest.py ...... [ 28%]392tests/test_health.py .............. [ 28%]393tests/test_help_per_command.py ....... [ 28%]394tests/test_help_shortcircuit.py ......... [ 29%]395tests/test_honest_counts.py ................ [ 29%]396tests/test_http_user_agent.py ......... [ 30%]397tests/test_import.py ..................... [ 30%]398tests/test_inspect_list_help_version.py ........ [ 31%]399tests/test_installer_registry.py ................................. [ 32%]400tests/test_json_schema_version.py ......s [ 32%]401tests/test_kb.py ................... [ 33%]402tests/test_lang.py .............................. [ 34%]403tests/test_list_manifest_toggle_flags.py ......... [ 34%]404tests/test_llms_txt.py ...... [ 35%]405tests/test_machine_readable_output.py .......................... [ 36%]406tests/test_manifest.py .. [ 36%]407tests/test_mode_delivery_surfaces.py ................................... [ 37%]408.................F [ 38%]409tests/test_mode_recommend.py ............. [ 38%]410tests/test_native_tools.py ............................................. [ 40%]411........................ [ 41%]412tests/test_next_step_works.py .................. [ 41%]413tests/test_output.py ................................................... [ 43%]414........................................................................ [ 46%]415................ [ 47%]416tests/test_percent_caliber.py .... [ 47%]417tests/test_plugin_install.py .......... [ 47%]418tests/test_plugin_scan.py ............................... [ 48%]419tests/test_policy_clear_missing.py .. [ 48%]420tests/test_policy_json_retrieve_exit.py ..... [ 49%]421tests/test_policy_overrides.py ................ [ 49%]422tests/test_presence.py ................................................. [ 51%]423............... [ 52%]424tests/test_presence_discoverability.py ...... [ 52%]425tests/test_presence_i18n.py .......... [ 52%]426tests/test_presence_native.py ............. [ 53%]427tests/test_presence_round10.py ............... [ 53%]428tests/test_presence_round11.py ............... [ 54%]429tests/test_presence_round5.py ................ [ 54%]430tests/test_presence_round6.py ............ [ 55%]431tests/test_presence_round7.py ............. [ 55%]432tests/test_presence_round8.py ............ [ 56%]433tests/test_presence_round9.py .................... [ 57%]434tests/test_quickstart_guidance.py .... [ 57%]435tests/test_readme_links.py ... [ 57%]436tests/test_registry_sync.py ............. [ 57%]437tests/test_release_tooling.py ... [ 57%]438tests/test_remove_clears_cache.py ... [ 57%]439tests/test_report.py ..................... [ 58%]440tests/test_reversible.py ............................................... [ 60%]441............................. [ 61%]442tests/test_router.py .............................................. [ 63%]443tests/test_savings.py .......... [ 63%]444tests/test_schema_call_e2e.py .. [ 63%]445tests/test_search.py ................................... [ 65%]446tests/test_search_head_envelope_toggle.py ........ [ 65%]447tests/test_select_cli.py .... [ 65%]448tests/test_select_engine.py ................. [ 66%]449tests/test_select_head.py ... [ 66%]450tests/test_self_entry_guard.py ............... [ 66%]451tests/test_serve.py .................................................... [ 68%]452.............. [ 69%]453tests/test_serve_perf.py .......... [ 69%]454tests/test_serve_prompts.py ........ [ 70%]455tests/test_session_log.py ............... [ 70%]456tests/test_skill_package.py ..............s...................... [ 71%]457tests/test_skill_packs.py ................ [ 72%]458tests/test_skill_search.py .......... [ 72%]459tests/test_skills.py .s................................................. [ 74%]460.....................ss................................................. [ 77%]461................................................................... [ 80%]462tests/test_smart_compress_e2e.py .................. [ 80%]463tests/test_smart_reachability.py ..... [ 80%]464tests/test_source_tracked.py sss [ 81%]465tests/test_stats_toggle.py ......... [ 81%]466tests/test_status_skills_staleness.py .... [ 81%]467tests/test_statusline_install.py ....................... [ 82%]468tests/test_stderr_pipe_deadlock.py .... [ 82%]469tests/test_subprocess_encoding.py . [ 82%]470tests/test_sync.py ..................................................... [ 84%]471................................................... [ 86%]472tests/test_sync_claims_tree.py ...... [ 86%]473tests/test_tier_claims_consistent.py .... [ 86%]474tests/test_toml_config.py .......................... [ 87%]475tests/test_toon_cross_validate.py ............................... [ 89%]476tests/test_typo_and_flag_validation.py ......... [ 89%]477tests/test_uninstall_end_to_end.py .......... [ 89%]478tests/test_update.py .................... [ 90%]479tests/test_ux_enhancements.py .............................. [ 91%]480tests/test_v02_features.py .................................... [ 92%]481tests/test_v04_features.py ................ [ 93%]482tests/test_v05_features.py ...................... [ 94%]483tests/test_v072_delight.py .....................s.. [ 95%]484tests/test_v073_http_security.py .............................. [ 96%]485tests/test_v074_stdio_timeout.py ............ [ 96%]486tests/test_v076_stateless_serve.py ................... [ 97%]487tests/test_v07_spec2026.py ..................... [ 98%]488tests/test_v081_env_headers.py ............. [ 98%]489tests/test_watch.py .................. [ 99%]490tests/test_xdg.py ............. [100%]491492=================================== FAILURES ===================================493_________________ test_changelog_has_unreleased_delivery_mode __________________494495 def test_changelog_has_unreleased_delivery_mode():496 from pathlib import Path497 root = Path(__file__).resolve().parents[1]498 md = (root / "CHANGELOG.md").read_text(encoding="utf-8")499> assert "## [Unreleased]" in md500E AssertionError: assert '## [Unreleased]' in '# Changelog\n\nAll notable changes to mcptoon will be documented in this file.\n\nThe format is based on [Keep a Chan...n- No reconnection logic for dropped stdio connections\n- Schema cache is not invalidated when server config changes\n'501502tests/test_mode_delivery_surfaces.py:730: AssertionError503=============================== warnings summary ===============================504../../../../../store/cp1hsk9pigafw8kz9xpa6s697019hlq1-python3.14-pytest-9.1.1/lib/python3.14/site-packages/_pytest/config/__init__.py:1464505 /nix/store/cp1hsk9pigafw8kz9xpa6s697019hlq1-python3.14-pytest-9.1.1/lib/python3.14/site-packages/_pytest/config/__init__.py:1464: PytestConfigWarning: Unknown config option: timeout506 507 self._warn_or_fail_if_strict(f"Unknown config option: {key}\n")508509../../../../../store/cp1hsk9pigafw8kz9xpa6s697019hlq1-python3.14-pytest-9.1.1/lib/python3.14/site-packages/_pytest/config/__init__.py:1464510 /nix/store/cp1hsk9pigafw8kz9xpa6s697019hlq1-python3.14-pytest-9.1.1/lib/python3.14/site-packages/_pytest/config/__init__.py:1464: PytestConfigWarning: Unknown config option: timeout_method511 512 self._warn_or_fail_if_strict(f"Unknown config option: {key}\n")513514-- Docs: https://docs.pytest.org/en/stable/how-to/capture-warnings.html515=========================== short test summary info ============================516FAILED tests/test_mode_delivery_surfaces.py::test_changelog_has_unreleased_delivery_mode - AssertionError: assert '## [Unreleased]' in '# Changelog\n\nAll notable cha...517= 1 failed, 2651 passed, 14 skipped, 7 deselected, 2 warnings in 124.78s (0:02:04) =