setup
checks.aarch64-darwin.pkgs-mcptoon
· build #8431
· raw
1these 2 derivations will be built:2 /nix/store/b1cghdkg8zfbbn913lz7m5gwpkqjysyv-mcptoon-0.8.25.drv3 /nix/store/jc5nbcvw65a9gxin61iify9z0w6q1m3x-check-mcptoon.drv4error: build of '/nix/store/b1cghdkg8zfbbn913lz7m5gwpkqjysyv-mcptoon-0.8.25.drv' on 'grpc://farm.numtide.com:50051?client-cert=/run/secrets/vars/per-machine/bld1/nix-farm-ci/crt&client-key=/run/secrets/vars/per-machine/bld1/nix-farm-ci/key&connect-timeout=22&system=aarch64-darwin' failed: Cannot build '/nix/store/b1cghdkg8zfbbn913lz7m5gwpkqjysyv-mcptoon-0.8.25.drv'.5 Reason: builder failed with exit code 1.6 Output paths:7 /nix/store/1fjy9z0nssppp2bvjm3x5y58csnz2a11-mcptoon-0.8.258 /nix/store/jw50gfsqhs6kl60lq7b8z7kgpjggnidg-mcptoon-0.8.25-dist9 Last 25 log lines:10 > _________________ test_changelog_has_unreleased_delivery_mode __________________11 >12 > def test_changelog_has_unreleased_delivery_mode():13 > from pathlib import Path14 > root = Path(__file__).resolve().parents[1]15 > md = (root / "CHANGELOG.md").read_text(encoding="utf-8")16 > > assert "## [Unreleased]" in md17 > E AssertionError: assert '## [Unreleased]' in '# Changelog\n\nAll notable changes to mcptoon will be documented in this file.\n\nThe format is based on [Keep a Chan...n- No reconnection logic for dropped stdio connections\n- Schema cache is not invalidated when server config changes\n'18 >19 > tests/test_mode_delivery_surfaces.py:730: AssertionError20 > =============================== warnings summary ===============================21 > ../../../../../store/cp1hsk9pigafw8kz9xpa6s697019hlq1-python3.14-pytest-9.1.1/lib/python3.14/site-packages/_pytest/config/__init__.py:146422 > /nix/store/cp1hsk9pigafw8kz9xpa6s697019hlq1-python3.14-pytest-9.1.1/lib/python3.14/site-packages/_pytest/config/__init__.py:1464: PytestConfigWarning: Unknown config option: timeout23 >24 > self._warn_or_fail_if_strict(f"Unknown config option: {key}\n")25 >26 > ../../../../../store/cp1hsk9pigafw8kz9xpa6s697019hlq1-python3.14-pytest-9.1.1/lib/python3.14/site-packages/_pytest/config/__init__.py:146427 > /nix/store/cp1hsk9pigafw8kz9xpa6s697019hlq1-python3.14-pytest-9.1.1/lib/python3.14/site-packages/_pytest/config/__init__.py:1464: PytestConfigWarning: Unknown config option: timeout_method28 >29 > self._warn_or_fail_if_strict(f"Unknown config option: {key}\n")30 >31 > -- Docs: https://docs.pytest.org/en/stable/how-to/capture-warnings.html32 > =========================== short test summary info ============================33 > FAILED tests/test_mode_delivery_surfaces.py::test_changelog_has_unreleased_delivery_mode - AssertionError: assert '## [Unreleased]' in '# Changelog\n\nAll notable cha...34 > = 1 failed, 2651 passed, 14 skipped, 7 deselected, 2 warnings in 124.78s (0:02:04) =35 For full logs, run:36 nix log /nix/store/b1cghdkg8zfbbn913lz7m5gwpkqjysyv-mcptoon-0.8.25.drv37error: Cannot build '/nix/store/b1cghdkg8zfbbn913lz7m5gwpkqjysyv-mcptoon-0.8.25.drv'.38 Reason: builder failed with exit code 1.39 Output paths:40 /nix/store/1fjy9z0nssppp2bvjm3x5y58csnz2a11-mcptoon-0.8.2541 /nix/store/jw50gfsqhs6kl60lq7b8z7kgpjggnidg-mcptoon-0.8.25-dist42error: Cannot build '/nix/store/jc5nbcvw65a9gxin61iify9z0w6q1m3x-check-mcptoon.drv'.43 Reason: 1 dependency failed.44 Output paths:45 /nix/store/zkv6gchn49nbf2kcgw4vnabj7kbh06r0-check-mcptoon