nixbot

builds

numtide/llm-agents.nix build #7799 failed

branch main · PR #10873 · commit 66af33cbe7 · · took 57m 53s · eval 1m 9s

eval warnings 4 kinds · 8 occurrences
  • warn setting 'accept-flake-config' is ignored: iets never applies a flake's nixConfig, so a flake that sets extra-substituters or allow-import-from-derivation there runs without them; put the settings in nix.conf ×1
  • warn setting 'plugin-files' is ignored: iets loads no plugins ×1
  • warn stdenv.isLinux is deprecated, use stdenv.hostPlatform.isLinux instead ×3
  • warn stdenv.isDarwin is deprecated, use stdenv.hostPlatform.isDarwin instead ×3

3 failed
failed attributes
status attribute duration
failed checks.aarch64-darwin.pkgs-omp 23m 22s
setup: warning: SQLite database '/nix/var/nix/db/db.sqlite' is busy warning: SQLite database '/nix/var/nix/db/db.sqlite' is busy warning: SQLite database '/nix/ …
setup:
warning: SQLite database '/nix/var/nix/db/db.sqlite' is busy
warning: SQLite database '/nix/var/nix/db/db.sqlite' is busy
warning: SQLite database '/nix/var/nix/db/db.sqlite' is busy
warning: SQLite database '/nix/var/nix/db/db.sqlite' is busy
warning: SQLite database '/nix/var/nix/db/db.sqlite' is busy
warning: SQLite database '/nix/var/nix/db/db.sqlite' is busy
warning: SQLite database '/nix/var/nix/db/db.sqlite' is busy
error: some outputs are unexpectedly invalid
failed checks.aarch64-linux.pkgs-omp 11m 28s
setup: could not copy /nix/store/3sm5hrfw3d0xl5nd019i8j2ilzz9avdk-bun-pkg-tar-7.5.22: error: gRPC FetchNars failed: failed to connect to all addresses; last err …
setup:
could not copy /nix/store/3sm5hrfw3d0xl5nd019i8j2ilzz9avdk-bun-pkg-tar-7.5.22: error: gRPC FetchNars failed: failed to connect to all addresses; last error: UNKNOWN: ipv4:127.0.0.2:50051: tcp handshaker shutdown
could not copy /nix/store/7063rz1gvq6gggmg8d47khfpbc8s8img-bun-pkg-tinyexec-1.3.1: error: gRPC FetchNars failed: failed to connect to all addresses; last error: UNKNOWN: ipv4:127.0.0.2:50051: tcp handshaker shutdown
could not copy /nix/store/r2mrv356wwps67b765jwj4vpx78y25bp-bun-pkg-wrap-ansi-7.0.0: error: gRPC FetchNars failed: failed to connect to all addresses; last error: UNKNOWN: ipv4:127.0.0.2:50051: handshaker shutdown
warning: SQLite database '/nix/var/nix/db/db.sqlite' is busy
warning: SQLite database '/nix/var/nix/db/db.sqlite' is busy
warning: SQLite database '/nix/var/nix/db/db.sqlite' is busy
warning: SQLite database '/nix/var/nix/db/db.sqlite' is busy
error: some outputs are unexpectedly invalid
failed checks.x86_64-linux.pkgs-omp 54m 46s
setup: warning: SQLite database '/nix/var/nix/db/db.sqlite' is busy warning: SQLite database '/nix/var/nix/db/db.sqlite' is busy warning: SQLite database '/nix/ …
setup:
warning: SQLite database '/nix/var/nix/db/db.sqlite' is busy
warning: SQLite database '/nix/var/nix/db/db.sqlite' is busy
warning: SQLite database '/nix/var/nix/db/db.sqlite' is busy
warning: SQLite database '/nix/var/nix/db/db.sqlite' is busy
warning: SQLite database '/nix/var/nix/db/db.sqlite' is busy
warning: SQLite database '/nix/var/nix/db/db.sqlite' is busy
error: timed out after 1200 seconds
error: Cannot build '/nix/store/cd4sd4nsp7nxm1xdlgkvsj8s721xh5pj-check-omp.drv'.
       Reason: 1 dependency failed.
       Output paths:
         /nix/store/8c4rqxfgnl8qprnxyj8v020dqqkighsk-check-omp
13 succeeded
succeeded attributes
status attribute duration
loading…
682 already built
skipped attributes
status attribute duration
loading…