nixbot

builds

numtide/llm-agents.nix build #7798 failed

branch main · PR #10872 · commit 1612227e55 · · took 1h 23m · eval 2m 3s

eval warnings 4 kinds · 8 occurrences
  • warn setting 'accept-flake-config' is ignored: iets never applies a flake's nixConfig, so a flake that sets extra-substituters or allow-import-from-derivation there runs without them; put the settings in nix.conf ×1
  • warn setting 'plugin-files' is ignored: iets loads no plugins ×1
  • warn stdenv.isLinux is deprecated, use stdenv.hostPlatform.isLinux instead ×3
  • warn stdenv.isDarwin is deprecated, use stdenv.hostPlatform.isDarwin instead ×3

13 failed
failed attributes
status attribute duration
failed checks.aarch64-darwin.pkgs-agent-slack 1m 58s
setup: warning: SQLite database '/nix/var/nix/db/db.sqlite' is busy warning: SQLite database '/nix/var/nix/db/db.sqlite' is busy could not copy /nix/store/zgwyc …
setup:
warning: SQLite database '/nix/var/nix/db/db.sqlite' is busy
warning: SQLite database '/nix/var/nix/db/db.sqlite' is busy
could not copy /nix/store/zgwycpwniyj6mpjxa0ks7dkgnlh03bry-bun-pkg-https-proxy-agent-5.0.1: error: gRPC FetchNars failed: failed to connect to all addresses; last error: UNKNOWN: ipv4:65.21.215.17:50051: tcp handshaker shutdown
warning: SQLite database '/nix/var/nix/db/db.sqlite' is busy
warning: SQLite database '/nix/var/nix/db/db.sqlite' is busy
warning: SQLite database '/nix/var/nix/db/db.sqlite' is busy
warning: SQLite database '/nix/var/nix/db/db.sqlite' is busy
error: some outputs are unexpectedly invalid
failed checks.aarch64-darwin.pkgs-hermes-agent 4m 51s
setup: /nix/store/5w0a3fgvvwnsp8h3kr8af53wvxkzykq9-hermes-agent-0.22.0.drv /nix/store/mjm5n79bpxq30w7cmslcipl2r7pxjvxk-check-hermes-agent.drv these 3 paths …
setup:
  /nix/store/5w0a3fgvvwnsp8h3kr8af53wvxkzykq9-hermes-agent-0.22.0.drv
  /nix/store/mjm5n79bpxq30w7cmslcipl2r7pxjvxk-check-hermes-agent.drv
these 3 paths will be fetched (5.9 MiB download, 57.5 MiB unpacked):
  /nix/store/g8i15j0is4np3v4lk9g1xs5ab45r7wad-python3.14-anthropic-1.8.0
  /nix/store/mhnrjcs6ddsazmwv96jjxh2xcjfj4l1j-python3.14-elevenlabs-2.71.0
  /nix/store/pziv9q89gvhdx516hkx54rn2srax5r3n-python3.14-modal-1.5.5
could not copy /nix/store/cmghma1j8sn62mgk22nzipmcmvdfnlbj-hermes-agent-0.22.0-dist: error: gRPC FetchNars failed: failed to connect to all addresses; last error: UNKNOWN: ipv4:127.0.0.2:50051: tcp handshaker shutdown
error: some outputs are unexpectedly invalid
failed checks.aarch64-darwin.pkgs-openresearch 12m 37s
setup: /nix/store/fdxhr394ff0sxzl8gjd5x5na3iqdx9h3-openresearch-0.2.18.drv /nix/store/z0pgkyaf1zd64x3js74xbgyr31ykspl9-check-openresearch.drv these 3 paths …
setup:
  /nix/store/fdxhr394ff0sxzl8gjd5x5na3iqdx9h3-openresearch-0.2.18.drv
  /nix/store/z0pgkyaf1zd64x3js74xbgyr31ykspl9-check-openresearch.drv
these 3 paths will be fetched (1.1 KiB download, 737.8 MiB unpacked):
  /nix/store/6ch1kw1ggm165fi5dar821jqzcp6k2hv-install-agent-skills
  /nix/store/2i9291d5mv1i1c5hv4fp4z5fplmdkrqr-openresearch-0.2.18-vendor
  /nix/store/siwvdpn6fz2d6mmrlywl18if20nssa2j-source
could not copy /nix/store/799143xkvp71jizlz1bgvrm3w1493s0x-openresearch-0.2.18: error: gRPC FetchNars failed: failed to connect to all addresses; last error: UNKNOWN: ipv6:%5B2a01:4f9:3071:1fc8::1%5D:50051: handshaker shutdown
error: some outputs are unexpectedly invalid
failed checks.aarch64-darwin.pkgs-qmd 5m 11s
setup: warning: SQLite database '/nix/var/nix/db/db.sqlite' is busy warning: SQLite database '/nix/var/nix/db/db.sqlite' is busy could not copy /nix/store/wbb5i …
setup:
warning: SQLite database '/nix/var/nix/db/db.sqlite' is busy
warning: SQLite database '/nix/var/nix/db/db.sqlite' is busy
could not copy /nix/store/wbb5isgpz0j0hxf9jrir61v05sj50q4j-bun-pkg-merge2-1.4.1: error: gRPC FetchNars failed: failed to connect to all addresses; last error: UNKNOWN: ipv4:127.0.0.2:50051: tcp handshaker shutdown
could not copy /nix/store/3nyyrjj4p3nbpxfmmsdzq3dm0vl8404h-bun-pkg-micromatch-4.0.8: error: gRPC FetchNars failed: failed to connect to all addresses; last error: UNKNOWN: ipv4:127.0.0.2:50051: tcp handshaker shutdown
could not copy /nix/store/n3vkk75cv69pnf2s3p9agzhp8jj7ykpj-bun-pkg-minimist-1.2.8: error: gRPC FetchNars failed: failed to connect to all addresses; last error: UNKNOWN: ipv6:%5B2a01:4f9:3071:1fc8::1%5D:50051: handshaker shutdown
warning: SQLite database '/nix/var/nix/db/db.sqlite' is busy
warning: SQLite database '/nix/var/nix/db/db.sqlite' is busy
error: some outputs are unexpectedly invalid
failed checks.aarch64-linux.pkgs-agent-slack 1m 0s
setup: /nix/store/fb0sbhz5ni5w0z3z3mscjv01h5cwn5z1-tinypool-2.1.0.tgz /nix/store/35csvd7g5x8bwpjxpxvq97qlks23x1r8-turndown-plugin-gfm-1.0.2.tgz /nix/store …
setup:
  /nix/store/fb0sbhz5ni5w0z3z3mscjv01h5cwn5z1-tinypool-2.1.0.tgz
  /nix/store/35csvd7g5x8bwpjxpxvq97qlks23x1r8-turndown-plugin-gfm-1.0.2.tgz
  /nix/store/7q4cqc59f5pnvh220vd9zqzxv5msnjwr-types-2.19.0.tgz
  /nix/store/ry240sp8skdqzps4zvg4qi1iy6b1a16m-typescript-5.9.3.tgz
  /nix/store/lgimxzg7va79lqx79gkzisvxnbxqlkjk-unicode-emoji-modifier-base-1.0.0.tgz
  /nix/store/cmwjccyyrwnisp8wijiy4g52cgx9h4ai-web-api-7.13.0.tgz
could not copy /nix/store/49rdwy5gvbj8v4c50zryv8pq1p60jbg9-bun-pkg--oxfmt-binding-darwin-arm64-0.31.0: error: gRPC FetchNars failed: failed to connect to all addresses; last error: UNKNOWN: ipv4:65.21.215.17:50051: connection attempt timed out before receiving SETTINGS frame
error: some outputs are unexpectedly invalid
failed checks.aarch64-linux.pkgs-hindsight 10m 27s
setup: /nix/store/q2426fqz1ccs04zcnz0yxxs467mm0jl1-tk-9.0.4 /nix/store/5981v4ndky1arxb3rvkk8p5j493icfx7-tk-9.0.4-man /nix/store/ysc9zvrjvajd7ir43cgngwmqrz …
setup:
  /nix/store/q2426fqz1ccs04zcnz0yxxs467mm0jl1-tk-9.0.4
  /nix/store/5981v4ndky1arxb3rvkk8p5j493icfx7-tk-9.0.4-man
  /nix/store/ysc9zvrjvajd7ir43cgngwmqrzd5947n-xerces-c-3.3.0
  /nix/store/cib29xryaiq43icyw4kd8xdqjps2dalw-zlib-ng-2.3.3-dev
warning: SQLite database '/nix/var/nix/db/db.sqlite' is busy
warning: SQLite database '/nix/var/nix/db/db.sqlite' is busy
could not copy /nix/store/1bc8afk9qjjinxfbqzn604bqhd1xdzvh-python3.14-geoarrow-pyarrow-0.3.0-dist: error: gRPC FetchNars failed: failed to connect to all addresses; last error: UNKNOWN: ipv4:127.0.0.2:50051: handshaker shutdown
error: some outputs are unexpectedly invalid
failed checks.aarch64-linux.pkgs-qmd 1m 10s
setup: /nix/store/v2i4yifinjdmd95zqnhsylnw7bk1047z-win32-x64-0.27.3.tgz /nix/store/nsxf7gw199nnhiqay5y0k6lzxh0z5yca-yargs-17.7.2.tgz /nix/store/4zi6x5plmi …
setup:
  /nix/store/v2i4yifinjdmd95zqnhsylnw7bk1047z-win32-x64-0.27.3.tgz
  /nix/store/nsxf7gw199nnhiqay5y0k6lzxh0z5yca-yargs-17.7.2.tgz
  /nix/store/4zi6x5plmi33wli7xpv8h8ddd5xvg578-yargs-parser-21.1.1.tgz
  /nix/store/ifsqqhgvavk4hbn5z3zyw3p6f9dhhaf2-yoctocolors-2.1.2.tgz
  /nix/store/1pbvb9rkhljmvbvr7lbd81ckjn6abln4-zod-4.2.1.tgz
could not copy /nix/store/vwddjfgfxgx80bqifqk16yd105860hm1-bun-pkg--esbuild-linux-arm-0.28.2: error: gRPC FetchNars failed: failed to connect to all addresses; last error: UNKNOWN: ipv4:65.21.215.17:50051: handshaker shutdown
warning: SQLite database '/nix/var/nix/db/db.sqlite' is busy
error: some outputs are unexpectedly invalid
failed checks.x86_64-linux.pkgs-agent-browser 29m 5s
setup: these 2 derivations will be built: /nix/store/h5xxy5vxl6vw6wif2qnrnirha24b5ybb-agent-browser-0.39.1.drv /nix/store/3jdjzifspdnxvydi6vx9j9jypfj4rga8-c …
setup:
these 2 derivations will be built:
  /nix/store/h5xxy5vxl6vw6wif2qnrnirha24b5ybb-agent-browser-0.39.1.drv
  /nix/store/3jdjzifspdnxvydi6vx9j9jypfj4rga8-check-agent-browser.drv
these 2 paths will be fetched (0.0 KiB download, 385.7 MiB unpacked):
  /nix/store/2z3yhva964nfilj7q479n7jgzxp4jyrb-agent-browser-0.39.1-vendor
  /nix/store/84jhhmgylq60sq27j395z8c96ha37vhm-agent-browser-dashboard-0.39.1
error: timed out after 1200 seconds
error: Cannot build '/nix/store/3jdjzifspdnxvydi6vx9j9jypfj4rga8-check-agent-browser.drv'.
       Reason: 1 dependency failed.
       Output paths:
         /nix/store/148a4vckqblzfi53dyrj2j05c4rzxaa2-check-agent-browser
failed checks.x86_64-linux.pkgs-git-ai 52m 52s
setup: these 2 derivations will be built: /nix/store/zx70diqnfyj1gf8rg896vdvd84yvpaqg-git-ai-1.7.5.drv /nix/store/c2bbmh70cbiba8rahab1ap3y78y4wh1j-check-git …
setup:
these 2 derivations will be built:
  /nix/store/zx70diqnfyj1gf8rg896vdvd84yvpaqg-git-ai-1.7.5.drv
  /nix/store/c2bbmh70cbiba8rahab1ap3y78y4wh1j-check-git-ai.drv
this path will be fetched (0.0 KiB download, 570.9 MiB unpacked):
  /nix/store/xw2v4w2l74hl9fxnsm5mrbswflk0ris9-git-ai-1.7.5-vendor
error: timed out after 1200 seconds
error: Cannot build '/nix/store/c2bbmh70cbiba8rahab1ap3y78y4wh1j-check-git-ai.drv'.
       Reason: 1 dependency failed.
       Output paths:
         /nix/store/1l5mqphv6flzbkqyxp51hbgr3m8d6lp7-check-git-ai
failed checks.x86_64-linux.pkgs-herdr 24m 52s
setup: these 5 paths will be fetched (1.1 KiB download, 902.7 MiB unpacked): /nix/store/6vky4vmj4xnrypxlizc5fk9bgfkjsry2-herdr-0.9.5-vendor /nix/store/sysc2 …
setup:
these 5 paths will be fetched (1.1 KiB download, 902.7 MiB unpacked):
  /nix/store/6vky4vmj4xnrypxlizc5fk9bgfkjsry2-herdr-0.9.5-vendor
  /nix/store/sysc2z9f8c3n87mjrxhlm8q1phk422pd-herdr-0.9.5-zig-deps
  /nix/store/h03vh7qw5dspsxpli5gk9gkkdgfdcz9i-install-agent-skills
  /nix/store/m46g1ic5khx688hfy0mlhcsm7hg1vzs4-source
  /nix/store/qsk2cha4nk70bpz53qix9mypj4mjcbsr-zig-0.16.0
error: timed out after 1200 seconds
error: Cannot build '/nix/store/h0i37rq2wxmjj8cfwyajzdndg2jc81vj-check-herdr.drv'.
       Reason: 1 dependency failed.
       Output paths:
         /nix/store/1avid081b11bqi64xrfjax0wrwv9i2r4-check-herdr
failed checks.x86_64-linux.pkgs-officecli 23m 39s
setup: warning: SQLite database '/nix/var/nix/db/db.sqlite' is busy warning: SQLite database '/nix/var/nix/db/db.sqlite' is busy warning: SQLite database '/nix/ …
setup:
warning: SQLite database '/nix/var/nix/db/db.sqlite' is busy
warning: SQLite database '/nix/var/nix/db/db.sqlite' is busy
warning: SQLite database '/nix/var/nix/db/db.sqlite' is busy
warning: SQLite database '/nix/var/nix/db/db.sqlite' is busy
warning: SQLite database '/nix/var/nix/db/db.sqlite' is busy
warning: SQLite database '/nix/var/nix/db/db.sqlite' is busy
error: timed out after 1200 seconds
error: Cannot build '/nix/store/s9rn79r51ar2q8vx4drfj97dd1d8sf91-check-officecli.drv'.
       Reason: 1 dependency failed.
       Output paths:
         /nix/store/qa633l121cjjyp8sxh3i5p51k2r94vhf-check-officecli
failed checks.x86_64-linux.pkgs-openresearch 33m 28s
setup: these 2 derivations will be built: /nix/store/gsnqdrcqrn7b6zhs3ws7ljgmjrm506wj-openresearch-0.2.18.drv /nix/store/4wfbccnfir2xhwyn2hgyaj31vgydz32i-ch …
setup:
these 2 derivations will be built:
  /nix/store/gsnqdrcqrn7b6zhs3ws7ljgmjrm506wj-openresearch-0.2.18.drv
  /nix/store/4wfbccnfir2xhwyn2hgyaj31vgydz32i-check-openresearch.drv
this path will be fetched (0.0 KiB download, 717.2 MiB unpacked):
  /nix/store/x4pdk8f80f59kyzc2gambyqk0all41bx-openresearch-0.2.18-vendor
error: timed out after 1200 seconds
error: Cannot build '/nix/store/4wfbccnfir2xhwyn2hgyaj31vgydz32i-check-openresearch.drv'.
       Reason: 1 dependency failed.
       Output paths:
         /nix/store/1bck0srxb82jggxmp9fis63grfijgcnw-check-openresearch
failed checks.x86_64-linux.pkgs-workmux 29m 24s
setup: these 2 derivations will be built: /nix/store/m12r69q6alfp7fc8lpf42l5413xs2kxp-workmux-0.1.276.drv /nix/store/y4kqg5npdfw3xviickz7qpx1956z1n9i-check- …
setup:
these 2 derivations will be built:
  /nix/store/m12r69q6alfp7fc8lpf42l5413xs2kxp-workmux-0.1.276.drv
  /nix/store/y4kqg5npdfw3xviickz7qpx1956z1n9i-check-workmux.drv
this path will be fetched (0.0 KiB download, 446.6 MiB unpacked):
  /nix/store/ahvz0f9v077ijz3dimdbibv1fl9x321y-workmux-0.1.276-vendor
error: timed out after 1200 seconds
error: Cannot build '/nix/store/y4kqg5npdfw3xviickz7qpx1956z1n9i-check-workmux.drv'.
       Reason: 1 dependency failed.
       Output paths:
         /nix/store/cq6mq9h13hzd84hrgvmf99s8j1i7kwwj-check-workmux
86 succeeded
succeeded attributes
status attribute duration
loading…
599 already built
skipped attributes
status attribute duration
loading…