1these 2 derivations will be built:2 /nix/store/9i92ck9fyf21z8r6w1rwwl5fqvg7hfx9-openresearch-0.2.14.drv3 /nix/store/g4qs9vphfv5nh5w3i6ci6wv9ww21r9c2-check-openresearch.drv4error: Cannot build '/nix/store/9i92ck9fyf21z8r6w1rwwl5fqvg7hfx9-openresearch-0.2.14.drv'.5 Reason: builder failed with exit code 101.6 Output paths:7 /nix/store/ddcgbbi4hmhylvj583v2jrjhzzv8p9kr-openresearch-0.2.148 Last 25 log lines:9 > test slurm_supervisor_survives_connection_and_accounting_loss ... FAILED10 > test ssh_config_conflict_and_execution_target_checks ... ok11 > test standalone_settings_defaults_and_instruction_conflicts ... ok12 >13 > failures:14 >15 > ---- slurm_cancel_requires_acknowledgement_and_survives_restart_without_accounting stdout ----16 >17 > thread 'slurm_cancel_requires_acknowledgement_and_survives_restart_without_accounting' (9593) panicked at tests/compute_cli.rs:449:13:18 > assertion failed: Instant::now() < deadline19 > note: run with `RUST_BACKTRACE=1` environment variable to display a backtrace20 >21 > ---- slurm_supervisor_survives_connection_and_accounting_loss stdout ----22 >23 > thread 'slurm_supervisor_survives_connection_and_accounting_loss' (9857) panicked at tests/compute_cli.rs:250:13:24 > supervisor did not reach expected state25 >26 >27 > failures:28 > slurm_cancel_requires_acknowledgement_and_survives_restart_without_accounting29 > slurm_supervisor_survives_connection_and_accounting_loss30 >31 > test result: FAILED. 7 passed; 2 failed; 0 ignored; 0 measured; 0 filtered out; finished in 100.54s32 >33 > error: test failed, to rerun pass `--test compute_cli`34 For full logs, run:35 nix log /nix/store/9i92ck9fyf21z8r6w1rwwl5fqvg7hfx9-openresearch-0.2.14.drv36error: Cannot build '/nix/store/g4qs9vphfv5nh5w3i6ci6wv9ww21r9c2-check-openresearch.drv'.37 Reason: 1 dependency failed.38 Output paths:39 /nix/store/w2xxh0flhfid8mqva4jyspczy8hxvfrj-check-openresearch