these 2 derivations will be built: /nix/store/9i92ck9fyf21z8r6w1rwwl5fqvg7hfx9-openresearch-0.2.14.drv /nix/store/g4qs9vphfv5nh5w3i6ci6wv9ww21r9c2-check-openresearch.drv error: Cannot build '/nix/store/9i92ck9fyf21z8r6w1rwwl5fqvg7hfx9-openresearch-0.2.14.drv'. Reason: builder failed with exit code 101. Output paths: /nix/store/ddcgbbi4hmhylvj583v2jrjhzzv8p9kr-openresearch-0.2.14 Last 25 log lines: > test slurm_supervisor_survives_connection_and_accounting_loss ... FAILED > test ssh_config_conflict_and_execution_target_checks ... ok > test standalone_settings_defaults_and_instruction_conflicts ... ok > > failures: > > ---- slurm_cancel_requires_acknowledgement_and_survives_restart_without_accounting stdout ---- > > thread 'slurm_cancel_requires_acknowledgement_and_survives_restart_without_accounting' (9593) panicked at tests/compute_cli.rs:449:13: > assertion failed: Instant::now() < deadline > note: run with `RUST_BACKTRACE=1` environment variable to display a backtrace > > ---- slurm_supervisor_survives_connection_and_accounting_loss stdout ---- > > thread 'slurm_supervisor_survives_connection_and_accounting_loss' (9857) panicked at tests/compute_cli.rs:250:13: > supervisor did not reach expected state > > > failures: > slurm_cancel_requires_acknowledgement_and_survives_restart_without_accounting > slurm_supervisor_survives_connection_and_accounting_loss > > test result: FAILED. 7 passed; 2 failed; 0 ignored; 0 measured; 0 filtered out; finished in 100.54s > > error: test failed, to rerun pass `--test compute_cli` For full logs, run: nix log /nix/store/9i92ck9fyf21z8r6w1rwwl5fqvg7hfx9-openresearch-0.2.14.drv error: Cannot build '/nix/store/g4qs9vphfv5nh5w3i6ci6wv9ww21r9c2-check-openresearch.drv'. Reason: 1 dependency failed. Output paths: /nix/store/w2xxh0flhfid8mqva4jyspczy8hxvfrj-check-openresearch