nixbot

builds
1these 3 derivations will be built:2 /nix/store/si0q53lhfzvdfghl4dfy8zlis4xciifp-openresearch-0.2.13-vendor.drv3 /nix/store/3nis9cqfd1inlza86zqih6rlhaian52q-openresearch-0.2.13.drv4 /nix/store/dilfsc65cckfm8k8slvnbd7s7p6mkn11-check-openresearch.drv5error: Cannot build '/nix/store/3nis9cqfd1inlza86zqih6rlhaian52q-openresearch-0.2.13.drv'.6 Reason: builder failed with exit code 101.7 Output paths:8 /nix/store/h9n3yf76qgdjib2rvnnabr0vfkd59k4n-openresearch-0.2.139 Last 25 log lines:10 > test slurm_supervisor_survives_connection_and_accounting_loss ... FAILED11 > test ssh_config_conflict_and_execution_target_checks ... ok12 > test standalone_settings_defaults_and_instruction_conflicts ... ok13 >14 > failures:15 >16 > ---- slurm_cancel_requires_acknowledgement_and_survives_restart_without_accounting stdout ----17 >18 > thread 'slurm_cancel_requires_acknowledgement_and_survives_restart_without_accounting' (9376) panicked at tests/compute_cli.rs:444:13:19 > assertion failed: Instant::now() < deadline20 > note: run with `RUST_BACKTRACE=1` environment variable to display a backtrace21 >22 > ---- slurm_supervisor_survives_connection_and_accounting_loss stdout ----23 >24 > thread 'slurm_supervisor_survives_connection_and_accounting_loss' (9640) panicked at tests/compute_cli.rs:250:13:25 > supervisor did not reach expected state26 >27 >28 > failures:29 > slurm_cancel_requires_acknowledgement_and_survives_restart_without_accounting30 > slurm_supervisor_survives_connection_and_accounting_loss31 >32 > test result: FAILED. 7 passed; 2 failed; 0 ignored; 0 measured; 0 filtered out; finished in 30.40s33 >34 > error: test failed, to rerun pass `--test compute_cli`35 For full logs, run:36 nix log /nix/store/3nis9cqfd1inlza86zqih6rlhaian52q-openresearch-0.2.13.drv37error: Cannot build '/nix/store/dilfsc65cckfm8k8slvnbd7s7p6mkn11-check-openresearch.drv'.38 Reason: 1 dependency failed.39 Output paths:40 /nix/store/w88nhcs0jlah11navydrzkyadd7fgrfi-check-openresearch