these 3 derivations will be built: /nix/store/si0q53lhfzvdfghl4dfy8zlis4xciifp-openresearch-0.2.13-vendor.drv /nix/store/3nis9cqfd1inlza86zqih6rlhaian52q-openresearch-0.2.13.drv /nix/store/dilfsc65cckfm8k8slvnbd7s7p6mkn11-check-openresearch.drv error: Cannot build '/nix/store/3nis9cqfd1inlza86zqih6rlhaian52q-openresearch-0.2.13.drv'. Reason: builder failed with exit code 101. Output paths: /nix/store/h9n3yf76qgdjib2rvnnabr0vfkd59k4n-openresearch-0.2.13 Last 25 log lines: > test slurm_supervisor_survives_connection_and_accounting_loss ... FAILED > test ssh_config_conflict_and_execution_target_checks ... ok > test standalone_settings_defaults_and_instruction_conflicts ... ok > > failures: > > ---- slurm_cancel_requires_acknowledgement_and_survives_restart_without_accounting stdout ---- > > thread 'slurm_cancel_requires_acknowledgement_and_survives_restart_without_accounting' (9376) panicked at tests/compute_cli.rs:444:13: > assertion failed: Instant::now() < deadline > note: run with `RUST_BACKTRACE=1` environment variable to display a backtrace > > ---- slurm_supervisor_survives_connection_and_accounting_loss stdout ---- > > thread 'slurm_supervisor_survives_connection_and_accounting_loss' (9640) panicked at tests/compute_cli.rs:250:13: > supervisor did not reach expected state > > > failures: > slurm_cancel_requires_acknowledgement_and_survives_restart_without_accounting > slurm_supervisor_survives_connection_and_accounting_loss > > test result: FAILED. 7 passed; 2 failed; 0 ignored; 0 measured; 0 filtered out; finished in 30.40s > > error: test failed, to rerun pass `--test compute_cli` For full logs, run: nix log /nix/store/3nis9cqfd1inlza86zqih6rlhaian52q-openresearch-0.2.13.drv error: Cannot build '/nix/store/dilfsc65cckfm8k8slvnbd7s7p6mkn11-check-openresearch.drv'. Reason: 1 dependency failed. Output paths: /nix/store/w88nhcs0jlah11navydrzkyadd7fgrfi-check-openresearch