setup
checks.x86_64-linux.pkgs-clauth
· build #5613
· raw
1these 2 derivations will be built:2 /nix/store/j61wwqnx9hr314nkdhww6f501hl7922j-clauth-0.16.0.drv3 /nix/store/l12y3qk3bhwa7vc7nd73s6r3pa1ywazq-check-clauth.drv4error: Cannot build '/nix/store/j61wwqnx9hr314nkdhww6f501hl7922j-clauth-0.16.0.drv'.5 Reason: builder failed with exit code 101.6 Output paths:7 /nix/store/rsh9slwly2rklqby19f6jrd97zg2bs8i-clauth-0.16.08 Last 25 log lines:9 > test which::tests::json_tier_reports_the_cached_plan_over_the_token_claim ... ok10 > test which::tests::resolve_global_ignores_claude_config_dir_in_the_readers_env ... ok11 >12 > failures:13 >14 > ---- daemon::api::terminal::tests::strip_session_env_removes_every_session_var stdout ----15 >16 > thread 'daemon::api::terminal::tests::strip_session_env_removes_every_session_var' (6393) panicked at src/daemon/api/../../../tests/inline/daemon_api_terminal.rs:167:28:17 > run env: Os { code: 2, kind: NotFound, message: "No such file or directory" }18 >19 > ---- daemon::api::routes::tests::an_unreadable_device_list_refuses_every_request stdout ----20 >21 > thread 'daemon::api::routes::tests::an_unreadable_device_list_refuses_every_request' (6343) panicked at src/daemon/api/../../../tests/inline/daemon_api_routes.rs:2297:5:22 > assertion `left == right` failed23 > left: 024 > right: 125 >26 >27 > failures:28 > daemon::api::routes::tests::an_unreadable_device_list_refuses_every_request29 > daemon::api::terminal::tests::strip_session_env_removes_every_session_var30 >31 > test result: FAILED. 4155 passed; 2 failed; 1 ignored; 0 measured; 6 filtered out; finished in 591.08s32 >33 > error: test failed, to rerun pass `--bin clauth`34 For full logs, run:35 nix log /nix/store/j61wwqnx9hr314nkdhww6f501hl7922j-clauth-0.16.0.drv36error: Cannot build '/nix/store/l12y3qk3bhwa7vc7nd73s6r3pa1ywazq-check-clauth.drv'.37 Reason: 1 dependency failed.38 Output paths:39 /nix/store/09q7fww2vdh1k0lr8yk05xh0165qrwrp-check-clauth