these 2 derivations will be built: /nix/store/j61wwqnx9hr314nkdhww6f501hl7922j-clauth-0.16.0.drv /nix/store/l12y3qk3bhwa7vc7nd73s6r3pa1ywazq-check-clauth.drv error: Cannot build '/nix/store/j61wwqnx9hr314nkdhww6f501hl7922j-clauth-0.16.0.drv'. Reason: builder failed with exit code 101. Output paths: /nix/store/rsh9slwly2rklqby19f6jrd97zg2bs8i-clauth-0.16.0 Last 25 log lines: > test which::tests::json_tier_reports_the_cached_plan_over_the_token_claim ... ok > test which::tests::resolve_global_ignores_claude_config_dir_in_the_readers_env ... ok > > failures: > > ---- daemon::api::terminal::tests::strip_session_env_removes_every_session_var stdout ---- > > thread 'daemon::api::terminal::tests::strip_session_env_removes_every_session_var' (6393) panicked at src/daemon/api/../../../tests/inline/daemon_api_terminal.rs:167:28: > run env: Os { code: 2, kind: NotFound, message: "No such file or directory" } > > ---- daemon::api::routes::tests::an_unreadable_device_list_refuses_every_request stdout ---- > > thread 'daemon::api::routes::tests::an_unreadable_device_list_refuses_every_request' (6343) panicked at src/daemon/api/../../../tests/inline/daemon_api_routes.rs:2297:5: > assertion `left == right` failed > left: 0 > right: 1 > > > failures: > daemon::api::routes::tests::an_unreadable_device_list_refuses_every_request > daemon::api::terminal::tests::strip_session_env_removes_every_session_var > > test result: FAILED. 4155 passed; 2 failed; 1 ignored; 0 measured; 6 filtered out; finished in 591.08s > > error: test failed, to rerun pass `--bin clauth` For full logs, run: nix log /nix/store/j61wwqnx9hr314nkdhww6f501hl7922j-clauth-0.16.0.drv error: Cannot build '/nix/store/l12y3qk3bhwa7vc7nd73s6r3pa1ywazq-check-clauth.drv'. Reason: 1 dependency failed. Output paths: /nix/store/09q7fww2vdh1k0lr8yk05xh0165qrwrp-check-clauth