iets-nextest-0.1.0
checks.x86_64-linux.test
· build #80
· raw
unpackPhase
1unpacking source archive /nix/store/1qbzya6yj3vfi7w6hqnj8acmj4z3fk24-source2source root is sourcepatchPhase
3Executing configureCargoCommonVars4decompressing cargo artifacts from /nix/store/m3h2vrllwkg71qk2n21gz9kxsd8gxvik-iets-deps-0.1.0/target.tar.zst to targetconfigurePhase
5will append /build/source/.cargo-home/config.toml with contents of /nix/store/kcp4b936hbdmdqyk70cz6fyd4gnf3msb-vendor-cargo-deps/config.toml6default configurePhase, nothing to dobuildPhase
7+++ command cargo --version8cargo 1.98.0 (797e8a9bc 2026-08-05)9+++ command cargo nextest --version10cargo-nextest 0.9.14311release: 0.9.14312host: x86_64-unknown-linux-gnucheckPhase
13+++ command cargo nextest run --cargo-profile dev14 Compiling iets v0.1.0 (/build/source)15 Finished `dev` profile [unoptimized + debuginfo] target(s) in 7m 41s16------------17 Nextest run ID 79550186-7dcc-4c85-8feb-10d4bd87d662 with nextest profile: default18 Starting 521 tests across 12 binaries (5 tests skipped)19 PASS [ 0.101s] ( 1/521) iets api::installable::tests::the_name_a_program_takes_from_a_derivation_name20 PASS [ 0.096s] ( 2/521) iets build::event::tests::durations21 PASS [ 0.118s] ( 3/521) iets api::drvshow::tests::pretty_matches_serde_json22 PASS [ 0.136s] ( 4/521) iets api::drvshow::tests::floats_take_nlohmanns_form23 PASS [ 0.164s] ( 5/521) iets api::drvshow::tests::a_non_canonical_structured_attrs_text_is_renormalised24 PASS [ 0.156s] ( 6/521) iets build::render::tests::a_failure_after_the_activity_ended_never_claims_a_success25 PASS [ 0.155s] ( 7/521) iets build::render::tests::a_stalled_build_that_fails_still_shows_its_cause26 PASS [ 0.172s] ( 8/521) iets build::fanout::tests::a_failed_dependency_blocks_its_dependants27 PASS [ 0.151s] ( 9/521) iets build::render::tests::an_unfolded_success_ends_with_its_verdict28 PASS [ 0.199s] ( 10/521) iets build::backend::tests::base_names_drop_the_store_dir29 PASS [ 0.204s] ( 11/521) iets build::render::tests::an_owned_build_is_verdicted_once_by_its_op30 PASS [ 0.207s] ( 12/521) iets api::installable::tests::default_and_fragment_attr_paths31 PASS [ 0.156s] ( 13/521) iets build::render::tests::a_daemon_failure_message_decides_the_verdict32 PASS [ 0.197s] ( 14/521) iets build::backend::tests::the_timings_report_with_every_line33 PASS [ 0.193s] ( 15/521) iets argv::tests::every_byte_round_trips34 PASS [ 0.159s] ( 16/521) iets build::fixhash::tests::a_longer_hash_is_not_a_match35 PASS [ 0.181s] ( 17/521) iets build::executor::tests::a_feature_the_place_lacks_rules_it_out36 PASS [ 0.216s] ( 18/521) iets api::drvshow::tests::inputs_and_structured_attrs37 PASS [ 0.174s] ( 19/521) iets build::executor::tests::the_first_place_that_takes_it_wins38 PASS [ 0.087s] ( 20/521) iets build::render::tests::logs_of_two_builds_do_not_interleave39 PASS [ 0.174s] ( 21/521) iets build::executor::tests::an_unsupported_url_says_what_is_expected40 PASS [ 0.197s] ( 22/521) iets build::backend::tests::output_specs41 PASS [ 0.175s] ( 23/521) iets build::executor::tests::one_place_declaring_nothing_takes_everything42 PASS [ 0.225s] ( 24/521) iets api::drvshow::tests::a_fixed_output_shows_its_content_address_and_no_path43 PASS [ 0.196s] ( 25/521) iets build::executor::tests::a_refusal_names_every_place_and_what_it_declared44 PASS [ 0.160s] ( 26/521) iets build::fixhash::tests::two_matches_are_left_alone45 PASS [ 0.195s] ( 27/521) iets build::executor::tests::a_declared_system_filters46 PASS [ 0.279s] ( 28/521) iets api::drvshow::tests::a_multi_output_derivation47 PASS [ 0.271s] ( 29/521) iets api::fetch::tests::the_fake_hash_moves_the_output_and_the_drv48 PASS [ 0.229s] ( 30/521) iets build::executor::tests::no_place_at_all_is_a_usage_error49 PASS [ 0.270s] ( 31/521) iets api::fetch::tests::only_a_fixed_output_drv_can_be_prefetched50 PASS [ 0.214s] ( 32/521) iets build::fixhash::tests::one_match_is_rewritten_in_its_own_spelling51 PASS [ 0.115s] ( 33/521) iets build::render::tests::tty_keeps_successful_logs_off_the_screen52 PASS [ 0.230s] ( 34/521) iets build::fanout::tests::dependencies_run_first53 PASS [ 0.241s] ( 35/521) iets build::fanout::tests::at_most_limit_builds_run_at_once54 PASS [ 0.185s] ( 36/521) iets build::render::tests::ci_folds_a_success_and_never_a_failure55 PASS [ 0.181s] ( 37/521) iets build::render::tests::heartbeat_names_running_builds56 PASS [ 0.068s] ( 38/521) iets builtins::store_hooks::tests::virtual_tree_reads_go_to_the_local_files57 PASS [ 0.110s] ( 39/521) iets build::tests::targets_become_jobs58 PASS [ 0.036s] ( 40/521) iets cachefs::tests::a_wipe_keeps_what_iets_did_not_create59 PASS [ 0.130s] ( 41/521) iets build::tests::hash_stripping60 PASS [ 0.019s] ( 42/521) iets cachefs::tests::an_input_store_of_the_spool_layout_is_wiped61 PASS [ 0.327s] ( 43/521) iets api::value::tests::thunk_reads_as_thunk62 PASS [ 0.257s] ( 44/521) iets build::render::tests::drv_paths_of_a_failure_message63 PASS [ 0.069s] ( 45/521) iets cachefs::tests::a_wait_lock_waits_for_its_holder64 PASS [ 0.010s] ( 46/521) iets cachefs::tests::sweep_ages_a_root_by_its_link_not_by_what_it_names65 PASS [ 0.036s] ( 47/521) iets cachefs::tests::an_empty_directory_is_ours_to_take66 PASS [ 0.023s] ( 48/521) iets cachefs::tests::garbled_stamp_wipes_the_store67 PASS [ 0.143s] ( 49/521) iets builtins::derivation::tests::the_two_placeholders_are_not_the_same68 PASS [ 0.140s] ( 50/521) iets builtins::fetch_git::tests::only_a_plain_rev_or_ref_is_read_by_iets69 PASS [ 0.026s] ( 51/521) iets cachefs::tests::sweep_drops_old_entries_and_keeps_young_ones70 PASS [ 0.016s] ( 52/521) iets cli::build::tests::an_out_flag_that_matches_nothing_is_named71 PASS [ 0.025s] ( 53/521) iets cli::build::tests::no_build_result_is_named72 PASS [ 0.014s] ( 54/521) iets cli::build::tests::no_outcome_at_all_is_named73 PASS [ 0.411s] ( 55/521) iets api::run::tests::a_fiber_template_carries_the_configuration74 PASS [ 0.016s] ( 56/521) iets cli::classic::shell::tests::declares_for_every_bash_shaped_value75 PASS [ 0.168s] ( 57/521) iets builtins::text::fromtoml::tests::new_escapes_are_refused76 PASS [ 0.018s] ( 58/521) iets cli::classic::shell::tests::outputs_become_placeholders77 PASS [ 0.196s] ( 59/521) iets cachefs::tests::version_mismatch_wipes_the_store78 PASS [ 0.228s] ( 60/521) iets cachefs::tests::sweep_walks_the_shards_of_the_ir_cache79 PASS [ 0.541s] ( 61/521) iets build::render::tests::a_build_log_never_reports_a_mismatch80 PASS [ 0.385s] ( 62/521) iets build::tests::a_fan_out_backend_keeps_the_cap_and_the_log_blocks81 PASS [ 0.177s] ( 63/521) iets cli::classic::tests::a_flag_with_no_effect_is_noted_and_one_that_holds_is_not82 PASS [ 0.393s] ( 64/521) iets build::tests::a_target_with_no_verdict_fails83 PASS [ 0.569s] ( 65/521) iets cli::build::tests::a_failed_build_reports_itself84 PASS [ 0.597s] ( 66/521) iets cachefs::tests::the_writer_lock_excludes_one_holder_at_a_time85 PASS [ 1.163s] ( 67/521) iets api::value::tests::missing_attribute86 PASS [ 1.155s] ( 68/521) iets builtins::store_hooks::tests::a_relative_path_inside_an_entry_joins_once87 PASS [ 1.104s] ( 69/521) iets cli::docs::tests::the_topic_list_fits_80_columns88 PASS [ 0.891s] ( 70/521) iets cli::plumbing::tests::a_url_is_the_positional_fetch_takes_itself89 PASS [ 1.300s] ( 71/521) iets cli::docs::tests::topics_resolve_bare_and_qualified90 PASS [ 1.811s] ( 72/521) iets builtins::text::regex::tests::names91 PASS [ 0.228s] ( 73/521) iets cli::search::tests::index_round_trip92 PASS [ 2.057s] ( 74/521) iets cachefs::tests::a_lock_that_cannot_be_opened_is_not_a_busy_lock93 PASS [ 1.419s] ( 75/521) iets cli::plumbing::tests::a_file_url_needs_one_slash_not_three94 PASS [ 2.098s] ( 76/521) iets builtins::text::fromtoml::tests::inline_tables_stay_on_one_line95 PASS [ 0.787s] ( 77/521) iets cli::search::tests::drv_names96 PASS [ 2.214s] ( 78/521) iets cachefs::tests::a_directory_that_is_not_ours_is_refused_untouched97 PASS [ 2.200s] ( 79/521) iets cachefs::tests::a_store_without_a_version_file_is_wiped_once98 PASS [ 2.200s] ( 80/521) iets cachefs::tests::a_touch_inside_the_interval_writes_nothing99 PASS [ 2.223s] ( 81/521) iets cachefs::tests::a_stamp_in_the_future_is_due100 PASS [ 1.897s] ( 82/521) iets cli::help::tests::a_mistyped_command_is_suggested101 PASS [ 2.224s] ( 83/521) iets cachefs::tests::a_sweep_runs_once_per_interval102 PASS [ 2.101s] ( 84/521) iets cli::docs::tests::every_embedded_page_has_a_heading103 PASS [ 2.256s] ( 85/521) iets builtins::text::regex::tests::size_limit104 PASS [ 2.124s] ( 86/521) iets cli::classic::shell::tests::sh_var_names105 PASS [ 1.931s] ( 87/521) iets cli::help::tests::suggestions_come_from_the_help106 PASS [ 2.356s] ( 88/521) iets builtins::derivation::tests::a_dynamic_output_renders_the_placeholder_nix_renders107 PASS [ 2.248s] ( 89/521) iets cachefs::tests::a_wipe_of_the_ir_cache_walks_its_shards108 PASS [ 1.985s] ( 90/521) iets cli::help::tests::help_fits_80_columns109 PASS [ 0.046s] ( 91/521) iets config::tests::the_setting_tables_name_nix_settings110 PASS [ 2.211s] ( 92/521) iets cli::diff::tests::a_name_ends_at_the_first_dash_before_a_digit111 PASS [ 2.276s] ( 93/521) iets cli::build::tests::a_path_on_stdout_is_silent112 PASS [ 2.056s] ( 94/521) iets cli::help::tests::messages113 PASS [ 0.085s] ( 95/521) iets config::tests::syntax_errors114 PASS [ 0.022s] ( 96/521) iets config::tests::user_conf_files_are_in_precedence_order115 PASS [ 0.018s] ( 97/521) iets devenv::tests::cached_result_roundtrip116 PASS [ 0.024s] ( 98/521) iets devenv::tests::get_env_sh_store_path_matches_nix117 PASS [ 0.029s] ( 99/521) iets devenv::tests::non_bash_builder_is_refused118 PASS [ 0.038s] (100/521) iets devenv::tests::json_roundtrip_and_bash_forms119 PASS [ 0.221s] (101/521) iets config::tests::basic_syntax120 PASS [ 0.018s] (102/521) iets devenv::tests::shell_escaping121 PASS [ 0.020s] (103/521) iets devenv::tests::rewrites_apply_in_map_order_to_every_occurrence122 PASS [ 0.019s] (104/521) iets devenv::tests::rc_script_rewrites_outputs_and_writes_attrs123 PASS [ 0.864s] (105/521) iets cli::search::tests::merged_highlights124 PASS [ 2.380s] (106/521) iets cli::build::tests::a_success_with_no_output_path_is_named125 PASS [ 1.382s] (107/521) iets cli::render::text::tests::a_long_value_shows_the_lines_that_differ126 PASS [ 0.396s] (108/521) iets config::tests::extra_appends_to_list_settings_only127 PASS [ 0.202s] (109/521) iets devenv::tests::output_checks_are_erased_only_when_present128 PASS [ 0.418s] (110/521) iets config::tests::bool_spellings129 PASS [ 0.299s] (111/521) iets config::tests::typed_getters_and_defaults130 PASS [ 0.440s] (112/521) iets config::tests::an_alias_is_its_setting131 PASS [ 2.930s] (113/521) iets api::value::tests::wrong_type_is_an_error132 PASS [ 2.952s] (114/521) iets api::value::tests::force_deep_forces_the_whole_tree133 PASS [ 0.371s] (115/521) iets config::tests::unknown_settings_are_kept134 PASS [ 0.533s] (116/521) iets config::tests::bad_typed_values_error_where_they_are_set135 PASS [ 0.680s] (117/521) iets config::tests::a_classic_name_leaves_an_unimplemented_setting_to_nix136 PASS [ 0.527s] (118/521) iets config::tests::missing_include_errors_and_bang_include_does_not137 PASS [ 0.617s] (119/521) iets config::tests::a_setting_with_no_effect_is_noted138 PASS [ 2.819s] (120/521) iets builtins::fetch_git::tests::a_working_tree_is_a_file_url_of_an_absolute_path139 PASS [ 0.547s] (121/521) iets config::tests::max_jobs_auto_is_the_cpu_count140 PASS [ 2.846s] (122/521) iets builtins::text::regex::tests::long_inputs_do_not_recurse141 PASS [ 1.940s] (123/521) iets cli::render::tests::sizes_render_as_nix_renders_them142 PASS [ 0.648s] (124/521) iets config::tests::include_chain143 PASS [ 0.609s] (125/521) iets config::tests::overrides_win_over_files144 PASS [ 3.157s] (126/521) iets api::value::tests::attrs_by_name_and_index145 PASS [ 0.592s] (127/521) iets config::tests::the_daemon_gets_the_store_settings_set_outside_the_system_file146 PASS [ 0.625s] (128/521) iets config::tests::option_nix_path_replaces_nix_path_and_extra_adds147 PASS [ 2.950s] (129/521) iets builtins::fetch::tests::the_mark_follows_the_string_like_store_context148 PASS [ 3.179s] (130/521) iets api::value::tests::apply_is_lazy149 PASS [ 2.954s] (131/521) iets builtins::fetch::tests::nix_sees_no_mark150 PASS [ 0.018s] (132/521) iets fetch::http::tests::redirects_keep_credentials_only_on_the_same_origin151 PASS [ 0.021s] (133/521) iets fetch::http::tests::magic_bytes152 PASS [ 0.052s] (134/521) iets fetch::http::tests::file_urls_name_a_local_path153 PASS [ 0.031s] (135/521) iets fetch::http::tests::redirects_resolve154 PASS [ 1.019s] (136/521) iets compile::cache::tests::a_malformed_entry_is_a_miss_and_never_a_crash155 PASS [ 3.453s] (137/521) iets api::value::tests::construction156 PASS [ 2.352s] (138/521) iets fetch::http::tests::a_stalled_download_fails157 PASS [ 2.280s] (139/521) iets fetch::http::tests::urls_split158 PASS [ 3.452s] (140/521) iets compile::cache::tests::a_changed_byte_of_a_stored_entry_is_a_miss159 PASS [ 2.648s] (141/521) iets eval::tests::fetch_mercurial_names_a_way_out160 PASS [ 5.550s] (142/521) iets api::value::tests::lists161 PASS [ 2.848s] (143/521) iets eval::tests::a_function_select_is_a_fresh_slot_when_its_subject_is_forced162 PASS [ 2.411s] (144/521) iets fetch::http::tests::credentials_stay_on_the_first_origin163 PASS [ 2.362s] (145/521) iets fetch::http::tests::trailing_bytes_and_a_second_layer164 PASS [ 5.576s] (146/521) iets api::value::tests::strings_and_context165 PASS [ 0.095s] (147/521) iets fetch::roots::tests::no_bundle_anywhere_gives_the_compiled_in_set166 PASS [ 3.245s] (148/521) iets compile::cache::tests::nesting_past_the_cap_misses167 PASS [ 2.435s] (149/521) iets fetch::http::tests::credentials_in_the_url_are_sent_and_never_printed168 PASS [ 5.365s] (150/521) iets builtins::fetch::tests::an_entry_of_the_compiled_file_cache_keeps_the_site169 PASS [ 0.042s] (151/521) iets fetch::spool::tests::a_sparse_member_counts_against_the_size_limit170 PASS [ 2.448s] (152/521) iets fetch::http::tests::downloads_stop_at_the_size_limit171 PASS [ 2.403s] (153/521) iets fetch::roots::tests::a_named_file_that_is_missing_or_empty_is_an_error172 PASS [ 0.225s] (154/521) iets fetch::spool::tests::a_changed_index_byte_is_a_miss173 PASS [ 2.281s] (155/521) iets fetch::roots::tests::nix_ssl_cert_file_wins_over_ssl_cert_file_and_the_platform174 PASS [ 2.406s] (156/521) iets fetch::roots::tests::an_empty_nix_ssl_cert_file_hides_ssl_cert_file175 PASS [ 0.236s] (157/521) iets fetch::roots::tests::the_platform_store_wins_over_the_compiled_in_set176 PASS [ 0.198s] (158/521) iets fetch::spool::tests::an_empty_archive_is_an_empty_directory177 PASS [ 0.132s] (159/521) iets fetch::unpack::tests::an_unsupported_member_type_is_an_error178 PASS [ 0.167s] (160/521) iets fetch::unpack::tests::a_repeated_member_keeps_the_last_copy179 PASS [ 0.182s] (161/521) iets fetch::spool::tests::the_errors_match180 PASS [ 0.208s] (162/521) iets fetch::spool::tests::a_stored_tree_dumps_the_spools_nar181 PASS [ 0.172s] (163/521) iets fetch::spool::tests::the_scratch_file_never_follows_a_symlink182 PASS [ 0.243s] (164/521) iets fetch::spool::tests::nar_hash_of_the_fixture183 PASS [ 0.031s] (165/521) iets flake::tests::attr_paths184 PASS [ 0.081s] (166/521) iets flake::flakeref::tests::round_trips185 PASS [ 0.022s] (167/521) iets jobs::constituents::tests::fnmatch_basics186 PASS [ 0.108s] (168/521) iets flake::flakeref::tests::parses_the_kept_schemes187 PASS [ 0.156s] (169/521) iets fetch::unpack::tests::keeps_the_root_when_it_is_not_a_single_directory188 PASS [ 0.311s] (170/521) iets fetch::spool::tests::spool_matches_the_tree_on_the_top_level189 PASS [ 3.192s] (171/521) iets eval::tests::an_invalid_regex_fails_before_the_string_is_forced190 PASS [ 0.036s] (172/521) iets lint::allow::tests::comment_names191 PASS [ 0.029s] (173/521) iets lint::allow::tests::lines192 PASS [ 0.099s] (174/521) iets jobs::line::tests::error_line_round_trip193 PASS [ 0.137s] (175/521) iets flake::tests::refs_resolve_against_cwd_and_home194 PASS [ 0.106s] (176/521) iets jobs::constituents::tests::topo_sort_orders_and_detects_cycles195 PASS [ 0.092s] (177/521) iets jobs::line::tests::split_and_round_trip196 PASS [ 0.231s] (178/521) iets fetch::unpack::tests::strips_one_leading_component197 PASS [ 0.049s] (179/521) iets lint::site::tests::a_literal_lint_of_nix_has_an_edit198 PASS [ 0.035s] (180/521) iets lint::tests::names_are_unique_kebab_case199 PASS [ 0.048s] (181/521) iets lint::tests::keys200 PASS [ 0.475s] (182/521) iets fetch::spool::tests::archives_the_git_sink_accepts201 PASS [ 0.051s] (183/521) iets lint::tests::scope_and_inputs202 PASS [ 0.023s] (184/521) iets lint::tests::specificity_inside_a_source_and_order_between_sources203 PASS [ 0.286s] (185/521) iets flake::flakeref::tests::errors_and_unsupported204 PASS [ 0.067s] (186/521) iets lint::tests::an_unknown_name_is_a_warning_in_a_file_and_an_error_in_a_flag205 PASS [ 0.070s] (187/521) iets lint::site::tests::the_span_is_the_innermost_node_of_the_kind_of_the_lint206 PASS [ 0.033s] (188/521) iets lint::tests::selectors_and_order207 PASS [ 2.918s] (189/521) iets fetch::http::tests::a_transient_status_is_retried208 PASS [ 0.556s] (190/521) iets fetch::spool::tests::pax_sparse_members_are_expanded209 PASS [ 0.087s] (191/521) iets log::tests::a_fixed_hash_has_the_shape_of_a_finding_with_an_edit210 PASS [ 0.090s] (192/521) iets log::tests::a_coloured_error_is_an_error_record211 PASS [ 0.367s] (193/521) iets flake::flakeref::tests::git_urls_are_fixed_like_nix212 PASS [ 0.021s] (194/521) iets log::tests::exit_status_flags_combine_like_nix213 PASS [ 3.061s] (195/521) iets fetch::http::tests::a_decompression_bomb_is_refused214 PASS [ 0.128s] (196/521) iets log::tests::a_forged_mismatch_is_dropped215 PASS [ 0.033s] (197/521) iets log::tests::activity_records_are_nix_json_logger_records216 PASS [ 0.130s] (198/521) iets log::tests::a_hash_mismatch_names_the_hash_it_got217 PASS [ 0.026s] (199/521) iets log::tests::lint_warning_is_a_level_1_record218 PASS [ 0.024s] (200/521) iets log::tests::record_is_nix_log_ei_plus_code_and_hint219 PASS [ 0.128s] (201/521) iets log::tests::a_session_id_is_a_uuid_v7220 PASS [ 0.144s] (202/521) iets log::tests::a_mismatch_reason_keeps_both_hashes221 PASS [ 0.056s] (203/521) iets log::tests::escapes_are_filtered_the_way_nix_filters_them222 PASS [ 0.057s] (204/521) iets log::tests::ansi_stripping223 PASS [ 0.166s] (205/521) iets lint::tests::toml_table224 PASS [ 0.177s] (206/521) iets lint::tests::the_project_file_walk_stops_at_the_project_root225 PASS [ 0.038s] (207/521) iets log::tests::record_without_position226 PASS [ 0.033s] (208/521) iets log::tests::text_shows_the_hint_of_an_unsupported_error227 PASS [ 0.027s] (209/521) iets parallel::fiber::tests::resume_yield_finish228 PASS [ 0.177s] (210/521) iets log::tests::a_resolved_copy_reports_its_mismatch_as_a_line229 PASS [ 0.035s] (211/521) iets parallel::fiber::tests::reservation_is_capped_and_mmap_failure_is_an_error230 PASS [ 0.078s] (212/521) iets nixbin::tests::farm_marker_is_found_through_two_hops231 PASS [ 0.054s] (213/521) iets parallel::interner::tests::empty_name_misses_the_cache_sentinel232 PASS [ 0.067s] (214/521) iets parallel::fiber::tests::migrates_between_threads233 PASS [ 0.076s] (215/521) iets parallel::deque::tests::lifo_owner_fifo_thief234 PASS [ 0.536s] (216/521) iets fetch::unpack::tests::member_names_are_made_relative_and_cannot_escape235 PASS [ 0.697s] (217/521) iets fetch::spool::tests::spool_matches_the_tree236 PASS [ 0.753s] (218/521) iets fetch::spool::tests::a_hard_link_never_replaces_a_member237 PASS [ 0.111s] (219/521) iets nixbin::tests::every_iets_build_is_skipped238 PASS [ 0.027s] (220/521) iets profile::tests::a_frame_keeps_its_call_site_and_its_name239 PASS [ 0.078s] (221/521) iets parallel::sched::tests::a_task_survives_packing_past_the_old_24_bit_start240 PASS [ 0.022s] (222/521) iets profile::tests::a_weight_is_bytes_when_the_profile_asks_for_them241 PASS [ 0.083s] (223/521) iets parallel::sched::tests::main_parks_and_is_woken_by_helper242 PASS [ 0.035s] (224/521) iets profile::tests::a_sample_is_taken_once_per_tick243 PASS [ 0.110s] (225/521) iets parallel::interner::tests::intern_is_stable_and_shared244 PASS [ 0.590s] (226/521) iets fetch::unpack::tests::nar_hash_of_the_fixture245 PASS [ 0.025s] (227/521) iets progress::tests::a_download_inside_a_copy_is_part_of_the_copy246 PASS [ 0.565s] (228/521) iets flake::flakeref::tests::to_string_from_attrs247 PASS [ 0.104s] (229/521) iets parallel::sched::tests::fan_out_from_main248 PASS [ 0.058s] (230/521) iets profile::tests::an_unwind_returns_to_a_depth249 PASS [ 0.035s] (231/521) iets project::tests::each_marker_is_a_root250 PASS [ 0.037s] (232/521) iets project::tests::the_nearest_flake_wins_without_a_working_tree251 PASS [ 0.061s] (233/521) iets progress::tests::a_log_hears_of_a_task_after_first_and_then_every_heartbeat252 PASS [ 0.020s] (234/521) iets provenance::tests::locate_takes_the_longest_prefix253 PASS [ 0.203s] (235/521) iets parallel::interner::tests::concurrent_intern_agrees254 PASS [ 0.019s] (236/521) iets provenance::tests::locate_without_a_match_is_none255 PASS [ 0.155s] (237/521) iets print::tests::float_formatting_edge_cases256 PASS [ 0.234s] (238/521) iets parallel::fiber::tests::large_stack_use_and_release257 PASS [ 0.171s] (239/521) iets parallel::sched::tests::park_and_wake_across_workers258 PASS [ 0.113s] (240/521) iets project::tests::a_config_file_never_shrinks_the_root259 PASS [ 0.118s] (241/521) iets progress::tests::several_of_a_kind_are_counted260 PASS [ 0.127s] (242/521) iets progress::tests::a_transfer_that_does_not_move_says_so261 PASS [ 0.020s] (243/521) iets remote::grpc::build::tests::reschedules_back_off_past_a_dead_worker262 PASS [ 0.023s] (244/521) iets remote::grpc::build::tests::topo_sort_puts_references_first263 PASS [ 0.145s] (245/521) iets progress::tests::store_hashes_are_left_out264 PASS [ 0.040s] (246/521) iets remote::grpc::build::tests::required_features_come_from_the_env_or_structured_attrs265 PASS [ 0.058s] (247/521) iets remote::grpc::build::tests::a_local_upload_failure_beats_the_stream_ended_status266 PASS [ 0.153s] (248/521) iets project::tests::a_working_tree_wins_over_a_file_marker_below_it267 PASS [ 0.131s] (249/521) iets provenance::tests::a_path_followed_by_a_colour_escape_still_matches268 PASS [ 0.059s] (250/521) iets remote::grpc::build::tests::the_timings_report_with_every_line269 PASS [ 0.093s] (251/521) iets provenance::tests::rewrite_replaces_every_known_path_in_a_line270 PASS [ 0.020s] (252/521) iets remote::grpc::health::tests::a_completed_build_clears_the_history271 PASS [ 0.040s] (253/521) iets remote::grpc::drvwire::tests::path_info_round_trips272 PASS [ 0.253s] (254/521) iets parallel::thunk::tests::deadlocked_fibers_are_cancelled273 PASS [ 0.059s] (255/521) iets remote::grpc::drvwire::tests::a_failure_keeps_its_message274 PASS [ 0.024s] (256/521) iets remote::grpc::health::tests::a_passed_cooldown_lets_one_caller_through275 PASS [ 0.014s] (257/521) iets remote::grpc::health::tests::one_bounce_does_not_refuse_an_address276 PASS [ 0.091s] (258/521) iets remote::grpc::drvwire::tests::an_unresolvable_input_output_is_an_error277 PASS [ 0.097s] (259/521) iets remote::grpc::drvwire::tests::basic_derivation_matches_the_cxx_field_order278 PASS [ 0.376s] (260/521) iets parallel::deque::tests::concurrent_sum279 PASS [ 0.195s] (261/521) iets provenance::tests::failed_line_names_the_attribute_and_the_position280 PASS [ 0.197s] (262/521) iets provenance::tests::a_tree_copied_from_a_store_tree_resolves_to_the_local_one281 PASS [ 0.045s] (263/521) iets remote::grpc::health::tests::the_cooldown_grows_and_stops_at_30s282 PASS [ 0.031s] (264/521) iets remote::grpc::tests::every_parameter_parses283 PASS [ 0.038s] (265/521) iets remote::grpc::health::tests::two_bounces_refuse_it284 PASS [ 0.080s] (266/521) iets remote::grpc::health::tests::one_address_does_not_refuse_another285 PASS [ 0.029s] (267/521) iets remote::grpc::tests::defaults_match_the_cxx_settings286 PASS [ 0.033s] (268/521) iets remote::grpc::tests::a_token_needs_tls_and_unknown_parameters_are_errors287 PASS [ 0.022s] (269/521) iets remote::grpc::tests::mtls_needs_both_halves288 PASS [ 0.034s] (270/521) iets remote::grpc::tests::insecure_is_a_bare_flag_or_a_boolean289 PASS [ 0.028s] (271/521) iets remote::worker::wire::tests::framed_sink_frames_and_terminates290 PASS [ 0.031s] (272/521) iets remote::worker::tests::nix_sshopts_split_like_a_shell291 PASS [ 0.039s] (273/521) iets remote::worker::wire::tests::build_results_are_read_as_nix_reads_them292 PASS [ 0.138s] (274/521) iets remote::grpc::health::tests::an_unknown_address_is_usable293 PASS [ 0.163s] (275/521) iets remote::grpc::drvwire::tests::build_result_round_trips_a_daemon_reply294 PASS [ 0.065s] (276/521) iets remote::grpc::tests::percent_escapes_decode_in_values295 PASS [ 0.054s] (277/521) iets remote::worker::tests::ssh_argv_puts_the_host_first296 PASS [ 0.023s] (278/521) iets remote::worker::wire::tests::strings_are_padded297 PASS [ 0.073s] (279/521) iets remote::worker::tests::transport_from_url298 PASS [ 0.259s] (280/521) iets provenance::tests::rewrite_leaves_unknown_text_alone299 PASS [ 0.244s] (281/521) iets remote::grpc::build::tests::a_self_reference_does_not_loop300 PASS [ 0.022s] (282/521) iets runtime::value::layout::a_primop_pays_nothing_for_its_symbol301 PASS [ 0.405s] (283/521) iets profile::tests::a_deep_stack_is_capped302 PASS [ 0.085s] (284/521) iets remote::worker::wire::tests::replies_are_read_as_nix_reads_them303 PASS [ 0.122s] (285/521) iets remote::plan::tests::memory_source_matches_dump_string304 PASS [ 0.039s] (286/521) iets settings::tests::a_flag_carries_several_places_separated_by_a_semicolon305 PASS [ 0.131s] (287/521) iets remote::worker::tests::a_status_over_a_byte_is_not_a_success306 PASS [ 0.136s] (288/521) iets remote::plan::tests::hash_source_matches_nar_hash307 PASS [ 0.156s] (289/521) iets remote::worker::tests::an_ssh_host_is_never_an_option308 PASS [ 0.083s] (290/521) iets settings::tests::a_missing_file_is_skipped_and_the_defaults_hold309 PASS [ 0.093s] (291/521) iets session::tests::two_sessions_share_no_state310 PASS [ 0.085s] (292/521) iets settings::tests::a_settings_file_may_hold_lint_and_the_other_sources_may_not311 PASS [ 0.035s] (293/521) iets settings::tests::the_flag_leaves_the_argv312 PASS [ 0.034s] (294/521) iets settings::tests::the_flag_pairs_are_kept_for_a_second_iets313 PASS [ 0.108s] (295/521) iets settings::tests::builder_reads_all_three_forms314 PASS [ 0.121s] (296/521) iets settings::tests::a_project_file_holds_lint_and_nothing_else315 PASS [ 0.148s] (297/521) iets runtime::value::alloc_tests::a_list_too_long_to_address_has_no_size316 PASS [ 0.141s] (298/521) iets settings::tests::a_wrong_type_names_the_key_and_the_file317 PASS [ 0.130s] (299/521) iets settings::tests::each_source_wins_over_the_one_before318 PASS [ 0.089s] (300/521) iets source::local::tests::accepted_set_adds_parent_directories319 PASS [ 0.155s] (301/521) iets settings::tests::source_map_adds_up_and_every_other_key_replaces320 PASS [ 0.161s] (302/521) iets settings::tests::the_environment_wins_over_the_file321 PASS [ 0.093s] (303/521) iets source::local::tests::max_mtime_covers_root_and_children322 PASS [ 0.020s] (304/521) iets source::remote::tests::nix_literal_escapes323 PASS [ 0.033s] (305/521) iets source::remote::tests::access_tokens_match_the_longest_prefix324 PASS [ 0.033s] (306/521) iets source::remote::tests::download_urls_match_the_fetchers325 PASS [ 0.024s] (307/521) iets source::remote::tests::only_the_archive_types_are_fetched_by_iets326 PASS [ 0.165s] (308/521) iets settings::tests::the_flag_value_is_toml_when_it_reads_as_toml327 PASS [ 0.200s] (309/521) iets settings::tests::the_file_is_the_users328 PASS [ 0.253s] (310/521) iets source::remote::tests::a_leftover_is_not_a_valid_path329 PASS [ 0.316s] (311/521) iets settings::tests::unknown_key_names_the_file330 PASS [ 0.286s] (312/521) iets source::local::tests::only_a_content_addressed_store_path_names_its_content331 PASS [ 0.063s] (313/521) iets source::tests::dates332 PASS [ 0.342s] (314/521) iets source::lock::tests::empty_lock_has_no_inputs333 PASS [ 0.359s] (315/521) iets source::lock::tests::complete_lock_passes334 PASS [ 0.040s] (316/521) iets store::drv::tests::an_env_key_named_json_is_refused335 PASS [ 0.154s] (317/521) iets store::drv::tests::a_dynamic_input_writes_the_versioned_aterm_and_parses_back336 PASS [ 0.170s] (318/521) iets store::drv::tests::fixed_output_from_scratch337 PASS [ 0.110s] (319/521) iets store::drv::tests::fixtures_roundtrip_byte_exact338 PASS [ 0.140s] (320/521) iets store::drv::tests::fixtures_output_paths_recompute339 PASS [ 0.023s] (321/521) iets store::drv::tests::input_addressed_multi_output_from_scratch340 PASS [ 0.028s] (322/521) iets store::drv::tests::input_drvs_hash_modulo_from_scratch341 PASS [ 0.014s] (323/521) iets store::drv::tests::string_escapes_roundtrip342 PASS [ 0.022s] (324/521) iets store::drv::tests::masked_unparse_blanks_output_paths_and_env343 PASS [ 0.047s] (325/521) iets store::drvdiff::tests::a_changed_input_drv_is_paired_by_name_and_recursed_into344 PASS [ 0.049s] (326/521) iets store::drvdiff::tests::an_input_source_an_added_input_drv_and_a_fixed_output_show_up345 PASS [ 0.039s] (327/521) iets store::drvdiff::tests::env_name_shows_only_when_it_is_not_the_derivation_name346 PASS [ 0.053s] (328/521) iets store::drvdiff::tests::json_names_what_differs347 PASS [ 1.845s] (329/521) iets fetch::unpack::tests::modes_symlinks_and_empty_dirs348 PASS [ 0.023s] (330/521) iets store::drvdiff::tests::the_depth_limit_names_the_input_without_walking_it349 PASS [ 0.022s] (331/521) iets store::drvdiff::tests::the_local_fields_the_env_and_an_absent_value350 PASS [ 0.026s] (332/521) iets store::drvdiff::tests::the_same_derivation_is_empty351 PASS [ 0.030s] (333/521) iets store::hash::tests::base64_roundtrip352 PASS [ 0.017s] (334/521) iets store::hash::tests::compress_hash_xors353 PASS [ 0.023s] (335/521) iets store::hash::tests::empty_sha256354 PASS [ 0.025s] (336/521) iets store::hash::tests::md5_nix32355 PASS [ 0.023s] (337/521) iets store::hash::tests::nix32_roundtrip_and_reject356 PASS [ 0.015s] (338/521) iets store::hash::tests::parse_any_all_formats357 PASS [ 0.007s] (339/521) iets store::hash::tests::sha256_sri358 PASS [ 0.014s] (340/521) iets store::hash::tests::sha256_nix32359 PASS [ 0.018s] (341/521) iets store::hash::tests::sha1_nix32360 PASS [ 0.020s] (342/521) iets store::hash::tests::streaming_matches_oneshot361 PASS [ 0.031s] (343/521) iets store::nar::tests::directory_nar362 PASS [ 0.037s] (344/521) iets store::hash::tests::sha512_nix32_base64363 PASS [ 0.026s] (345/521) iets store::nar::tests::directory_nar_hash_formats364 PASS [ 0.030s] (346/521) iets store::nar::tests::filter_sees_types_and_paths365 PASS [ 0.071s] (347/521) iets store::nar::tests::regular_file_nar366 PASS [ 0.022s] (348/521) iets store::nar::tests::restore_rejects_garbage367 PASS [ 1.015s] (349/521) iets source::lock::tests::incomplete_locks_fail368 PASS [ 0.150s] (350/521) iets store::nar::tests::readers_refuse_what_nix_refuses369 PASS [ 0.039s] (351/521) iets store::nar::tests::symlink_nar370 PASS [ 0.025s] (352/521) iets store::path::tests::a_multibyte_char_across_the_hash_part_is_an_error371 PASS [ 0.063s] (353/521) iets store::nar::tests::restore_roundtrip372 PASS [ 1.140s] (354/521) iets settings::tests::the_user_file_turns_purity_off373 PASS [ 0.021s] (355/521) iets store::path::tests::check_name_rules374 PASS [ 1.255s] (356/521) iets runtime::value::alloc_tests::a_speculated_thunk_is_forced_but_not_demanded375 PASS [ 0.049s] (357/521) iets store::path::tests::fixed_flat_sha1376 PASS [ 0.034s] (358/521) iets store::path::tests::fixed_flat_sha256377 PASS [ 0.029s] (359/521) iets store::path::tests::output_names378 PASS [ 0.246s] (360/521) iets store::nar::tests::executable_file_nar379 PASS [ 1.064s] (361/521) iets source::scm::git::tests::a_directory_in_a_repository_is_found380 PASS [ 0.023s] (362/521) iets store::path::tests::parse_and_accessors381 PASS [ 0.048s] (363/521) iets store::path::tests::to_file382 PASS [ 0.071s] (364/521) iets store::path::tests::path_copy_directory383 PASS [ 0.122s] (365/521) iets store::path::tests::filter_source384 PASS [ 0.064s] (366/521) iets store::path::tests::path_copy_file385 PASS [ 0.812s] (367/521) iets store::drv::tests::fixtures_drv_path_matches_store_path386 PASS [ 0.054s] (368/521) iets store::path::tests::placeholder387 PASS [ 1.117s] (369/521) iets source::scm::ledger::tests::a_directory_in_a_working_tree_is_found388 PASS [ 0.061s] (370/521) iets store::path::tests::path_with_name389 PASS [ 0.018s] (371/521) iets syntax::tests::a_line_ends_at_cr_lf_and_lone_cr390 PASS [ 5.319s] (372/521) iets eval::tests::a_second_pseudo_file_keeps_its_own_positions391 PASS [ 0.035s] (373/521) iets syntax::tests::indented_string_stripping392 PASS [ 0.034s] (374/521) iets syntax::tests::json_gives_every_node_its_kind_and_span393 PASS [ 0.020s] (375/521) iets syntax::tests::lambdas394 PASS [ 0.184s] (376/521) iets store::path::tests::fixed_recursive_sha256395 PASS [ 0.078s] (377/521) iets syntax::tests::attrs_and_bindings396 PASS [ 0.077s] (378/521) iets syntax::tests::an_interpolated_name_is_static_when_nix_has_one_string_node397 PASS [ 0.078s] (379/521) iets syntax::tests::comments_and_misc398 PASS [ 0.085s] (380/521) iets syntax::tests::allow_comments399 PASS [ 0.096s] (381/521) iets store::path::tests::to_file_with_reference400 PASS [ 0.024s] (382/521) iets syntax::tests::line_col_counts_bytes401 PASS [ 0.025s] (383/521) iets syntax::tests::numbers402 PASS [ 0.100s] (384/521) iets syntax::tests::end_of_file_inside_a_path_is_at_its_last_token403 PASS [ 0.018s] (385/521) iets syntax::tests::spans_cover_tokens404 PASS [ 0.037s] (386/521) iets syntax::tests::nul_in_string_literals405 PASS [ 0.022s] (387/521) iets trace::key::tests::key_is_order_and_value_sensitive406 PASS [ 0.032s] (388/521) iets syntax::tests::the_error_reported_is_the_one_nix_meets_first407 PASS [ 0.020s] (389/521) iets trace::store::tests::bytes_that_are_not_an_entry_are_bad_not_a_panic408 PASS [ 0.068s] (390/521) iets syntax::tests::operator_precedence409 PASS [ 0.065s] (391/521) iets syntax::tests::paths410 PASS [ 0.021s] (392/521) iets trace::tests::dedupe_keeps_conflicting_values411 PASS [ 0.044s] (393/521) iets trace::key::tests::relative_path_detection412 PASS [ 0.079s] (394/521) iets syntax::tests::string_escapes_and_interpolation413 PASS [ 0.042s] (395/521) iets trace::validate::tests::a_copy_in_place_that_keeps_the_stat_still_misses414 PASS [ 0.083s] (396/521) iets trace::validate::dir_hash_tests::dir_hash_agrees_with_dir_listing_hash415 PASS [ 0.044s] (397/521) iets trace::validate::tests::dir_stat_env_checks416 PASS [ 0.117s] (398/521) iets trace::tests::fingerprint_changes_with_content_size_and_seen_entries417 PASS [ 0.119s] (399/521) iets trace::tests::dump_fingerprint_matches_the_separate_walk418 PASS [ 0.141s] (400/521) iets trace::store::tests::one_rename_publishes_every_part419 PASS [ 0.179s] (401/521) iets trace::store::tests::a_reader_of_one_generation_never_sees_the_next420 PASS [ 0.046s] (402/521) iets trace::validate::tests::file_touch_refreshes_edit_misses421 PASS [ 0.022s] (403/521) iets trace::wire::tests::drvs_sources_roots_roundtrip422 PASS [ 0.027s] (404/521) iets treestore::pack::tests::a_reader_sees_a_pack_written_after_it_listed423 PASS [ 0.037s] (405/521) iets treestore::pack::tests::a_pack_reads_back_what_was_written424 PASS [ 0.065s] (406/521) iets trace::wire::tests::readset_roundtrip425 PASS [ 0.069s] (407/521) iets trace::watch::tests::only_the_paths_an_mtime_can_speak_for426 PASS [ 0.186s] (408/521) iets trace::tests::only_a_named_query_is_an_observation427 PASS [ 0.056s] (409/521) iets treestore::pack::tests::an_empty_writer_leaves_no_file428 PASS [ 0.086s] (410/521) iets treestore::pack::tests::a_set_finds_objects_across_packs_and_drops_a_broken_one429 PASS [ 0.028s] (411/521) iets treestore::tests::a_staged_directory_goes_when_it_is_dropped430 PASS [ 0.024s] (412/521) iets treestore::tests::a_tree_is_named_by_its_nar_hash431 PASS [ 0.113s] (413/521) iets treestore::tests::a_flat_file_is_named_by_the_hash_of_its_bytes432 PASS [ 0.078s] (414/521) iets treestore::tests::a_stored_input_reads_back_and_a_wrong_hash_is_refused433 PASS [ 0.152s] (415/521) iets treestore::pack::tests::collect_removes_dead_packs_and_compacts_mostly_dead_ones434 PASS [ 0.181s] (416/521) iets treestore::tests::a_put_after_a_collection_brings_its_own_objects435 PASS [ 0.113s] (417/521) iets treestore::tests::collect_keeps_what_an_entry_names436 PASS [ 0.311s] (418/521) iets trace::validate::tests::the_lowest_failing_observation_is_the_one_reported437 PASS [ 0.142s] (419/521) iets treestore::tests::two_inputs_share_their_common_files438 PASS [ 0.149s] (420/521) iets::aterm_crosscheck bytes_that_are_not_utf8_roundtrip439 PASS [ 0.051s] (421/521) iets::aterm_crosscheck malformed_aterm_is_an_error440 PASS [ 0.049s] (422/521) iets::aterm_crosscheck upstream_bad_drvs_are_rejected441 PASS [ 0.211s] (423/521) iets::aterm_crosscheck fixed_output_path_is_recomputed_not_trusted442 PASS [ 0.043s] (424/521) iets::aterm_crosscheck upstream_bench_drvs_parse_and_reprint_stably443 PASS [ 0.165s] (425/521) iets::aterm_crosscheck harmonia_cases_roundtrip444 PASS [ 0.211s] (426/521) iets::aterm_crosscheck floating_ca_defers_itself_and_downstream445 PASS [ 0.139s] (427/521) iets::aterm_crosscheck masked_and_unmasked_hashes_differ_once_filled446 PASS [ 0.019s] (428/521) iets::aterm_crosscheck upstream_invariants_fill_in_deferred447 PASS [ 0.526s] (429/521) iets treestore::pack::tests::a_changed_index_byte_is_not_a_pack448 PASS [ 0.077s] (430/521) iets::aterm_crosscheck upstream_invariants_input_addressed_kept_or_rejected449 PASS [ 0.116s] (431/521) iets::aterm_crosscheck upstream_input_addressed_paths_recompute450 PASS [ 0.365s] (432/521) iets::aterm_crosscheck fixed_output_inputs_hide_their_provenance451 PASS [ 0.145s] (433/521) iets::aterm_crosscheck upstream_invariants_ca_floating_dependency452 PASS [ 0.181s] (434/521) iets::aterm_crosscheck upstream_drvs_roundtrip_byte_exact453 PASS [ 0.156s] (435/521) iets::cache_hygiene a_cache_is_private_to_its_owner454 PASS [ 0.157s] (436/521) iets::cache_hygiene a_corrupt_entry_is_dropped_and_a_corrupt_store_is_wiped455 PASS [ 0.025s] (437/521) iets::cache_hygiene crash_writer_child456 PASS [ 0.082s] (438/521) iets::cache_hygiene input_touch_child457 PASS [ 0.276s] (439/521) iets::cache_hygiene an_entry_that_is_not_a_plain_file_is_refused458 PASS [ 0.297s] (440/521) iets::cache_hygiene an_input_observation_marks_its_entry_as_used459 PASS [ 2.374s] (441/521) iets source::scm::ledger::tests::a_change_of_the_ledger_is_a_change_of_the_working_tree460 PASS [ 3.378s] (442/521) iets jobs::tests::a_numeric_name_selects_an_attribute_under_a_set461 PASS [ 2.467s] (443/521) iets source::scm::ledger::tests::an_untracked_file_is_the_error_of_nix462 PASS [ 0.676s] (444/521) iets::cache_hygiene a_changed_byte_or_a_copied_entry_is_a_miss463 PASS [ 0.809s] (445/521) iets::cache_hygiene a_killed_writer_leaves_the_store_usable464 PASS [ 9.907s] (446/521) iets api::value::tests::calling_a_function465 PASS [ 3.168s] (447/521) iets source::scm::ledger::tests::a_name_resolves_to_a_revision_and_a_revision_has_a_tree466 PASS [ 7.187s] (448/521) iets eval::tests::from_json_and_toml_reject_null_bytes467 PASS [ 0.793s] (449/521) iets::events a_group_that_does_not_exist_is_a_settings_error468 PASS [ 7.453s] (450/521) iets eval::tests::derivation_wrapper_exists469 PASS [ 10.112s] (451/521) iets builtins::fetch::tests::the_first_read_of_a_tree_gives_its_finding470 PASS [ 2.293s] (452/521) iets syntax::tests::lang_corpus471 PASS [ 3.346s] (453/521) iets source::scm::ledger::tests::the_metadata_has_the_mark_of_its_tree472 PASS [ 7.464s] (454/521) iets eval::tests::nix_eq_forces_what_the_shortcut_skips473 PASS [ 10.247s] (455/521) iets builtins::fetch::tests::the_name_on_a_value_that_is_not_a_tree_is_silent474 PASS [ 1.315s] (456/521) iets::cli help_and_version_go_to_stdout475 PASS [ 0.031s] (457/521) iets::help_topics help_lists_the_topics476 PASS [ 0.186s] (458/521) iets::help_topics a_command_wins_over_a_topic_of_the_same_name477 PASS [ 0.206s] (459/521) iets::help_topics a_page_the_binary_does_not_carry_names_its_path478 PASS [ 4.303s] (460/521) iets parallel::thunk::tests::many_fibers_force_one_shared_graph479 PASS [ 7.523s] (461/521) iets eval::tests::sets_compare_in_the_symbol_order_of_nix480 PASS [ 3.944s] (462/521) iets runtime::value::tests::union_lookup_agrees_with_iteration481 PASS [ 1.712s] (463/521) iets::cache_hygiene cache_gc_removes_entries_past_the_ttl482 PASS [ 7.866s] (464/521) iets eval::tests::derivation_keeps_env_and_args_that_are_not_utf8483 PASS [ 0.161s] (465/521) iets::layering porcelain_signatures_name_no_evaluator_value484 PASS [ 3.779s] (466/521) iets source::scm::ledger::tests::the_count_is_lazy_and_kept_by_revision485 PASS [ 0.263s] (467/521) iets::help_topics an_unknown_topic_is_a_usage_error_with_a_suggestion486 PASS [ 0.299s] (468/521) iets::help_topics a_topic_prints_its_page487 PASS [ 0.065s] (469/521) iets::profile a_profile_that_is_not_eval_is_a_settings_error488 PASS [ 0.142s] (470/521) iets::profile a_profile_refuses_more_than_one_worker489 PASS [ 7.715s] (471/521) iets eval::tests::update_forces_the_right_operand_first490 PASS [ 0.293s] (472/521) iets::nar_parity reader_caps_names_and_targets491 PASS [ 0.386s] (473/521) iets::layering porcelain_names_no_layer_below_the_api492 PASS [ 8.038s] (474/521) iets eval::tests::equality493 PASS [ 7.886s] (475/521) iets eval::tests::scoping494 PASS [ 10.773s] (476/521) iets builtins::fetch::tests::a_read_of_the_count_is_one_finding_for_each_tree495 PASS [ 0.433s] (477/521) iets::nar_parity every_node_hashes_like_nix496 PASS [ 0.482s] (478/521) iets::nar_parity dump_is_byte_identical_to_nix_store_dump497 PASS [ 0.404s] (479/521) iets::nar_parity restore_round_trips_the_awkward_tree498 PASS [ 0.434s] (480/521) iets::nar_parity parse_length_matches_nix499 PASS [ 8.009s] (481/521) iets eval::tests::reading_a_derivation_output_is_unsupported500 FAIL [ 3.123s] (482/521) iets trace::tests::dedupe_of_many_repeats_is_linear501 stdout ---502503 running 1 test504 test trace::tests::dedupe_of_many_repeats_is_linear ... FAILED505506 failures:507508 failures:509 trace::tests::dedupe_of_many_repeats_is_linear510511 test result: FAILED. 0 passed; 1 failed; 0 ignored; 0 measured; 465 filtered out; finished in 3.05s512 513 stderr ---514515 thread 'trace::tests::dedupe_of_many_repeats_is_linear' (1829) panicked at src/trace/mod.rs:891:9:516 2.858048555s517 note: run with `RUST_BACKTRACE=1` environment variable to display a backtrace518519 Cancelling due to test failure: 39 tests still running520 PASS [ 11.431s] (483/521) iets builtins::fetch::tests::a_read_that_is_not_a_selection_has_no_site521 PASS [ 4.574s] (484/521) iets source::scm::ledger::tests::the_tracked_files_and_the_metadata_are_the_tree522 PASS [ 0.768s] (485/521) iets::pure the_pure_setting_is_the_users_alone523 PASS [ 0.882s] (486/521) iets::profile an_unprofiled_run_says_nothing_about_a_profile524 PASS [ 2.393s] (487/521) iets::cli io_errors_read_like_strerror525 PASS [ 8.917s] (488/521) iets eval::tests::attrs_and_lists526 PASS [ 11.647s] (489/521) iets api::value::tests::scalars527 PASS [ 11.432s] (490/521) iets builtins::fetch::tests::a_selection_of_the_count_is_the_site528 PASS [ 2.162s] (491/521) iets::events a_text_add_names_its_size_and_its_position529 PASS [ 8.591s] (492/521) iets eval::tests::try_eval_and_errors530 PASS [ 0.846s] (493/521) iets::pure a_directory_with_no_marker_is_its_own_project531 PASS [ 0.936s] (494/521) iets::profile a_run_shorter_than_a_tick_says_it_sampled_nothing532 PASS [ 1.747s] (495/521) iets::events all_takes_the_cold_groups533 PASS [ 1.774s] (496/521) iets::events the_sink_is_its_own_knob534 PASS [ 9.075s] (497/521) iets eval::tests::laziness_and_recursion535 PASS [ 2.923s] (498/521) iets::events a_group_nobody_named_says_nothing536 PASS [ 12.094s] (499/521) iets builtins::fetch::tests::the_tree_decides_the_level537 PASS [ 12.380s] (500/521) iets api::run::tests::the_counters_cover_the_helper_fibers538 PASS [ 9.911s] (501/521) iets eval::tests::arithmetic_and_strings539 PASS [ 3.034s] (502/521) iets::events a_tree_add_names_the_local_path_it_copied540 PASS [ 9.750s] (503/521) iets eval::tests::printing541 PASS [ 3.651s] (504/521) iets::cli a_bad_command_line_names_the_problem542 PASS [ 2.164s] (505/521) iets::pure the_other_purity_rules_hold_without_a_flag543 PASS [ 2.903s] (506/521) iets::fetchurl a_wrong_hash_is_refused_with_the_hash_the_file_has544 PASS [ 10.347s] (507/521) iets eval::tests::fetchurl_needs_a_sha256_in_every_mode545 PASS [ 3.386s] (508/521) iets::fetchurl without_a_hash_no_evaluation_fetches_and_prefetch_gives_the_hash546 PASS [ 4.809s] (509/521) iets::cache_hygiene concurrent_readers_and_writers_never_see_a_torn_entry547 PASS [ 12.230s] (510/521) iets compile::cache::tests::a_changed_byte_never_makes_the_evaluator_read_past_its_env548 PASS [ 3.601s] (511/521) iets::pure a_read_in_the_project_is_pure_and_one_above_it_is_not549 PASS [ 5.779s] (512/521) iets::cli dash_f_names_the_file_in_the_native_namespace550 PASS [ 12.191s] (513/521) iets eval::tests::fetchurl_checks_its_argument_like_nix551 PASS [ 6.093s] (514/521) iets::fetchurl a_hashed_fetch_has_the_store_path_nix_gives552 PASS [ 8.612s] (515/521) iets::profile a_builtin_names_itself_in_a_frame553 PASS [ 28.910s] (516/521) iets::profile a_folded_line_is_a_stack_and_a_count554 PASS [ 42.456s] (517/521) iets eval::tests::pure_eval_answers_like_nix555 SLOW [> 60.000s] (-------) iets api::run::tests::helper_fibers_read_the_ir_cache556 PASS [ 50.213s] (518/521) iets::profile an_allocation_profile_accounts_for_the_arena557 PASS [ 61.264s] (519/521) iets api::run::tests::helper_fibers_read_the_ir_cache558 SLOW [> 60.000s] (-------) iets runtime::value::tests::union_iteration_merges_like_a_fold559 SLOW [> 60.000s] (-------) iets syntax::tests::deep_nesting_ends_with_an_error560 PASS [ 89.156s] (520/521) iets syntax::tests::deep_nesting_ends_with_an_error561 SLOW [>120.000s] (-------) iets runtime::value::tests::union_iteration_merges_like_a_fold562 SLOW [>180.000s] (-------) iets runtime::value::tests::union_iteration_merges_like_a_fold563 SLOW [>240.000s] (-------) iets runtime::value::tests::union_iteration_merges_like_a_fold564 PASS [ 241.726s] (521/521) iets runtime::value::tests::union_iteration_merges_like_a_fold565------------566 Summary [ 248.464s] 521 tests run: 520 passed (3 slow), 1 failed, 5 skipped567 FAIL [ 3.123s] (482/521) iets trace::tests::dedupe_of_many_repeats_is_linear568error: test run failed