failed attributes
| status |
attribute |
duration |
| failed |
checks.aarch64-linux.test
|
8m 31s |
iets-nextest-0.1.0:
running 1 test
test runtime::value::tests::union_iteration_merges_like_a_fold has been running for over 60 seconds
(test aborted …
iets-nextest-0.1.0:
running 1 test
test runtime::value::tests::union_iteration_merges_like_a_fold has been running for over 60 seconds
(test aborted with signal 9: SIGKILL)
Cancelling due to test failure:
------------
Summary [ 134.509s] 521 tests run: 520 passed (1 slow), 1 failed, 5 skipped
SIGKILL [ 130.640s] (521/521) iets runtime::value::tests::union_iteration_merges_like_a_fold
error: test run failed
|
| failed |
checks.x86_64-linux.classic-e2e
|
1h 1m |
container-test-run-iets-classic-e2e:
!!! Traceback (most recent call last):
!!! File "<string>", line 9, in <module>
!!! machine.succeed("runuser -l alice …
container-test-run-iets-classic-e2e:
!!! Traceback (most recent call last):
!!! File "<string>", line 9, in <module>
!!! machine.succeed("runuser -l alice -c 'cd iets && IETS=/nix/store/155kbw1gybnxwspx11shvg3qkcl71va6-iets-0.1.0/bin/iets NIXPKGS=/nix/store/hhfnpma32czw4h3bqpag8dciax0bcmar-source E2E_OFFLINE=1 nu scripts/classic-e2e.nu' >&2")
!!!
!!! RequestedAssertionFailed: command `runuser -l alice -c 'cd iets && IETS=/nix/store/155kbw1gybnxwspx11shvg3qkcl71va6-iets-0.1.0/bin/iets NIXPKGS=/nix/store/hhfnpma32czw4h3bqpag8dciax0bcmar-source E2E_OFFLINE=1 nu scripts/classic-e2e.nu' >&2` failed (exit code -9)
cleanup
kill NspawnMachine (pid 50)
Terminated /nix/store/m0s6xmshacyahssq0a7nvmx0acdra33h-nixos-test-driver-iets-classic-e2e/bin/nixos-test-driver -o $out
|
| failed |
checks.x86_64-linux.conformance
|
1h 8m |
nix-conformance-iets:
SKIP lang/eval-okay-closure.nix
SKIP lang/eval-okay-functionargs.nix
nix-conformance-iets:
SKIP lang/eval-okay-closure.nix
SKIP lang/eval-okay-functionargs.nix
|
| failed |
checks.x86_64-linux.flaketest
|
1h 1m |
container-test-run-iets-flaketest:
!!! Traceback (most recent call last):
!!! File "<string>", line 9, in <module>
!!! machine.succeed("runuser -l alice - …
container-test-run-iets-flaketest:
!!! Traceback (most recent call last):
!!! File "<string>", line 9, in <module>
!!! machine.succeed("runuser -l alice -c 'cd iets && IETS=/nix/store/155kbw1gybnxwspx11shvg3qkcl71va6-iets-0.1.0/bin/iets NIXPKGS=/nix/store/hhfnpma32czw4h3bqpag8dciax0bcmar-source E2E_OFFLINE=1 nu scripts/flaketest.nu' >&2")
!!!
!!! RequestedAssertionFailed: command `runuser -l alice -c 'cd iets && IETS=/nix/store/155kbw1gybnxwspx11shvg3qkcl71va6-iets-0.1.0/bin/iets NIXPKGS=/nix/store/hhfnpma32czw4h3bqpag8dciax0bcmar-source E2E_OFFLINE=1 nu scripts/flaketest.nu' >&2` failed (exit code -9)
cleanup
kill NspawnMachine (pid 50)
Terminated /nix/store/i823qw0ijk40k6h8dm0bmd7vq7j2l0vi-nixos-test-driver-iets-flaketest/bin/nixos-test-driver -o $out
|
| failed |
checks.x86_64-linux.fuzz-drv-eval
|
1h 2m |
setup:
these 2 derivations will be built:
/nix/store/1d8qhx9f22316bs29w1g2kwwhiklhh8w-iets-fuzzers-0.0.0.drv
/nix/store/nm05wfp1l7hg68a3h4r1a07n63c4s7a5-iet …
setup:
these 2 derivations will be built:
/nix/store/1d8qhx9f22316bs29w1g2kwwhiklhh8w-iets-fuzzers-0.0.0.drv
/nix/store/nm05wfp1l7hg68a3h4r1a07n63c4s7a5-iets-fuzz-drv-eval-check.drv
error: timed out after 1200 seconds
error: Cannot build '/nix/store/nm05wfp1l7hg68a3h4r1a07n63c4s7a5-iets-fuzz-drv-eval-check.drv'.
Reason: 1 dependency failed.
Output paths:
/nix/store/l3sywm73ry4l3l8n1bbsds606y5l91kx-iets-fuzz-drv-eval-check
|
| failed |
checks.x86_64-linux.fuzz-eval
|
1h 32m |
setup:
these 2 derivations will be built:
/nix/store/1d8qhx9f22316bs29w1g2kwwhiklhh8w-iets-fuzzers-0.0.0.drv
/nix/store/lrqzkh4j82i019wqcjl2w8zyy5b0835r-iet …
setup:
these 2 derivations will be built:
/nix/store/1d8qhx9f22316bs29w1g2kwwhiklhh8w-iets-fuzzers-0.0.0.drv
/nix/store/lrqzkh4j82i019wqcjl2w8zyy5b0835r-iets-fuzz-eval-check.drv
error: timed out after 1200 seconds
error: Cannot build '/nix/store/lrqzkh4j82i019wqcjl2w8zyy5b0835r-iets-fuzz-eval-check.drv'.
Reason: 1 dependency failed.
Output paths:
/nix/store/m2jwliwbj1sxp0k2wxrr661a097mcw0z-iets-fuzz-eval-check
|
| failed |
checks.x86_64-linux.fuzz-nar
|
35m 17s |
setup:
these 2 derivations will be built:
/nix/store/1d8qhx9f22316bs29w1g2kwwhiklhh8w-iets-fuzzers-0.0.0.drv
/nix/store/kpfylv1xpx6skwx12nk23xjgrbk3fs4r-iet …
setup:
these 2 derivations will be built:
/nix/store/1d8qhx9f22316bs29w1g2kwwhiklhh8w-iets-fuzzers-0.0.0.drv
/nix/store/kpfylv1xpx6skwx12nk23xjgrbk3fs4r-iets-fuzz-nar-check.drv
error: timed out after 1200 seconds
error: Cannot build '/nix/store/kpfylv1xpx6skwx12nk23xjgrbk3fs4r-iets-fuzz-nar-check.drv'.
Reason: 1 dependency failed.
Output paths:
/nix/store/lvbv296zxxa2fy6fr34kmab9pgq5i9wb-iets-fuzz-nar-check
|
| failed |
checks.x86_64-linux.fuzz-parse
|
2h 4m |
setup:
these 2 derivations will be built:
/nix/store/1d8qhx9f22316bs29w1g2kwwhiklhh8w-iets-fuzzers-0.0.0.drv
/nix/store/inwjhq13kx44s4rm0drqs321kj1g1zn6-iet …
setup:
these 2 derivations will be built:
/nix/store/1d8qhx9f22316bs29w1g2kwwhiklhh8w-iets-fuzzers-0.0.0.drv
/nix/store/inwjhq13kx44s4rm0drqs321kj1g1zn6-iets-fuzz-parse-check.drv
error: timed out after 1200 seconds
error: Cannot build '/nix/store/inwjhq13kx44s4rm0drqs321kj1g1zn6-iets-fuzz-parse-check.drv'.
Reason: 1 dependency failed.
Output paths:
/nix/store/a7mz63rirchg7xjg1rhmg30dbxhfka3v-iets-fuzz-parse-check
|
| failed |
checks.x86_64-linux.langtests
|
22m 13s |
… and 1 more failed derivation
… and 1 more failed derivation
|
| failed |
checks.x86_64-linux.linttest
|
17m 26s |
iets-linttest:
ok allow: runtime is silent
ok allow: covers the next line only
ok allow: silences a lint at error
ok allow: an unknown directive is unkn …
iets-linttest:
ok allow: runtime is silent
ok allow: covers the next line only
ok allow: silences a lint at error
ok allow: an unknown directive is unknown-allow and silences nothing
ok allow: own-line is silent from the IR cache
ok allow: runtime is silent from the IR cache
ok allow: a tracing-cache hit replays nothing; the comment is in the key
pass=83 fail=2
|
| failed |
checks.x86_64-linux.static
|
20m 30s |
iets-static-x86_64-unknown-linux-musl-0.1.0:
----------------------------------------------------------------------------------
decompressing cargo artifacts fr …
iets-static-x86_64-unknown-linux-musl-0.1.0:
----------------------------------------------------------------------------------
decompressing cargo artifacts from /nix/store/4nnbdqb0nbfa7xwj6a1kyww68hbn11bj-iets-deps-static-x86_64-unknown-linux-musl-0.1.0/target.tar.zst to target
will append /build/source/.cargo-home/config.toml with contents of /nix/store/kcp4b936hbdmdqyk70cz6fyd4gnf3msb-vendor-cargo-deps/config.toml
default configurePhase, nothing to do
+++ command cargo --version
cargo 1.98.0 (797e8a9bc 2026-08-05)
+++ command cargo build --release --message-format json-render-diagnostics --locked
Compiling iets v0.1.0 (/build/source)
|
| failed |
checks.x86_64-linux.test
|
12m 22s |
iets-nextest-0.1.0:
SLOW [>120.000s] (-------) iets runtime::value::tests::union_iteration_merges_like_a_fold
SLOW [>180.000s] (-------) iets ru …
iets-nextest-0.1.0:
SLOW [>120.000s] (-------) iets runtime::value::tests::union_iteration_merges_like_a_fold
SLOW [>180.000s] (-------) iets runtime::value::tests::union_iteration_merges_like_a_fold
SLOW [>240.000s] (-------) iets runtime::value::tests::union_iteration_merges_like_a_fold
PASS [ 241.726s] (521/521) iets runtime::value::tests::union_iteration_merges_like_a_fold
------------
Summary [ 248.464s] 521 tests run: 520 passed (3 slow), 1 failed, 5 skipped
FAIL [ 3.123s] (482/521) iets trace::tests::dedupe_of_many_repeats_is_linear
error: test run failed
|