nixbot

builds

numtide/iets build #79 failed

branch gh-readonly-queue/main/pr-85-f49d4d64dd9de2822f54cc67eaa4f22cca4e35c9 · commit b7da0f2650 · · took 2h 13m · eval 1m 13s

9 failed
failed attributes
status attribute duration
failed checks.aarch64-linux.fuzz-drv 7m 59s
setup: these 3 derivations will be built: /nix/store/20gkqs6mrgj653p7wr84k007skg5bf48-iets-fuzz-diff-0.0.0.drv /nix/store/alqc4f0vjcxxfpypzz9r6gb6621447hi-i …
setup:
these 3 derivations will be built:
  /nix/store/20gkqs6mrgj653p7wr84k007skg5bf48-iets-fuzz-diff-0.0.0.drv
  /nix/store/alqc4f0vjcxxfpypzz9r6gb6621447hi-iets-fuzzers-0.0.0.drv
  /nix/store/1mn76zqfnkg0i16zyh1vcp1navf6nidv-iets-fuzz-drv-check.drv
could not copy /nix/store/lip3qi4na9sz2wbalxw9ds78qc606bxi-iets-fuzzers-0.0.0: error: gRPC FetchNars failed: Stream removed (sendmsg: Broken pipe (32))
error: some outputs are unexpectedly invalid
failed checks.aarch64-linux.fuzz-eval 7m 51s
setup: these 3 derivations will be built: /nix/store/20gkqs6mrgj653p7wr84k007skg5bf48-iets-fuzz-diff-0.0.0.drv /nix/store/alqc4f0vjcxxfpypzz9r6gb6621447hi-i …
setup:
these 3 derivations will be built:
  /nix/store/20gkqs6mrgj653p7wr84k007skg5bf48-iets-fuzz-diff-0.0.0.drv
  /nix/store/alqc4f0vjcxxfpypzz9r6gb6621447hi-iets-fuzzers-0.0.0.drv
  /nix/store/gpl9ns6nkdvc0kjb4zaifpmak4v0xmvb-iets-fuzz-eval-check.drv
could not copy /nix/store/lip3qi4na9sz2wbalxw9ds78qc606bxi-iets-fuzzers-0.0.0: error: gRPC FetchNars failed: Stream removed (Socket closed)
error: some outputs are unexpectedly invalid
failed checks.aarch64-linux.fuzz-nar 6m 58s
setup: these 3 derivations will be built: /nix/store/20gkqs6mrgj653p7wr84k007skg5bf48-iets-fuzz-diff-0.0.0.drv /nix/store/alqc4f0vjcxxfpypzz9r6gb6621447hi-i …
setup:
these 3 derivations will be built:
  /nix/store/20gkqs6mrgj653p7wr84k007skg5bf48-iets-fuzz-diff-0.0.0.drv
  /nix/store/alqc4f0vjcxxfpypzz9r6gb6621447hi-iets-fuzzers-0.0.0.drv
  /nix/store/qw9i1psvvd6fna5clh6qn3cmr739768r-iets-fuzz-nar-check.drv
could not copy /nix/store/lip3qi4na9sz2wbalxw9ds78qc606bxi-iets-fuzzers-0.0.0: error: gRPC FetchNars failed: failed to connect to all addresses; last error: UNKNOWN: ipv4:65.21.215.17:50051: handshaker shutdown
error: some outputs are unexpectedly invalid
failed checks.aarch64-linux.static 22m 36s
iets-static-aarch64-unknown-linux-musl-0.1.0: ---------------------------------------------------------------------------------- decompressing cargo artifacts f …
iets-static-aarch64-unknown-linux-musl-0.1.0:
----------------------------------------------------------------------------------
decompressing cargo artifacts from /nix/store/3kbjnz6iih3nrl008lhhvmkn2g28zcyl-iets-deps-static-aarch64-unknown-linux-musl-0.1.0/target.tar.zst to target
will append /build/source/.cargo-home/config.toml with contents of /nix/store/ych65kf134f1wb6yn4fbs8b891iyzv94-vendor-cargo-deps/config.toml
default configurePhase, nothing to do
+++ command cargo --version
cargo 1.98.0 (797e8a9bc 2026-08-05)
+++ command cargo build --release --message-format json-render-diagnostics --locked
   Compiling iets v0.1.0 (/build/source)
failed checks.x86_64-linux.classic-e2e 1h 2m
container-test-run-iets-classic-e2e: !!! Traceback (most recent call last): !!! File "<string>", line 8, in <module> !!! machine.succeed("runuser -l alice …
container-test-run-iets-classic-e2e:
!!! Traceback (most recent call last):
!!!   File "<string>", line 8, in <module>
!!!     machine.succeed("runuser -l alice -c 'cd iets && IETS=/nix/store/qnxz3nwdypz33gzpy1bbjn7p1bcll23m-iets-0.1.0/bin/iets NIXPKGS=/nix/store/hhfnpma32czw4h3bqpag8dciax0bcmar-source E2E_OFFLINE=1   nu scripts/classic-e2e.nu' >&2")
!!! 
!!! RequestedAssertionFailed: command `runuser -l alice -c 'cd iets && IETS=/nix/store/qnxz3nwdypz33gzpy1bbjn7p1bcll23m-iets-0.1.0/bin/iets NIXPKGS=/nix/store/hhfnpma32czw4h3bqpag8dciax0bcmar-source E2E_OFFLINE=1   nu scripts/classic-e2e.nu' >&2` failed (exit code -9)
cleanup
kill NspawnMachine (pid 50)
Terminated                 /nix/store/xvkrrqjlpqx0hwdk14frc5prbqn5cgp1-nixos-test-driver-iets-classic-e2e/bin/nixos-test-driver -o $out
failed checks.x86_64-linux.conformance 20m 42s
setup: these 4 derivations will be built: /nix/store/iflqbk3anih39asvfbw190711m0fisq7-iets-0.1.0.drv /nix/store/ps41vjbx4kr93az9hc6aaky6jzazxzgi-iets-fuzz-d …
setup:
these 4 derivations will be built:
  /nix/store/iflqbk3anih39asvfbw190711m0fisq7-iets-0.1.0.drv
  /nix/store/ps41vjbx4kr93az9hc6aaky6jzazxzgi-iets-fuzz-diff-0.0.0.drv
  /nix/store/9llgyvbdr5am0d76q09kf86i02jmkyiz-iets-conformance-adapter.drv
  /nix/store/79fqgzh3m0zb37laqy6xnpy6zr2zwsg7-nix-conformance-iets.drv
error: timed out after 1200 seconds
error: Cannot build '/nix/store/9llgyvbdr5am0d76q09kf86i02jmkyiz-iets-conformance-adapter.drv'.
       Reason: 1 dependency failed.
       Output paths:
         /nix/store/w1gwk98sfv5q7zd8qz3x8cw0agmwv7mb-iets-conformance-adapter
error: Cannot build '/nix/store/79fqgzh3m0zb37laqy6xnpy6zr2zwsg7-nix-conformance-iets.drv'.
       Reason: 1 dependency failed.
       Output paths:
         /nix/store/9q2ixlcwxmzn5m3xyvhw36p2cxppfkks-nix-conformance-iets
failed checks.x86_64-linux.flaketest 1h 1m
container-test-run-iets-flaketest: !!! File "<string>", line 8, in <module> !!! machine.succeed("runuser -l alice -c 'cd iets && IETS=/nix/store/qnxz3nwdy …
container-test-run-iets-flaketest:
!!!   File "<string>", line 8, in <module>
!!!     machine.succeed("runuser -l alice -c 'cd iets && IETS=/nix/store/qnxz3nwdypz33gzpy1bbjn7p1bcll23m-iets-0.1.0/bin/iets NIXPKGS=/nix/store/hhfnpma32czw4h3bqpag8dciax0bcmar-source E2E_OFFLINE=1   nu scripts/flaketest.nu' >&2")
!!! 
!!! RequestedAssertionFailed: command `runuser -l alice -c 'cd iets && IETS=/nix/store/qnxz3nwdypz33gzpy1bbjn7p1bcll23m-iets-0.1.0/bin/iets NIXPKGS=/nix/store/hhfnpma32czw4h3bqpag8dciax0bcmar-source E2E_OFFLINE=1   nu scripts/flaketest.nu' >&2` failed (exit code -9)
cleanup
kill NspawnMachine (pid 50)
Container machine terminated by signal KILL.
Terminated                 /nix/store/xvf1r6xz62lx2h8d39xwyvlxhyfnqfsw-nixos-test-driver-iets-flaketest/bin/nixos-test-driver -o $out
failed checks.x86_64-linux.linttest 28m 32s
iets-linttest: ok allow: runtime is silent ok allow: covers the next line only ok allow: silences a lint at error ok allow: an unknown directive is unkn …
iets-linttest:
ok   allow: runtime is silent
ok   allow: covers the next line only
ok   allow: silences a lint at error
ok   allow: an unknown directive is unknown-allow and silences nothing
ok   allow: own-line is silent from the IR cache
ok   allow: runtime is silent from the IR cache
ok   allow: a tracing-cache hit replays nothing; the comment is in the key
pass=81 fail=4
failed checks.x86_64-linux.static 20m 34s
iets-static-x86_64-unknown-linux-musl-0.1.0: ---------------------------------------------------------------------------------- decompressing cargo artifacts fr …
iets-static-x86_64-unknown-linux-musl-0.1.0:
----------------------------------------------------------------------------------
decompressing cargo artifacts from /nix/store/4nnbdqb0nbfa7xwj6a1kyww68hbn11bj-iets-deps-static-x86_64-unknown-linux-musl-0.1.0/target.tar.zst to target
will append /build/source/.cargo-home/config.toml with contents of /nix/store/kcp4b936hbdmdqyk70cz6fyd4gnf3msb-vendor-cargo-deps/config.toml
default configurePhase, nothing to do
+++ command cargo --version
cargo 1.98.0 (797e8a9bc 2026-08-05)
+++ command cargo build --release --message-format json-render-diagnostics --locked
   Compiling iets v0.1.0 (/build/source)
38 succeeded
succeeded attributes
status attribute duration
loading…