nixbot

builds

numtide/iets build #472 failed

branch main · PR #195 · commit 822eb6d4f0 · · took 1h 4m · eval 41s

eval warnings 2 kinds · 2 occurrences
  • warn setting 'accept-flake-config' is ignored: iets never applies a flake's nixConfig, so a flake that sets extra-substituters or allow-import-from-derivation there runs without them; put the settings in nix.conf ×1
  • warn setting 'plugin-files' is ignored: iets loads no plugins ×1

10 failed
failed attributes
status attribute duration
failed checks.x86_64-linux.classic-e2e 1s
setup: error: gRPC QueryMissing on 'farm.numtide.com:50051' failed: bearer token rejected hint: Set NIX_GRPC_DEBUG=1 for a handshake trace.
setup:
error: gRPC QueryMissing on 'farm.numtide.com:50051' failed: bearer token rejected
       hint: Set NIX_GRPC_DEBUG=1 for a handshake trace.
failed checks.x86_64-linux.conformance 1s
setup: error: gRPC QueryMissing on 'farm.numtide.com:50051' failed: bearer token rejected hint: Set NIX_GRPC_DEBUG=1 for a handshake trace.
setup:
error: gRPC QueryMissing on 'farm.numtide.com:50051' failed: bearer token rejected
       hint: Set NIX_GRPC_DEBUG=1 for a handshake trace.
failed checks.x86_64-linux.fuzz-drv 1s
setup: error: gRPC QueryMissing on 'farm.numtide.com:50051' failed: bearer token rejected hint: Set NIX_GRPC_DEBUG=1 for a handshake trace.
setup:
error: gRPC QueryMissing on 'farm.numtide.com:50051' failed: bearer token rejected
       hint: Set NIX_GRPC_DEBUG=1 for a handshake trace.
failed checks.x86_64-linux.fuzz-drv-eval 1s
setup: error: gRPC QueryMissing on 'farm.numtide.com:50051' failed: bearer token rejected hint: Set NIX_GRPC_DEBUG=1 for a handshake trace.
setup:
error: gRPC QueryMissing on 'farm.numtide.com:50051' failed: bearer token rejected
       hint: Set NIX_GRPC_DEBUG=1 for a handshake trace.
failed checks.x86_64-linux.fuzz-eval 1s
setup: error: gRPC QueryMissing on 'farm.numtide.com:50051' failed: bearer token rejected hint: Set NIX_GRPC_DEBUG=1 for a handshake trace.
setup:
error: gRPC QueryMissing on 'farm.numtide.com:50051' failed: bearer token rejected
       hint: Set NIX_GRPC_DEBUG=1 for a handshake trace.
failed checks.x86_64-linux.fuzz-nar 2s
setup: error: gRPC QueryMissing on 'farm.numtide.com:50051' failed: bearer token rejected hint: Set NIX_GRPC_DEBUG=1 for a handshake trace.
setup:
error: gRPC QueryMissing on 'farm.numtide.com:50051' failed: bearer token rejected
       hint: Set NIX_GRPC_DEBUG=1 for a handshake trace.
failed checks.x86_64-linux.fuzz-parse 1s
setup: error: gRPC QueryMissing on 'farm.numtide.com:50051' failed: bearer token rejected hint: Set NIX_GRPC_DEBUG=1 for a handshake trace.
setup:
error: gRPC QueryMissing on 'farm.numtide.com:50051' failed: bearer token rejected
       hint: Set NIX_GRPC_DEBUG=1 for a handshake trace.
failed checks.x86_64-linux.fuzz-wire 1s
setup: error: gRPC QueryMissing on 'farm.numtide.com:50051' failed: bearer token rejected hint: Set NIX_GRPC_DEBUG=1 for a handshake trace.
setup:
error: gRPC QueryMissing on 'farm.numtide.com:50051' failed: bearer token rejected
       hint: Set NIX_GRPC_DEBUG=1 for a handshake trace.
failed checks.x86_64-linux.grpc-e2e 1s
setup: error: gRPC QueryMissing on 'farm.numtide.com:50051' failed: bearer token rejected hint: Set NIX_GRPC_DEBUG=1 for a handshake trace.
setup:
error: gRPC QueryMissing on 'farm.numtide.com:50051' failed: bearer token rejected
       hint: Set NIX_GRPC_DEBUG=1 for a handshake trace.
failed checks.x86_64-linux.static 2s
setup: error: gRPC QueryMissing on 'farm.numtide.com:50051' failed: bearer token rejected hint: Set NIX_GRPC_DEBUG=1 for a handshake trace.
setup:
error: gRPC QueryMissing on 'farm.numtide.com:50051' failed: bearer token rejected
       hint: Set NIX_GRPC_DEBUG=1 for a handshake trace.
31 succeeded
succeeded attributes
status attribute duration
loading…
3 already built
skipped attributes
status attribute duration
loading…