nixbot

builds

numtide/iets build #471 failed

branch main · PR #207 · commit b6e591f57c · · took 1h 8m · eval 29s

eval warnings 2 kinds · 2 occurrences
  • warn setting 'accept-flake-config' is ignored: iets never applies a flake's nixConfig, so a flake that sets extra-substituters or allow-import-from-derivation there runs without them; put the settings in nix.conf ×1
  • warn setting 'plugin-files' is ignored: iets loads no plugins ×1

9 failed
failed attributes
status attribute duration
failed checks.x86_64-linux.cross-riscv64 1s
setup: error: gRPC QueryMissing on 'farm.numtide.com:50051' failed: bearer token rejected hint: Set NIX_GRPC_DEBUG=1 for a handshake trace.
setup:
error: gRPC QueryMissing on 'farm.numtide.com:50051' failed: bearer token rejected
       hint: Set NIX_GRPC_DEBUG=1 for a handshake trace.
failed checks.x86_64-linux.daemon-e2e 1s
setup: error: gRPC QueryMissing on 'farm.numtide.com:50051' failed: bearer token rejected hint: Set NIX_GRPC_DEBUG=1 for a handshake trace.
setup:
error: gRPC QueryMissing on 'farm.numtide.com:50051' failed: bearer token rejected
       hint: Set NIX_GRPC_DEBUG=1 for a handshake trace.
failed checks.x86_64-linux.evaljobs-flags 1s
setup: error: gRPC QueryMissing on 'farm.numtide.com:50051' failed: bearer token rejected hint: Set NIX_GRPC_DEBUG=1 for a handshake trace.
setup:
error: gRPC QueryMissing on 'farm.numtide.com:50051' failed: bearer token rejected
       hint: Set NIX_GRPC_DEBUG=1 for a handshake trace.
failed checks.x86_64-linux.fuzz-drv 2s
setup: error: gRPC QueryMissing on 'farm.numtide.com:50051' failed: bearer token rejected hint: Set NIX_GRPC_DEBUG=1 for a handshake trace.
setup:
error: gRPC QueryMissing on 'farm.numtide.com:50051' failed: bearer token rejected
       hint: Set NIX_GRPC_DEBUG=1 for a handshake trace.
failed checks.x86_64-linux.fuzz-drv-eval 1s
setup: error: gRPC QueryMissing on 'farm.numtide.com:50051' failed: bearer token rejected hint: Set NIX_GRPC_DEBUG=1 for a handshake trace.
setup:
error: gRPC QueryMissing on 'farm.numtide.com:50051' failed: bearer token rejected
       hint: Set NIX_GRPC_DEBUG=1 for a handshake trace.
failed checks.x86_64-linux.fuzz-eval 3s
setup: these 2 derivations will be built: error: gRPC QueryPathInfos on 'farm.numtide.com:50051' failed: bearer token rejected hint: Set NIX_GRPC_DEBUG=1 …
setup:
these 2 derivations will be built:
error: gRPC QueryPathInfos on 'farm.numtide.com:50051' failed: bearer token rejected
       hint: Set NIX_GRPC_DEBUG=1 for a handshake trace.
failed checks.x86_64-linux.fuzz-nar 2s
setup: these 2 derivations will be built: error: gRPC QueryPathInfos on 'farm.numtide.com:50051' failed: bearer token rejected hint: Set NIX_GRPC_DEBUG=1 …
setup:
these 2 derivations will be built:
error: gRPC QueryPathInfos on 'farm.numtide.com:50051' failed: bearer token rejected
       hint: Set NIX_GRPC_DEBUG=1 for a handshake trace.
failed checks.x86_64-linux.fuzz-parse 1s
setup: error: gRPC QueryMissing on 'farm.numtide.com:50051' failed: bearer token rejected hint: Set NIX_GRPC_DEBUG=1 for a handshake trace.
setup:
error: gRPC QueryMissing on 'farm.numtide.com:50051' failed: bearer token rejected
       hint: Set NIX_GRPC_DEBUG=1 for a handshake trace.
failed checks.x86_64-linux.fuzz-wire 1s
setup: error: gRPC QueryMissing on 'farm.numtide.com:50051' failed: bearer token rejected hint: Set NIX_GRPC_DEBUG=1 for a handshake trace.
setup:
error: gRPC QueryMissing on 'farm.numtide.com:50051' failed: bearer token rejected
       hint: Set NIX_GRPC_DEBUG=1 for a handshake trace.
32 succeeded
succeeded attributes
status attribute duration
loading…
3 already built
skipped attributes
status attribute duration
loading…