iets-nextest-0.1.0
checks.aarch64-linux.test
· build #443
· raw
1elastic-arm-aaeea819: building cmfis5sr0akpiaaif3a8fb9gvflmbjj0-iets-nextest-0.1.0.drv
unpackPhase
2unpacking source archive /nix/store/8dhlzljahd467zbj29rkfc2jrx5b2dm7-source3source root is sourcepatchPhase
4Executing configureCargoCommonVars5decompressing cargo artifacts from /nix/store/hgrp7hd209cjnbpq1cagcwcc404690ww-iets-deps-0.1.0/target.tar.zst to targetconfigurePhase
6will append /build/source/.cargo-home/config.toml with contents of /nix/store/xxq0blv9rwlynz621b9rcxrpnkm5if8f-vendor-cargo-deps/config.toml7default configurePhase, nothing to dobuildPhase
8+++ command cargo --version9cargo 1.98.0 (797e8a9bc 2026-08-05)10+++ command cargo nextest --version11cargo-nextest 0.9.14612release: 0.9.14613host: aarch64-unknown-linux-gnucheckPhase
14+++ command cargo nextest run --cargo-profile dev15 Compiling iets v0.1.0 (/build/source)16 Finished `dev` profile [unoptimized + debuginfo] target(s) in 44.71s17------------18 Nextest run ID 449dddf1-0907-4258-9d55-294adf392e24 with nextest profile: default19 Starting 1035 tests across 31 binaries (6 tests skipped)20 PASS [ 0.019s] ( 1/1035) iets api::installable::tests::the_name_a_program_takes_from_a_derivation_name21 PASS [ 0.019s] ( 2/1035) iets api::drvshow::tests::pretty_matches_serde_json22 PASS [ 0.021s] ( 3/1035) iets api::drvshow::tests::inputs_and_structured_attrs23 PASS [ 0.021s] ( 4/1035) iets api::drvshow::tests::a_fixed_output_shows_its_content_address_and_no_path24 PASS [ 0.021s] ( 5/1035) iets api::drvshow::tests::a_non_canonical_structured_attrs_text_is_renormalised25 PASS [ 0.022s] ( 6/1035) iets api::drvshow::tests::a_multi_output_derivation26 PASS [ 0.021s] ( 7/1035) iets api::fetch::tests::the_fake_hash_moves_the_output_and_the_drv27 PASS [ 0.023s] ( 8/1035) iets api::fetch::tests::only_a_fixed_output_drv_can_be_prefetched28 PASS [ 0.023s] ( 9/1035) iets api::installable::tests::default_and_fragment_attr_paths29 PASS [ 0.023s] ( 10/1035) iets api::drvshow::tests::floats_take_nlohmanns_form30 PASS [ 0.025s] ( 11/1035) iets api::run::tests::a_fiber_template_carries_the_configuration31 PASS [ 0.028s] ( 12/1035) iets api::value::tests::apply_is_lazy32 PASS [ 0.012s] ( 13/1035) iets api::value::tests::attrs_by_name_and_index33 PASS [ 0.012s] ( 14/1035) iets api::value::tests::force_deep_forces_the_whole_tree34 PASS [ 0.010s] ( 15/1035) iets argv::tests::every_byte_round_trips35 PASS [ 0.012s] ( 16/1035) iets api::value::tests::thunk_reads_as_thunk36 PASS [ 0.014s] ( 17/1035) iets api::value::tests::lists37 PASS [ 0.014s] ( 18/1035) iets api::value::tests::missing_attribute38 PASS [ 0.014s] ( 19/1035) iets api::value::tests::wrong_type_is_an_error39 PASS [ 0.009s] ( 20/1035) iets build::backend::tests::output_specs40 PASS [ 0.008s] ( 21/1035) iets build::backend::tests::the_timings_report_with_every_line41 PASS [ 0.006s] ( 22/1035) iets build::executor::tests::a_declared_system_filters42 PASS [ 0.007s] ( 23/1035) iets build::event::tests::durations43 PASS [ 0.007s] ( 24/1035) iets build::executor::tests::a_feature_the_place_lacks_rules_it_out44 PASS [ 0.016s] ( 25/1035) iets build::backend::tests::base_names_drop_the_store_dir45 PASS [ 0.026s] ( 26/1035) iets api::value::tests::calling_a_function46 PASS [ 0.024s] ( 27/1035) iets api::value::tests::construction47 PASS [ 0.008s] ( 28/1035) iets build::executor::tests::an_unsupported_url_says_what_is_expected48 PASS [ 0.024s] ( 29/1035) iets api::value::tests::scalars49 PASS [ 0.025s] ( 30/1035) iets api::value::tests::strings_and_context50 PASS [ 0.008s] ( 31/1035) iets build::executor::tests::the_first_place_that_takes_it_wins51 PASS [ 0.010s] ( 32/1035) iets build::executor::tests::no_place_at_all_is_a_usage_error52 PASS [ 0.015s] ( 33/1035) iets build::executor::tests::a_refusal_names_every_place_and_what_it_declared53 PASS [ 0.009s] ( 34/1035) iets build::fanout::tests::a_failed_dependency_blocks_its_dependants54 PASS [ 0.006s] ( 35/1035) iets build::fixhash::tests::a_longer_hash_is_not_a_match55 PASS [ 0.011s] ( 36/1035) iets build::executor::tests::one_place_declaring_nothing_takes_everything56 PASS [ 0.008s] ( 37/1035) iets build::render::tests::a_build_log_never_reports_a_mismatch57 PASS [ 0.007s] ( 38/1035) iets build::render::tests::a_build_the_backend_saw_succeed_is_verdicted_at_once58 PASS [ 0.010s] ( 39/1035) iets build::fixhash::tests::two_matches_are_left_alone59 PASS [ 0.007s] ( 40/1035) iets build::render::tests::a_daemon_failure_message_decides_the_verdict60 PASS [ 0.008s] ( 41/1035) iets build::render::tests::a_stalled_build_that_fails_still_shows_its_cause61 PASS [ 0.007s] ( 42/1035) iets build::render::tests::an_unfolded_success_ends_with_its_verdict62 PASS [ 0.012s] ( 43/1035) iets build::render::tests::a_failure_after_the_activity_ended_never_claims_a_success63 PASS [ 0.010s] ( 44/1035) iets build::render::tests::an_owned_build_is_verdicted_once_by_its_op64 PASS [ 0.012s] ( 45/1035) iets build::render::tests::a_long_attribute_keeps_its_ends65 PASS [ 0.008s] ( 46/1035) iets build::render::tests::drv_paths_of_a_failure_message66 PASS [ 0.020s] ( 47/1035) iets build::fanout::tests::dependencies_run_first67 PASS [ 0.013s] ( 48/1035) iets build::render::tests::a_failure_shows_a_short_extract68 PASS [ 0.011s] ( 49/1035) iets build::render::tests::ci_folds_a_success_and_never_a_failure69 PASS [ 0.010s] ( 50/1035) iets build::render::tests::logs_of_two_builds_do_not_interleave70 PASS [ 0.012s] ( 51/1035) iets build::render::tests::heartbeat_names_running_builds71 PASS [ 0.010s] ( 52/1035) iets build::render::tests::one_build_needs_no_summary72 PASS [ 0.009s] ( 53/1035) iets build::render::tests::tty_keeps_successful_logs_off_the_screen73 PASS [ 0.012s] ( 54/1035) iets build::render::tests::the_live_region_spins_and_counts74 PASS [ 0.012s] ( 55/1035) iets build::render::tests::the_summary_follows_more_than_one_build75 PASS [ 0.007s] ( 56/1035) iets build::tests::targets_become_jobs76 PASS [ 0.012s] ( 57/1035) iets build::tests::hash_stripping77 PASS [ 0.008s] ( 58/1035) iets builtins::derivation::tests::the_two_placeholders_are_not_the_same78 PASS [ 0.018s] ( 59/1035) iets build::tests::a_target_with_no_verdict_fails79 PASS [ 0.017s] ( 60/1035) iets builtins::derivation::tests::a_dynamic_output_renders_the_placeholder_nix_renders80 PASS [ 0.011s] ( 61/1035) iets builtins::fetch::tests::an_entry_of_the_compiled_file_cache_keeps_the_site81 PASS [ 0.025s] ( 62/1035) iets build::render::tests::the_status_line_takes_the_colours_of_the_rows_above82 PASS [ 0.016s] ( 63/1035) iets builtins::fetch::tests::nix_sees_no_mark83 PASS [ 0.008s] ( 64/1035) iets builtins::fetch_git::tests::a_working_tree_is_a_file_url_of_an_absolute_path84 PASS [ 0.031s] ( 65/1035) iets build::tests::a_fan_out_backend_keeps_the_cap_and_the_log_blocks85 PASS [ 0.050s] ( 66/1035) iets build::fixhash::tests::one_match_is_rewritten_in_its_own_spelling86 PASS [ 0.023s] ( 67/1035) iets builtins::fetch::tests::the_first_read_of_a_tree_gives_its_finding87 PASS [ 0.021s] ( 68/1035) iets builtins::fetch::tests::the_mark_follows_the_string_like_store_context88 PASS [ 0.012s] ( 69/1035) iets builtins::text::fromtoml::tests::inline_tables_stay_on_one_line89 PASS [ 0.012s] ( 70/1035) iets builtins::store_hooks::tests::virtual_tree_reads_go_to_the_local_files90 PASS [ 0.015s] ( 71/1035) iets builtins::store_hooks::tests::a_relative_path_inside_an_entry_joins_once91 PASS [ 0.020s] ( 72/1035) iets builtins::fetch_git::tests::only_a_plain_rev_or_ref_is_read_by_iets92 PASS [ 0.073s] ( 73/1035) iets build::fanout::tests::at_most_limit_builds_run_at_once93 PASS [ 0.044s] ( 74/1035) iets builtins::fetch::tests::a_read_of_the_count_is_one_finding_for_each_tree94 PASS [ 0.043s] ( 75/1035) iets builtins::fetch::tests::a_read_that_is_not_a_selection_has_no_site95 PASS [ 0.015s] ( 76/1035) iets builtins::text::fromtoml::tests::new_escapes_are_refused96 PASS [ 0.032s] ( 77/1035) iets builtins::fetch::tests::the_name_on_a_value_that_is_not_a_tree_is_silent97 PASS [ 0.016s] ( 78/1035) iets builtins::text::regex::tests::names98 PASS [ 0.048s] ( 79/1035) iets builtins::fetch::tests::a_selection_of_the_count_is_the_site99 PASS [ 0.014s] ( 80/1035) iets cachefs::tests::a_directory_that_is_not_ours_is_refused_untouched100 PASS [ 0.016s] ( 81/1035) iets builtins::text::regex::tests::size_limit101 PASS [ 0.007s] ( 82/1035) iets cachefs::tests::a_store_without_a_version_file_is_wiped_once102 PASS [ 0.011s] ( 83/1035) iets cachefs::tests::a_wait_lock_waits_for_its_holder103 PASS [ 0.012s] ( 84/1035) iets cachefs::tests::a_touch_inside_the_interval_writes_nothing104 PASS [ 0.015s] ( 85/1035) iets cachefs::tests::a_stamp_in_the_future_is_due105 PASS [ 0.015s] ( 86/1035) iets cachefs::tests::a_sweep_runs_once_per_interval106 PASS [ 0.008s] ( 87/1035) iets cachefs::tests::an_empty_directory_is_ours_to_take107 PASS [ 0.047s] ( 88/1035) iets builtins::fetch::tests::the_tree_decides_the_level108 PASS [ 0.011s] ( 89/1035) iets cachefs::tests::an_input_store_of_the_spool_layout_is_wiped109 PASS [ 0.011s] ( 90/1035) iets cachefs::tests::a_wipe_keeps_what_iets_did_not_create110 PASS [ 0.014s] ( 91/1035) iets cachefs::tests::garbled_stamp_wipes_the_store111 PASS [ 0.008s] ( 92/1035) iets cachefs::tests::sweep_drops_old_entries_and_keeps_young_ones112 PASS [ 0.014s] ( 93/1035) iets cachefs::tests::a_wipe_of_the_ir_cache_walks_its_shards113 PASS [ 0.010s] ( 94/1035) iets cachefs::tests::sweep_ages_a_root_by_its_link_not_by_what_it_names114 PASS [ 0.012s] ( 95/1035) iets cachefs::tests::version_mismatch_wipes_the_store115 PASS [ 0.009s] ( 96/1035) iets cli::build::tests::a_path_on_stdout_is_silent116 PASS [ 0.010s] ( 97/1035) iets cli::build::tests::a_success_with_no_output_path_is_named117 PASS [ 0.010s] ( 98/1035) iets cli::build::tests::no_build_result_is_named118 PASS [ 0.017s] ( 99/1035) iets cachefs::tests::sweep_walks_the_shards_of_the_ir_cache119 PASS [ 0.008s] ( 100/1035) iets cli::build::tests::no_outcome_at_all_is_named120 PASS [ 0.011s] ( 101/1035) iets cli::build::tests::installables_are_sorted_without_repeats121 PASS [ 0.015s] ( 102/1035) iets cli::build::tests::a_failed_build_reports_itself122 PASS [ 0.007s] ( 103/1035) iets cli::classic::nix::tests::flake_registry_is_the_setting123 PASS [ 0.008s] ( 104/1035) iets cli::build::tests::out_links_are_named_as_nix_build_names_them124 PASS [ 0.015s] ( 105/1035) iets cli::build::tests::an_out_flag_that_matches_nothing_is_named125 PASS [ 0.007s] ( 106/1035) iets cli::classic::shell::tests::declares_for_every_bash_shaped_value126 PASS [ 0.009s] ( 107/1035) iets cli::classic::shell::tests::outputs_become_placeholders127 PASS [ 0.008s] ( 108/1035) iets cli::classic::tests::a_flag_with_no_effect_is_noted_and_one_that_holds_is_not128 PASS [ 0.008s] ( 109/1035) iets cli::complete::tests::a_flag_value_completes_by_its_placeholder129 PASS [ 0.014s] ( 110/1035) iets cli::classic::nix::tests::eval_takes_print_build_logs130 PASS [ 0.011s] ( 111/1035) iets cli::classic::shell::tests::sh_var_names131 PASS [ 0.010s] ( 112/1035) iets cli::complete::tests::every_script_asks_the_binary132 PASS [ 0.012s] ( 113/1035) iets cli::complete::tests::commands_complete_with_their_summary133 PASS [ 0.009s] ( 114/1035) iets cli::complete::tests::flags_complete_after_a_dash134 PASS [ 0.007s] ( 115/1035) iets cli::complete::tests::subcommands_and_topics135 PASS [ 0.007s] ( 116/1035) iets cli::docs::tests::topics_resolve_bare_and_qualified136 PASS [ 0.008s] ( 117/1035) iets cli::docs::tests::the_topic_list_fits_80_columns137 PASS [ 0.009s] ( 118/1035) iets cli::docs::tests::every_embedded_page_has_a_heading138 PASS [ 0.006s] ( 119/1035) iets cli::help::tests::messages139 PASS [ 0.008s] ( 120/1035) iets cli::plumbing::tests::a_file_url_needs_one_slash_not_three140 PASS [ 0.015s] ( 121/1035) iets cli::help::tests::help_fits_80_columns141 PASS [ 0.016s] ( 122/1035) iets cli::help::tests::a_mistyped_command_is_suggested142 PASS [ 0.027s] ( 123/1035) iets cli::complete::tests::a_positional_is_left_to_the_shell143 PASS [ 0.011s] ( 124/1035) iets cli::plumbing::tests::a_url_is_the_positional_fetch_takes_itself144 PASS [ 0.021s] ( 125/1035) iets cli::diff::tests::a_name_ends_at_the_first_dash_before_a_digit145 PASS [ 0.014s] ( 126/1035) iets cli::help::tests::suggestions_come_from_the_help146 PASS [ 0.011s] ( 127/1035) iets cli::render::text::tests::a_long_value_shows_the_lines_that_differ147 PASS [ 0.019s] ( 128/1035) iets cli::render::tests::sizes_render_as_nix_renders_them148 PASS [ 0.007s] ( 129/1035) iets cli::search::tests::merged_highlights149 PASS [ 0.007s] ( 130/1035) iets cli::search::tests::index_round_trip150 PASS [ 0.072s] ( 131/1035) iets cachefs::tests::a_lock_that_cannot_be_opened_is_not_a_busy_lock151 PASS [ 0.192s] ( 132/1035) iets api::run::tests::the_counters_cover_the_helper_fibers152 PASS [ 0.012s] ( 133/1035) iets cli::search::tests::drv_names153 PASS [ 0.018s] ( 134/1035) iets cli::run::tests::a_usage_error_is_an_exit_code_and_a_message154 PASS [ 0.008s] ( 135/1035) iets config::tests::a_classic_name_leaves_an_unimplemented_setting_to_nix155 PASS [ 0.064s] ( 136/1035) iets cachefs::tests::the_writer_lock_excludes_one_holder_at_a_time156 PASS [ 0.008s] ( 137/1035) iets config::tests::a_setting_with_no_effect_is_noted157 PASS [ 0.007s] ( 138/1035) iets config::tests::basic_syntax158 PASS [ 0.010s] ( 139/1035) iets config::tests::bad_typed_values_error_where_they_are_set159 PASS [ 0.008s] ( 140/1035) iets config::tests::bool_spellings160 PASS [ 0.008s] ( 141/1035) iets config::tests::include_chain161 PASS [ 0.014s] ( 142/1035) iets config::tests::an_alias_is_its_setting162 PASS [ 0.009s] ( 143/1035) iets config::tests::extra_appends_to_list_settings_only163 PASS [ 0.021s] ( 144/1035) iets compile::cache::tests::nesting_past_the_cap_misses164 PASS [ 0.022s] ( 145/1035) iets compile::cache::tests::a_malformed_entry_is_a_miss_and_never_a_crash165 PASS [ 0.007s] ( 146/1035) iets config::tests::option_nix_path_replaces_nix_path_and_extra_adds166 PASS [ 0.011s] ( 147/1035) iets config::tests::max_jobs_auto_is_the_cpu_count167 PASS [ 0.033s] ( 148/1035) iets cli::run::tests::eval_prints_its_value168 PASS [ 0.008s] ( 149/1035) iets config::tests::overrides_win_over_files169 PASS [ 0.009s] ( 150/1035) iets config::tests::the_daemon_gets_the_store_settings_set_outside_the_system_file170 PASS [ 0.011s] ( 151/1035) iets config::tests::missing_include_errors_and_bang_include_does_not171 PASS [ 0.034s] ( 152/1035) iets cli::run::tests::the_hosts_environment_reaches_the_lint_configuration172 PASS [ 0.011s] ( 153/1035) iets config::tests::syntax_errors173 PASS [ 0.007s] ( 154/1035) iets devenv::tests::cached_result_roundtrip174 PASS [ 0.008s] ( 155/1035) iets config::tests::user_conf_files_are_in_precedence_order175 PASS [ 0.013s] ( 156/1035) iets config::tests::typed_getters_and_defaults176 PASS [ 0.012s] ( 157/1035) iets config::tests::unknown_settings_are_kept177 PASS [ 0.009s] ( 158/1035) iets devenv::tests::json_roundtrip_and_bash_forms178 PASS [ 0.007s] ( 159/1035) iets devenv::tests::rc_script_rewrites_outputs_and_writes_attrs179 PASS [ 0.008s] ( 160/1035) iets devenv::tests::non_bash_builder_is_refused180 PASS [ 0.009s] ( 161/1035) iets devenv::tests::output_checks_are_erased_only_when_present181 PASS [ 0.013s] ( 162/1035) iets devenv::tests::get_env_sh_store_path_matches_nix182 PASS [ 0.007s] ( 163/1035) iets display::tests::a_frame_is_one_synchronized_write183 PASS [ 0.007s] ( 164/1035) iets display::tests::a_resize_burst_never_erases184 PASS [ 0.007s] ( 165/1035) iets display::tests::a_region_taller_than_the_screen_is_clamped185 PASS [ 0.021s] ( 166/1035) iets config::tests::the_setting_tables_name_nix_settings186 PASS [ 0.051s] ( 167/1035) iets compile::cache::tests::a_changed_byte_never_makes_the_evaluator_read_past_its_env187 PASS [ 0.011s] ( 168/1035) iets devenv::tests::rewrites_apply_in_map_order_to_every_occurrence188 PASS [ 0.012s] ( 169/1035) iets devenv::tests::shell_escaping189 PASS [ 0.010s] ( 170/1035) iets display::tests::a_full_width_line_keeps_its_last_column190 PASS [ 0.007s] ( 171/1035) iets display::tests::colour_and_width191 PASS [ 0.014s] ( 172/1035) iets display::tests::a_resize_keeps_one_region192 PASS [ 0.015s] ( 173/1035) iets display::tests::a_region_that_grows_and_shrinks_loses_no_output193 PASS [ 0.009s] ( 174/1035) iets display::tests::output_starts_at_the_origin194 PASS [ 0.010s] ( 175/1035) iets display::tests::the_region_keeps_its_rows_until_a_smaller_size_lasts195 PASS [ 0.011s] ( 176/1035) iets display::tests::output_scrolls_and_the_region_stays_at_the_bottom196 PASS [ 0.011s] ( 177/1035) iets display::tests::growth_does_not_eat_output197 PASS [ 0.011s] ( 178/1035) iets display::tests::the_region_comes_down_on_close198 PASS [ 0.011s] ( 179/1035) iets display::tests::wrapped_output_does_not_corrupt_the_region199 PASS [ 0.012s] ( 180/1035) iets eval::tests::a_function_select_is_a_fresh_slot_when_its_subject_is_forced200 PASS [ 0.012s] ( 181/1035) iets eval::tests::a_second_pseudo_file_keeps_its_own_positions201 PASS [ 0.021s] ( 182/1035) iets eval::tests::an_invalid_regex_fails_before_the_string_is_forced202 PASS [ 0.020s] ( 183/1035) iets eval::tests::arithmetic_and_strings203 PASS [ 0.020s] ( 184/1035) iets eval::tests::derivation_keeps_env_and_args_that_are_not_utf8204 PASS [ 0.028s] ( 185/1035) iets eval::tests::derivation_wrapper_exists205 PASS [ 0.028s] ( 186/1035) iets eval::tests::fetch_mercurial_names_a_way_out206 PASS [ 0.026s] ( 187/1035) iets eval::tests::laziness_and_recursion207 PASS [ 0.029s] ( 188/1035) iets eval::tests::from_json_and_toml_reject_null_bytes208 PASS [ 0.021s] ( 189/1035) iets eval::tests::nix_eq_forces_what_the_shortcut_skips209 PASS [ 0.035s] ( 190/1035) iets eval::tests::fetchurl_needs_a_sha256_in_every_mode210 PASS [ 0.041s] ( 191/1035) iets eval::tests::fetchurl_checks_its_argument_like_nix211 PASS [ 0.042s] ( 192/1035) iets eval::tests::equality212 PASS [ 0.044s] ( 193/1035) iets eval::tests::attrs_and_lists213 PASS [ 0.026s] ( 194/1035) iets eval::tests::printing214 PASS [ 0.018s] ( 195/1035) iets eval::tests::update_forces_the_right_operand_first215 PASS [ 0.029s] ( 196/1035) iets eval::tests::sets_compare_in_the_symbol_order_of_nix216 PASS [ 0.018s] ( 197/1035) iets fetch::http::tests::credentials_in_the_url_are_sent_and_never_printed217 PASS [ 0.031s] ( 198/1035) iets eval::tests::try_eval_and_errors218 PASS [ 0.023s] ( 199/1035) iets fetch::http::tests::credentials_stay_on_the_first_origin219 PASS [ 0.039s] ( 200/1035) iets eval::tests::reading_a_derivation_output_is_unsupported220 PASS [ 0.010s] ( 201/1035) iets fetch::http::tests::file_urls_name_a_local_path221 PASS [ 0.010s] ( 202/1035) iets fetch::http::tests::magic_bytes222 PASS [ 0.006s] ( 203/1035) iets fetch::http::tests::redirects_keep_credentials_only_on_the_same_origin223 PASS [ 0.044s] ( 204/1035) iets eval::tests::scoping224 PASS [ 0.007s] ( 205/1035) iets fetch::http::tests::redirects_resolve225 PASS [ 0.009s] ( 206/1035) iets fetch::http::tests::trailing_bytes_and_a_second_layer226 PASS [ 0.010s] ( 207/1035) iets fetch::http::tests::urls_split227 PASS [ 0.010s] ( 208/1035) iets fetch::roots::tests::a_named_file_that_is_missing_or_empty_is_an_error228 PASS [ 0.007s] ( 209/1035) iets fetch::roots::tests::no_bundle_anywhere_gives_the_compiled_in_set229 PASS [ 0.010s] ( 210/1035) iets fetch::roots::tests::nix_ssl_cert_file_wins_over_ssl_cert_file_and_the_platform230 PASS [ 0.011s] ( 211/1035) iets fetch::roots::tests::the_platform_store_wins_over_the_compiled_in_set231 PASS [ 0.014s] ( 212/1035) iets fetch::roots::tests::an_empty_nix_ssl_cert_file_hides_ssl_cert_file232 PASS [ 0.007s] ( 213/1035) iets fetch::spool::tests::a_sparse_member_counts_against_the_size_limit233 PASS [ 0.150s] ( 214/1035) iets compile::cache::tests::a_changed_byte_of_a_stored_entry_is_a_miss234 PASS [ 0.009s] ( 215/1035) iets fetch::spool::tests::an_empty_archive_is_an_empty_directory235 PASS [ 0.015s] ( 216/1035) iets fetch::spool::tests::a_changed_index_byte_is_a_miss236 PASS [ 0.014s] ( 217/1035) iets fetch::spool::tests::a_stored_tree_dumps_the_spools_nar237 PASS [ 0.020s] ( 218/1035) iets fetch::spool::tests::a_hard_link_never_replaces_a_member238 PASS [ 0.014s] ( 219/1035) iets fetch::spool::tests::nar_hash_of_the_fixture239 PASS [ 0.014s] ( 220/1035) iets fetch::spool::tests::pax_sparse_members_are_expanded240 PASS [ 0.016s] ( 221/1035) iets fetch::spool::tests::archives_the_git_sink_accepts241 PASS [ 0.008s] ( 222/1035) iets fetch::spool::tests::the_scratch_file_never_follows_a_symlink242 PASS [ 0.014s] ( 223/1035) iets fetch::spool::tests::spool_matches_the_tree243 PASS [ 0.013s] ( 224/1035) iets fetch::spool::tests::the_errors_match244 PASS [ 0.015s] ( 225/1035) iets fetch::spool::tests::spool_matches_the_tree_on_the_top_level245 PASS [ 0.008s] ( 226/1035) iets fetch::unpack::tests::an_unsupported_member_type_is_an_error246 PASS [ 0.006s] ( 227/1035) iets fetch::unpack::tests::member_names_are_made_relative_and_cannot_escape247 PASS [ 0.012s] ( 228/1035) iets fetch::unpack::tests::a_repeated_member_keeps_the_last_copy248 PASS [ 0.014s] ( 229/1035) iets fetch::unpack::tests::keeps_the_root_when_it_is_not_a_single_directory249 PASS [ 0.008s] ( 230/1035) iets fetch::unpack::tests::modes_symlinks_and_empty_dirs250 PASS [ 0.011s] ( 231/1035) iets fetch::unpack::tests::nar_hash_of_the_fixture251 PASS [ 0.010s] ( 232/1035) iets fetch::unpack::tests::strips_one_leading_component252 PASS [ 0.009s] ( 233/1035) iets flake::flakeref::tests::git_urls_are_fixed_like_nix253 PASS [ 0.107s] ( 234/1035) iets eval::tests::pure_eval_answers_like_nix254 PASS [ 0.013s] ( 235/1035) iets flake::flakeref::tests::errors_and_unsupported255 PASS [ 0.007s] ( 236/1035) iets flake::flakeref::tests::round_trips256 PASS [ 0.010s] ( 237/1035) iets flake::flakeref::tests::refuses_a_github_ref_named_twice257 PASS [ 0.006s] ( 238/1035) iets flake::tests::attr_paths258 PASS [ 0.014s] ( 239/1035) iets flake::flakeref::tests::parses_the_kept_schemes259 PASS [ 0.007s] ( 240/1035) iets flake::flakeref::tests::to_string_from_attrs260 PASS [ 0.008s] ( 241/1035) iets jobs::constituents::tests::topo_sort_orders_and_detects_cycles261 PASS [ 0.009s] ( 242/1035) iets jobs::constituents::tests::fnmatch_basics262 PASS [ 0.012s] ( 243/1035) iets flake::tests::refs_resolve_against_cwd_and_home263 PASS [ 0.009s] ( 244/1035) iets jobs::line::tests::stats_survive_the_collector264 PASS [ 0.010s] ( 245/1035) iets jobs::line::tests::error_line_round_trip265 PASS [ 0.015s] ( 246/1035) iets flake::tests::a_pinned_checkout_is_its_revision266 PASS [ 0.014s] ( 247/1035) iets jobs::line::tests::split_and_round_trip267 PASS [ 0.008s] ( 248/1035) iets lint::allow::tests::comment_names268 PASS [ 0.016s] ( 249/1035) iets jobs::tests::a_numeric_name_selects_an_attribute_under_a_set269 PASS [ 0.013s] ( 250/1035) iets lint::allow::tests::lines270 PASS [ 0.016s] ( 251/1035) iets lint::cases::a_project_file_may_not_set_nix_bin_dir271 PASS [ 0.024s] ( 252/1035) iets lint::cases::a_family_selector_selects_its_members272 PASS [ 0.026s] ( 253/1035) iets lint::cases::a_later_flag_wins_over_all_and_a_name_beats_a_later_all273 PASS [ 0.027s] ( 254/1035) iets lint::cases::an_unknown_name_in_iets_toml_is_a_warning_and_the_rest_counts274 PASS [ 0.029s] ( 255/1035) iets lint::cases::an_unknown_name_in_iets_lint_is_a_warning_and_the_rest_counts275 PASS [ 0.029s] ( 256/1035) iets lint::cases::one_warning_per_site276 PASS [ 0.038s] ( 257/1035) iets lint::cases::scope_attributes_a_derivation_to_the_users_binding277 PASS [ 0.030s] ( 258/1035) iets lint::cases::try_eval_does_not_catch_a_lint_error278 PASS [ 0.032s] ( 259/1035) iets lint::cases::the_user_iets_toml_sets_a_level_and_the_project_file_wins_over_it279 PASS [ 0.040s] ( 260/1035) iets lint::cases::the_project_iets_toml_sets_a_level_and_a_name_beats_its_family280 PASS [ 0.065s] ( 261/1035) iets lint::cases::iets_lint_sets_a_level_and_a_flag_beats_it281 PASS [ 0.033s] ( 262/1035) iets lint::cli_cases::a_finding_at_error_has_the_span_and_no_edit282 PASS [ 0.007s] ( 263/1035) iets lint::cli_cases::an_unknown_lint_name_in_a_flag_is_a_usage_error283 PASS [ 0.356s] ( 264/1035) iets builtins::text::regex::tests::long_inputs_do_not_recurse284 PASS [ 0.061s] ( 265/1035) iets lint::cases::scope_limits_a_lint_to_the_entry_directory_until_it_is_opened285 PASS [ 0.014s] ( 266/1035) iets lint::cli_cases::lint_list_shows_the_effective_levels_and_the_scope286 PASS [ 0.020s] ( 267/1035) iets lint::cli_cases::an_unknown_name_in_iets_lint_is_a_record287 PASS [ 0.179s] ( 268/1035) iets fetch::http::tests::downloads_stop_at_the_size_limit288 PASS [ 0.031s] ( 269/1035) iets lint::cli_cases::a_warning_is_replayed_on_a_cache_hit289 PASS [ 0.040s] ( 270/1035) iets lint::cli_cases::a_finding_record_has_the_span_and_the_edit_on_a_cache_hit_too290 PASS [ 0.104s] ( 271/1035) iets lint::cases::allow_comments_silence_the_lines_they_cover291 PASS [ 0.051s] ( 272/1035) iets lint::cli_cases::an_allow_comment_is_part_of_the_cache_key_and_a_hit_replays_nothing292 PASS [ 0.066s] ( 273/1035) iets lint::cli_cases::an_allow_table_travels_in_the_ir_cache_entry_and_a_load_stays_silent293 PASS [ 0.057s] ( 274/1035) iets lint::cli_cases::the_scope_is_part_of_the_cache_key294 PASS [ 0.046s] ( 275/1035) iets lint::flake_cases::a_copy_under_the_root_or_an_input_is_not_a_recopy295 PASS [ 0.047s] ( 276/1035) iets lint::flake_cases::a_directory_under_the_root_is_dir_copy_flake_not_path_copy296 PASS [ 0.049s] ( 277/1035) iets lint::flake_cases::a_tree_meta_finding_is_a_record_with_a_span_on_a_cache_hit_too297 PASS [ 0.008s] ( 278/1035) iets lint::site::tests::a_literal_lint_of_nix_has_an_edit298 PASS [ 0.016s] ( 279/1035) iets lint::site::tests::the_span_is_the_innermost_node_of_the_kind_of_the_lint299 PASS [ 0.012s] ( 280/1035) iets lint::tests::keys300 PASS [ 0.022s] ( 281/1035) iets lint::tests::an_unknown_name_is_a_warning_in_a_file_and_an_error_in_a_flag301 PASS [ 0.075s] ( 282/1035) iets lint::flake_cases::an_input_is_silent_until_the_scope_or_the_inputs_table_opens_it302 PASS [ 0.066s] ( 283/1035) iets lint::flake_cases::an_input_or_an_allowed_site_is_silent_and_the_scope_opens_the_input303 PASS [ 0.013s] ( 284/1035) iets lint::tests::names_are_unique_kebab_case304 PASS [ 0.015s] ( 285/1035) iets lint::tests::scope_and_inputs305 PASS [ 0.009s] ( 286/1035) iets lint::tests::selectors_and_order306 PASS [ 0.007s] ( 287/1035) iets lint::tests::the_project_file_walk_stops_at_the_project_root307 PASS [ 0.008s] ( 288/1035) iets lint::tests::specificity_inside_a_source_and_order_between_sources308 PASS [ 0.009s] ( 289/1035) iets log::tests::a_coloured_error_is_an_error_record309 PASS [ 0.008s] ( 290/1035) iets log::tests::a_forged_mismatch_is_dropped310 PASS [ 0.011s] ( 291/1035) iets log::tests::a_fixed_hash_has_the_shape_of_a_finding_with_an_edit311 PASS [ 0.008s] ( 292/1035) iets log::tests::a_half_line_waits_for_its_newline312 PASS [ 0.050s] ( 293/1035) iets lint::flake_cases::the_roots_metadata_in_a_derivation_is_reported_by_default313 PASS [ 0.020s] ( 294/1035) iets lint::tests::toml_table314 PASS [ 0.008s] ( 295/1035) iets log::tests::a_pause_takes_the_view_down_for_a_prompt315 PASS [ 0.010s] ( 296/1035) iets log::tests::a_mismatch_reason_keeps_both_hashes316 PASS [ 0.012s] ( 297/1035) iets log::tests::a_hash_mismatch_names_the_hash_it_got317 PASS [ 0.009s] ( 298/1035) iets log::tests::a_resize_redraws_the_region_once318 PASS [ 0.011s] ( 299/1035) iets log::tests::a_region_stays_under_the_output_that_scrolls_above_it319 PASS [ 0.080s] ( 300/1035) iets lint::flake_cases::the_level_of_tree_meta_comes_from_the_flag_the_env_and_the_user_file320 PASS [ 0.007s] ( 301/1035) iets log::tests::a_resolved_copy_reports_its_mismatch_as_a_line321 PASS [ 0.066s] ( 302/1035) iets lint::flake_cases::the_project_file_sets_tree_meta_per_tree322 PASS [ 0.006s] ( 303/1035) iets log::tests::ansi_stripping323 PASS [ 0.007s] ( 304/1035) iets log::tests::escapes_are_filtered_the_way_nix_filters_them324 PASS [ 0.006s] ( 305/1035) iets log::tests::exit_status_flags_combine_like_nix325 PASS [ 0.008s] ( 306/1035) iets log::tests::activity_records_are_nix_json_logger_records326 PASS [ 0.008s] ( 307/1035) iets log::tests::record_without_position327 PASS [ 0.013s] ( 308/1035) iets log::tests::a_session_id_is_a_uuid_v7328 PASS [ 0.006s] ( 309/1035) iets log::tests::text_shows_the_hint_of_an_unsupported_error329 PASS [ 0.012s] ( 310/1035) iets log::tests::lint_warning_is_a_level_1_record330 PASS [ 0.007s] ( 311/1035) iets log::tests::the_status_line_goes_under_the_region331 PASS [ 0.007s] ( 312/1035) iets log::tests::without_a_terminal_output_is_plain332 PASS [ 0.014s] ( 313/1035) iets log::tests::record_is_nix_log_ei_plus_code_and_hint333 PASS [ 0.014s] ( 314/1035) iets nixbin::tests::every_iets_build_is_skipped334 PASS [ 0.015s] ( 315/1035) iets parallel::deque::tests::lifo_owner_fifo_thief335 PASS [ 0.017s] ( 316/1035) iets nixbin::tests::farm_marker_is_found_through_two_hops336 PASS [ 0.016s] ( 317/1035) iets parallel::fiber::tests::reservation_is_capped_and_mmap_failure_is_an_error337 PASS [ 0.017s] ( 318/1035) iets parallel::fiber::tests::migrates_between_threads338 PASS [ 0.017s] ( 319/1035) iets parallel::fiber::tests::resume_yield_finish339 PASS [ 0.009s] ( 320/1035) iets parallel::interner::tests::empty_name_misses_the_cache_sentinel340 PASS [ 0.026s] ( 321/1035) iets parallel::fiber::tests::large_stack_use_and_release341 PASS [ 0.015s] ( 322/1035) iets parallel::sched::tests::a_task_survives_packing_past_the_old_24_bit_start342 PASS [ 0.021s] ( 323/1035) iets parallel::interner::tests::intern_is_stable_and_shared343 PASS [ 0.017s] ( 324/1035) iets parallel::sched::tests::park_and_wake_across_workers344 PASS [ 0.019s] ( 325/1035) iets parallel::sched::tests::fan_out_from_main345 PASS [ 0.023s] ( 326/1035) iets parallel::sched::tests::main_parks_and_is_woken_by_helper346 PASS [ 0.014s] ( 327/1035) iets print::tests::float_formatting_edge_cases347 PASS [ 0.058s] ( 328/1035) iets parallel::fiber::tests::a_freed_stack_frees_its_guard_entry348 PASS [ 0.012s] ( 329/1035) iets profile::tests::a_frame_keeps_its_call_site_and_its_name349 PASS [ 0.018s] ( 330/1035) iets profile::tests::a_sample_is_taken_once_per_tick350 PASS [ 0.014s] ( 331/1035) iets profile::tests::an_unwind_returns_to_a_depth351 PASS [ 0.045s] ( 332/1035) iets parallel::thunk::tests::deadlocked_fibers_are_cancelled352 PASS [ 0.020s] ( 333/1035) iets profile::tests::a_weight_is_bytes_when_the_profile_asks_for_them353 PASS [ 0.017s] ( 334/1035) iets progress::tests::a_log_hears_of_a_task_after_first_and_then_every_heartbeat354 PASS [ 0.018s] ( 335/1035) iets progress::tests::a_download_inside_a_copy_is_part_of_the_copy355 PASS [ 0.017s] ( 336/1035) iets progress::tests::several_of_a_kind_are_counted356 PASS [ 0.019s] ( 337/1035) iets progress::tests::a_transfer_that_does_not_move_says_so357 PASS [ 0.009s] ( 338/1035) iets progress::tests::store_hashes_are_left_out358 PASS [ 0.012s] ( 339/1035) iets project::tests::a_config_file_never_shrinks_the_root359 PASS [ 0.096s] ( 340/1035) iets parallel::interner::tests::concurrent_intern_agrees360 PASS [ 0.016s] ( 341/1035) iets project::tests::each_marker_is_a_root361 PASS [ 0.018s] ( 342/1035) iets project::tests::a_working_tree_wins_over_a_file_marker_below_it362 PASS [ 0.073s] ( 343/1035) iets profile::tests::a_deep_stack_is_capped363 PASS [ 0.015s] ( 344/1035) iets project::tests::the_nearest_flake_wins_without_a_working_tree364 PASS [ 0.013s] ( 345/1035) iets provenance::tests::a_path_followed_by_a_colour_escape_still_matches365 PASS [ 0.124s] ( 346/1035) iets parallel::deque::tests::concurrent_sum366 PASS [ 0.008s] ( 347/1035) iets provenance::tests::an_input_file_is_labelled_by_its_lock_node367 PASS [ 0.012s] ( 348/1035) iets provenance::tests::a_shared_position_is_left_off_the_started_line_only368 PASS [ 0.006s] ( 349/1035) iets provenance::tests::locate_takes_the_longest_prefix369 PASS [ 0.011s] ( 350/1035) iets provenance::tests::a_tree_copied_from_a_store_tree_resolves_to_the_local_one370 PASS [ 0.006s] ( 351/1035) iets provenance::tests::rewrite_replaces_every_known_path_in_a_line371 PASS [ 0.008s] ( 352/1035) iets provenance::tests::rewrite_leaves_unknown_text_alone372 PASS [ 0.008s] ( 353/1035) iets provenance::tests::locate_without_a_match_is_none373 PASS [ 0.007s] ( 354/1035) iets remote::grpc::backend::tests::a_cold_store_is_asked_the_rest_in_one_call374 PASS [ 0.010s] ( 355/1035) iets remote::grpc::backend::tests::a_built_root_asks_nothing_below_it375 PASS [ 0.016s] ( 356/1035) iets provenance::tests::failed_line_names_the_attribute_and_the_position376 PASS [ 0.007s] ( 357/1035) iets remote::grpc::build::tests::a_self_reference_does_not_loop377 PASS [ 0.016s] ( 358/1035) iets remote::grpc::backend::tests::a_built_input_stops_the_walk378 PASS [ 0.006s] ( 359/1035) iets remote::grpc::build::tests::required_features_come_from_the_env_or_structured_attrs379 PASS [ 0.011s] ( 360/1035) iets remote::grpc::build::tests::a_local_upload_failure_beats_the_stream_ended_status380 PASS [ 0.011s] ( 361/1035) iets remote::grpc::build::tests::the_timings_report_with_every_line381 PASS [ 0.007s] ( 362/1035) iets remote::grpc::drvwire::tests::a_failure_keeps_its_message382 PASS [ 0.018s] ( 363/1035) iets remote::grpc::backend::tests::an_input_below_a_built_one_is_not_built383 PASS [ 0.017s] ( 364/1035) iets remote::grpc::build::tests::reschedules_back_off_past_a_dead_worker384 PASS [ 0.012s] ( 365/1035) iets remote::grpc::drvwire::tests::an_unresolvable_input_output_is_an_error385 PASS [ 0.014s] ( 366/1035) iets remote::grpc::build::tests::topo_sort_puts_references_first386 PASS [ 0.011s] ( 367/1035) iets remote::grpc::drvwire::tests::basic_derivation_matches_the_cxx_field_order387 PASS [ 0.006s] ( 368/1035) iets remote::grpc::health::tests::a_completed_build_clears_the_history388 PASS [ 0.012s] ( 369/1035) iets remote::grpc::drvwire::tests::path_info_round_trips389 PASS [ 0.005s] ( 370/1035) iets remote::grpc::health::tests::the_cooldown_grows_and_stops_at_30s390 PASS [ 0.007s] ( 371/1035) iets remote::grpc::health::tests::one_bounce_does_not_refuse_an_address391 PASS [ 0.017s] ( 372/1035) iets remote::grpc::drvwire::tests::build_result_round_trips_a_daemon_reply392 PASS [ 0.012s] ( 373/1035) iets remote::grpc::health::tests::one_address_does_not_refuse_another393 PASS [ 0.006s] ( 374/1035) iets remote::grpc::tests::defaults_match_the_cxx_settings394 PASS [ 0.006s] ( 375/1035) iets remote::grpc::tests::a_token_needs_tls_and_unknown_parameters_are_errors395 PASS [ 0.015s] ( 376/1035) iets remote::grpc::health::tests::an_unknown_address_is_usable396 PASS [ 0.016s] ( 377/1035) iets remote::grpc::health::tests::a_passed_cooldown_lets_one_caller_through397 PASS [ 0.010s] ( 378/1035) iets remote::grpc::health::tests::two_bounces_refuse_it398 PASS [ 0.006s] ( 379/1035) iets remote::grpc::tests::mtls_needs_both_halves399 PASS [ 0.007s] ( 380/1035) iets remote::grpc::tests::percent_escapes_decode_in_values400 PASS [ 0.009s] ( 381/1035) iets remote::grpc::tests::insecure_is_a_bare_flag_or_a_boolean401 PASS [ 0.009s] ( 382/1035) iets remote::grpc::tests::every_parameter_parses402 PASS [ 0.007s] ( 383/1035) iets remote::plan::tests::a_held_input_answers_for_its_closure403 PASS [ 0.007s] ( 384/1035) iets remote::plan::tests::a_held_root_answers_for_its_closure404 PASS [ 0.010s] ( 385/1035) iets remote::plan::tests::a_cold_store_is_asked_the_rest_in_one_call405 PASS [ 0.006s] ( 386/1035) iets remote::worker::counts_tests::a_repeated_update_claims_nothing406 PASS [ 0.007s] ( 387/1035) iets remote::plan::tests::hash_source_matches_nar_hash407 PASS [ 0.009s] ( 388/1035) iets remote::plan::tests::an_answered_root_is_not_asked_again408 PASS [ 0.007s] ( 389/1035) iets remote::worker::tests::a_status_over_a_byte_is_not_a_success409 PASS [ 0.008s] ( 390/1035) iets remote::worker::counts_tests::each_change_is_a_verdict_in_order410 PASS [ 0.011s] ( 391/1035) iets remote::plan::tests::memory_source_matches_dump_string411 PASS [ 0.013s] ( 392/1035) iets remote::worker::tests::transport_from_url412 PASS [ 0.014s] ( 393/1035) iets remote::worker::tests::ssh_argv_puts_the_host_first413 PASS [ 0.015s] ( 394/1035) iets remote::worker::tests::nix_sshopts_split_like_a_shell414 PASS [ 0.018s] ( 395/1035) iets remote::worker::tests::an_ssh_host_is_never_an_option415 PASS [ 0.024s] ( 396/1035) iets remote::worker::wire::tests::build_results_are_read_as_nix_reads_them416 PASS [ 0.012s] ( 397/1035) iets runtime::value::alloc_tests::a_list_too_long_to_address_has_no_size417 PASS [ 0.023s] ( 398/1035) iets remote::worker::wire::tests::replies_are_read_as_nix_reads_them418 PASS [ 0.024s] ( 399/1035) iets remote::worker::wire::tests::framed_sink_frames_and_terminates419 PASS [ 0.014s] ( 400/1035) iets runtime::heap::tests::release_tombstones_every_chunk420 PASS [ 0.014s] ( 401/1035) iets remote::worker::wire::tests::strings_are_padded421 PASS [ 0.007s] ( 402/1035) iets runtime::value::layout::a_primop_pays_nothing_for_its_symbol422 PASS [ 0.007s] ( 403/1035) iets runtime::value::alloc_tests::a_static_slice_is_interned_without_a_copy423 PASS [ 0.008s] ( 404/1035) iets runtime::value::tests::union_lookup_agrees_with_iteration424 PASS [ 0.012s] ( 405/1035) iets runtime::value::alloc_tests::a_speculated_thunk_is_forced_but_not_demanded425 PASS [ 0.019s] ( 406/1035) iets settings::tests::a_flag_carries_several_places_separated_by_a_semicolon426 PASS [ 0.020s] ( 407/1035) iets session::tests::two_sessions_share_no_state427 PASS [ 0.040s] ( 408/1035) iets session::tests::a_parallel_run_releases_its_session428 PASS [ 0.011s] ( 409/1035) iets settings::tests::a_missing_file_is_skipped_and_the_defaults_hold429 PASS [ 0.007s] ( 410/1035) iets settings::tests::a_project_file_holds_lint_and_nothing_else430 PASS [ 0.032s] ( 411/1035) iets session::tests::a_value_used_after_release_is_loud431 PASS [ 0.011s] ( 412/1035) iets settings::tests::a_settings_file_may_hold_lint_and_the_other_sources_may_not432 PASS [ 0.009s] ( 413/1035) iets settings::tests::a_wrong_type_names_the_key_and_the_file433 PASS [ 0.009s] ( 414/1035) iets settings::tests::builder_reads_all_three_forms434 PASS [ 0.015s] ( 415/1035) iets settings::tests::each_source_wins_over_the_one_before435 PASS [ 0.010s] ( 416/1035) iets settings::tests::source_map_adds_up_and_every_other_key_replaces436 PASS [ 0.015s] ( 417/1035) iets settings::tests::the_file_is_the_users437 PASS [ 0.018s] ( 418/1035) iets settings::tests::the_environment_wins_over_the_file438 PASS [ 0.010s] ( 419/1035) iets settings::tests::the_flag_leaves_the_argv439 PASS [ 0.065s] ( 420/1035) iets session::tests::a_released_session_leaves_the_other_alone440 PASS [ 0.013s] ( 421/1035) iets settings::tests::the_flag_pairs_are_kept_for_a_second_iets441 PASS [ 0.008s] ( 422/1035) iets settings::tests::the_flag_value_is_toml_when_it_reads_as_toml442 PASS [ 0.010s] ( 423/1035) iets settings::tests::unknown_key_names_the_file443 PASS [ 0.008s] ( 424/1035) iets source::local::tests::accepted_set_adds_parent_directories444 PASS [ 0.007s] ( 425/1035) iets source::local::tests::max_mtime_covers_root_and_children445 PASS [ 0.007s] ( 426/1035) iets source::lock::tests::complete_lock_passes446 PASS [ 0.008s] ( 427/1035) iets source::lock::tests::declared_inputs_must_match_the_lock447 PASS [ 0.021s] ( 428/1035) iets settings::tests::the_user_file_turns_purity_off448 PASS [ 0.015s] ( 429/1035) iets source::local::tests::only_a_content_addressed_store_path_names_its_content449 PASS [ 0.014s] ( 430/1035) iets source::lock::tests::empty_lock_has_no_inputs450 PASS [ 0.007s] ( 431/1035) iets source::remote::tests::download_urls_match_the_fetchers451 PASS [ 0.010s] ( 432/1035) iets source::remote::tests::access_tokens_match_the_longest_prefix452 PASS [ 0.014s] ( 433/1035) iets source::lock::tests::incomplete_locks_fail453 PASS [ 0.014s] ( 434/1035) iets source::remote::tests::a_leftover_is_not_a_valid_path454 PASS [ 0.008s] ( 435/1035) iets source::remote::tests::nix_literal_escapes455 PASS [ 0.007s] ( 436/1035) iets source::scm::git::tests::a_directory_in_a_repository_is_found456 PASS [ 0.008s] ( 437/1035) iets source::scm::ledger::tests::a_directory_in_a_working_tree_is_found457 PASS [ 0.015s] ( 438/1035) iets source::remote::tests::only_the_archive_types_are_fetched_by_iets458 PASS [ 0.017s] ( 439/1035) iets source::scm::ledger::tests::a_change_of_the_ledger_is_a_change_of_the_working_tree459 PASS [ 0.014s] ( 440/1035) iets source::scm::ledger::tests::an_untracked_file_is_the_error_of_nix460 PASS [ 0.020s] ( 441/1035) iets source::scm::ledger::tests::a_name_resolves_to_a_revision_and_a_revision_has_a_tree461 PASS [ 0.021s] ( 442/1035) iets source::scm::ledger::tests::the_count_is_lazy_and_kept_by_revision462 PASS [ 0.025s] ( 443/1035) iets source::scm::ledger::tests::the_metadata_has_the_mark_of_its_tree463 PASS [ 0.016s] ( 444/1035) iets store::drv::tests::a_dynamic_input_writes_the_versioned_aterm_and_parses_back464 PASS [ 0.023s] ( 445/1035) iets source::scm::ledger::tests::the_tracked_files_and_the_metadata_are_the_tree465 PASS [ 0.021s] ( 446/1035) iets source::tests::dates466 PASS [ 0.014s] ( 447/1035) iets store::drv::tests::an_env_key_named_json_is_refused467 PASS [ 0.008s] ( 448/1035) iets store::drv::tests::input_addressed_multi_output_from_scratch468 PASS [ 0.017s] ( 449/1035) iets store::drv::tests::fixed_output_from_scratch469 PASS [ 0.024s] ( 450/1035) iets store::drv::tests::fixtures_drv_path_matches_store_path470 PASS [ 0.020s] ( 451/1035) iets store::drv::tests::fixtures_roundtrip_byte_exact471 PASS [ 0.021s] ( 452/1035) iets store::drv::tests::fixtures_output_paths_recompute472 PASS [ 0.011s] ( 453/1035) iets store::drv::tests::input_drvs_hash_modulo_from_scratch473 PASS [ 0.008s] ( 454/1035) iets store::drvdiff::tests::a_changed_input_drv_is_paired_by_name_and_recursed_into474 PASS [ 0.007s] ( 455/1035) iets store::drvdiff::tests::env_name_shows_only_when_it_is_not_the_derivation_name475 PASS [ 0.017s] ( 456/1035) iets store::drv::tests::masked_unparse_blanks_output_paths_and_env476 PASS [ 0.018s] ( 457/1035) iets store::drvdiff::tests::an_input_source_an_added_input_drv_and_a_fixed_output_show_up477 PASS [ 0.019s] ( 458/1035) iets store::drv::tests::string_escapes_roundtrip478 PASS [ 0.012s] ( 459/1035) iets store::drvdiff::tests::json_names_what_differs479 PASS [ 0.013s] ( 460/1035) iets store::drvdiff::tests::the_local_fields_the_env_and_an_absent_value480 PASS [ 0.016s] ( 461/1035) iets store::drvdiff::tests::the_depth_limit_names_the_input_without_walking_it481 PASS [ 0.012s] ( 462/1035) iets store::hash::tests::base64_roundtrip482 PASS [ 0.011s] ( 463/1035) iets store::hash::tests::compress_hash_xors483 PASS [ 0.014s] ( 464/1035) iets store::hash::tests::empty_sha256484 PASS [ 0.020s] ( 465/1035) iets store::drvdiff::tests::the_same_derivation_is_empty485 PASS [ 0.009s] ( 466/1035) iets store::hash::tests::nix32_roundtrip_and_reject486 PASS [ 0.016s] ( 467/1035) iets store::hash::tests::md5_nix32487 PASS [ 0.012s] ( 468/1035) iets store::hash::tests::parse_any_all_formats488 PASS [ 0.007s] ( 469/1035) iets store::hash::tests::sha1_nix32489 PASS [ 0.007s] ( 470/1035) iets store::hash::tests::sha512_nix32_base64490 PASS [ 0.011s] ( 471/1035) iets store::hash::tests::sha256_nix32491 PASS [ 0.007s] ( 472/1035) iets store::hash::tests::streaming_matches_oneshot492 PASS [ 0.009s] ( 473/1035) iets store::hash::tests::sha256_sri493 PASS [ 0.009s] ( 474/1035) iets store::nar::tests::directory_nar494 PASS [ 0.012s] ( 475/1035) iets store::nar::tests::directory_nar_hash_formats495 PASS [ 0.011s] ( 476/1035) iets store::nar::tests::readers_refuse_what_nix_refuses496 PASS [ 0.011s] ( 477/1035) iets store::nar::tests::restore_rejects_garbage497 PASS [ 0.026s] ( 478/1035) iets store::nar::tests::directory_nar_with_an_executable498 PASS [ 0.015s] ( 479/1035) iets store::nar::tests::regular_file_nar499 PASS [ 0.029s] ( 480/1035) iets store::nar::tests::filter_sees_types_and_paths500 PASS [ 0.033s] ( 481/1035) iets store::nar::tests::executable_file_nar501 PASS [ 0.009s] ( 482/1035) iets store::nar::tests::symlink_nar502 PASS [ 0.012s] ( 483/1035) iets store::nar::tests::restore_roundtrip503 PASS [ 0.013s] ( 484/1035) iets store::nar::tests::script_nar504 PASS [ 0.012s] ( 485/1035) iets store::path::tests::a_multibyte_char_across_the_hash_part_is_an_error505 PASS [ 0.007s] ( 486/1035) iets store::path::tests::check_name_rules506 PASS [ 0.010s] ( 487/1035) iets store::path::tests::an_override_is_absolute_and_has_no_trailing_separator507 PASS [ 0.008s] ( 488/1035) iets store::path::tests::filter_source508 PASS [ 0.008s] ( 489/1035) iets store::path::tests::fixed_flat_sha1509 PASS [ 0.008s] ( 490/1035) iets store::path::tests::fixed_flat_sha256510 PASS [ 0.006s] ( 491/1035) iets store::path::tests::output_names511 PASS [ 0.009s] ( 492/1035) iets store::path::tests::fixed_recursive_sha256512 PASS [ 0.780s] ( 493/1035) iets fetch::http::tests::a_transient_status_is_retried513 PASS [ 0.012s] ( 494/1035) iets store::path::tests::parse_and_accessors514 PASS [ 0.012s] ( 495/1035) iets store::path::tests::path_with_name515 PASS [ 0.016s] ( 496/1035) iets store::path::tests::path_copy_file516 PASS [ 0.019s] ( 497/1035) iets store::path::tests::path_copy_directory517 PASS [ 0.011s] ( 498/1035) iets store::path::tests::the_host_picks_the_store_directory518 PASS [ 0.024s] ( 499/1035) iets store::path::tests::placeholder519 PASS [ 0.024s] ( 500/1035) iets store::path::tests::the_directory_is_found_as_a_string_and_as_a_path520 PASS [ 0.016s] ( 501/1035) iets store::path::tests::to_file_with_reference521 PASS [ 0.017s] ( 502/1035) iets syntax::tests::a_line_ends_at_cr_lf_and_lone_cr522 PASS [ 0.021s] ( 503/1035) iets store::path::tests::to_file523 PASS [ 0.015s] ( 504/1035) iets syntax::tests::allow_comments524 PASS [ 0.023s] ( 505/1035) iets syntax::tests::an_interpolated_name_is_static_when_nix_has_one_string_node525 PASS [ 0.024s] ( 506/1035) iets syntax::tests::attrs_and_bindings526 PASS [ 0.023s] ( 507/1035) iets syntax::tests::comments_and_misc527 PASS [ 0.026s] ( 508/1035) iets syntax::tests::end_of_file_inside_a_path_is_at_its_last_token528 PASS [ 0.029s] ( 509/1035) iets syntax::tests::indented_string_stripping529 PASS [ 0.020s] ( 510/1035) iets syntax::tests::json_gives_every_node_its_kind_and_span530 PASS [ 0.015s] ( 511/1035) iets syntax::tests::lambdas531 PASS [ 0.010s] ( 512/1035) iets syntax::tests::line_col_counts_bytes532 PASS [ 0.019s] ( 513/1035) iets syntax::tests::nul_in_string_literals533 PASS [ 0.017s] ( 514/1035) iets syntax::tests::paths534 PASS [ 0.024s] ( 515/1035) iets syntax::tests::numbers535 PASS [ 0.025s] ( 516/1035) iets syntax::tests::operator_precedence536 PASS [ 0.526s] ( 517/1035) iets parallel::thunk::tests::many_fibers_force_one_shared_graph537 PASS [ 0.013s] ( 518/1035) iets syntax::tests::spans_cover_tokens538 PASS [ 0.010s] ( 519/1035) iets sys::winpath::tests::a_leading_double_slash_is_not_a_share539 PASS [ 0.015s] ( 520/1035) iets sys::winpath::tests::a_bare_drive_is_not_its_root540 PASS [ 0.016s] ( 521/1035) iets syntax::tests::the_error_reported_is_the_one_nix_meets_first541 PASS [ 0.022s] ( 522/1035) iets syntax::tests::string_escapes_and_interpolation542 PASS [ 0.015s] ( 523/1035) iets sys::winpath::tests::a_drive_is_the_first_component543 PASS [ 0.007s] ( 524/1035) iets sys::winpath::tests::device_paths_are_not_shares_and_survive_a_round_trip544 PASS [ 0.009s] ( 525/1035) iets sys::winpath::tests::a_relative_name_that_starts_with_unc_is_not_a_share545 PASS [ 0.899s] ( 526/1035) iets fetch::http::tests::a_decompression_bomb_is_refused546 PASS [ 0.010s] ( 527/1035) iets sys::winpath::tests::forward_slashes_make_a_share_too547 PASS [ 0.014s] ( 528/1035) iets sys::winpath::tests::a_round_trip_is_stable548 PASS [ 0.014s] ( 529/1035) iets sys::winpath::tests::dot_dot_stops_at_the_anchor549 PASS [ 0.012s] ( 530/1035) iets sys::winpath::tests::native_names_come_back550 PASS [ 0.014s] ( 531/1035) iets sys::winpath::tests::mixed_separators_agree551 PASS [ 0.008s] ( 532/1035) iets sys::winpath::tests::the_evaluators_form_is_left_alone552 PASS [ 0.011s] ( 533/1035) iets sys::winpath::tests::relative_and_rooted_paths_only_change_separator553 PASS [ 0.016s] ( 534/1035) iets sys::winpath::tests::network_shares_sit_under_unc554 PASS [ 0.723s] ( 535/1035) iets lint::flake_cases::a_pre_existing_store_path_is_still_a_recopy555 PASS [ 0.010s] ( 536/1035) iets trace::key::tests::relative_path_detection556 PASS [ 0.015s] ( 537/1035) iets trace::key::tests::key_is_order_and_value_sensitive557 PASS [ 0.008s] ( 538/1035) iets trace::store::tests::one_rename_publishes_every_part558 PASS [ 0.009s] ( 539/1035) iets trace::tests::dedupe_keeps_conflicting_values559 PASS [ 0.012s] ( 540/1035) iets trace::store::tests::a_reader_of_one_generation_never_sees_the_next560 PASS [ 0.012s] ( 541/1035) iets trace::store::tests::bytes_that_are_not_an_entry_are_bad_not_a_panic561 PASS [ 0.009s] ( 542/1035) iets trace::tests::dump_fingerprint_matches_the_separate_walk562 PASS [ 0.012s] ( 543/1035) iets trace::validate::dir_hash_tests::dir_hash_agrees_with_dir_listing_hash563 PASS [ 0.019s] ( 544/1035) iets trace::tests::only_a_named_query_is_an_observation564 PASS [ 0.021s] ( 545/1035) iets trace::tests::fingerprint_changes_with_content_size_and_seen_entries565 PASS [ 0.022s] ( 546/1035) iets trace::validate::tests::a_resolved_path_validates_as_the_same566 PASS [ 0.034s] ( 547/1035) iets trace::validate::tests::dir_stat_env_checks567 PASS [ 0.021s] ( 548/1035) iets trace::watch::tests::only_the_paths_an_mtime_can_speak_for568 PASS [ 0.009s] ( 549/1035) iets trace::wire::tests::readset_roundtrip569 PASS [ 0.137s] ( 550/1035) iets syntax::tests::lang_corpus570 PASS [ 0.016s] ( 551/1035) iets trace::wire::tests::drvs_sources_roots_roundtrip571 PASS [ 0.054s] ( 552/1035) iets trace::validate::tests::the_lowest_failing_observation_is_the_one_reported572 PASS [ 0.076s] ( 553/1035) iets trace::validate::tests::a_copy_in_place_that_keeps_the_stat_still_misses573 PASS [ 0.014s] ( 554/1035) iets treestore::pack::tests::an_empty_writer_leaves_no_file574 PASS [ 1.021s] ( 555/1035) iets fetch::http::tests::a_stalled_download_fails575 PASS [ 0.107s] ( 556/1035) iets trace::validate::tests::what_a_native_path_records_validates576 PASS [ 0.121s] ( 557/1035) iets trace::validate::tests::file_touch_refreshes_edit_misses577 PASS [ 0.052s] ( 558/1035) iets treestore::tests::a_staged_directory_goes_when_it_is_dropped578 PASS [ 0.211s] ( 559/1035) iets treestore::pack::tests::a_pack_reads_back_what_was_written579 PASS [ 0.210s] ( 560/1035) iets treestore::pack::tests::a_reader_sees_a_pack_written_after_it_listed580 PASS [ 0.280s] ( 561/1035) iets trace::tests::dedupe_of_many_repeats_is_linear581 PASS [ 0.012s] ( 562/1035) iets treestore::tests::a_tree_is_named_by_its_nar_hash582 PASS [ 0.011s] ( 563/1035) iets::aterm_crosscheck bytes_that_are_not_utf8_roundtrip583 PASS [ 0.108s] ( 564/1035) iets treestore::tests::a_stored_input_reads_back_and_a_wrong_hash_is_refused584 PASS [ 0.191s] ( 565/1035) iets treestore::tests::a_flat_file_is_named_by_the_hash_of_its_bytes585 PASS [ 0.222s] ( 566/1035) iets treestore::pack::tests::a_set_finds_objects_across_packs_and_drops_a_broken_one586 PASS [ 0.006s] ( 567/1035) iets::aterm_crosscheck fixed_output_inputs_hide_their_provenance587 PASS [ 0.006s] ( 568/1035) iets::aterm_crosscheck floating_ca_defers_itself_and_downstream588 PASS [ 0.174s] ( 569/1035) iets treestore::tests::a_put_after_a_collection_brings_its_own_objects589 PASS [ 0.209s] ( 570/1035) iets treestore::pack::tests::collect_removes_dead_packs_and_compacts_mostly_dead_ones590 PASS [ 0.007s] ( 571/1035) iets::aterm_crosscheck harmonia_cases_roundtrip591 PASS [ 0.035s] ( 572/1035) iets treestore::tests::collect_keeps_what_an_entry_names592 PASS [ 0.009s] ( 573/1035) iets::aterm_crosscheck fixed_output_path_is_recomputed_not_trusted593 PASS [ 0.026s] ( 574/1035) iets treestore::tests::two_inputs_share_their_common_files594 PASS [ 0.008s] ( 575/1035) iets::aterm_crosscheck malformed_aterm_is_an_error595 PASS [ 0.008s] ( 576/1035) iets::aterm_crosscheck upstream_bad_drvs_are_rejected596 PASS [ 0.008s] ( 577/1035) iets::aterm_crosscheck masked_and_unmasked_hashes_differ_once_filled597 PASS [ 0.008s] ( 578/1035) iets::aterm_crosscheck upstream_bench_drvs_parse_and_reprint_stably598 PASS [ 0.006s] ( 579/1035) iets::aterm_crosscheck upstream_invariants_input_addressed_kept_or_rejected599 PASS [ 0.009s] ( 580/1035) iets::aterm_crosscheck upstream_input_addressed_paths_recompute600 PASS [ 0.010s] ( 581/1035) iets::aterm_crosscheck upstream_invariants_fill_in_deferred601 PASS [ 0.010s] ( 582/1035) iets::cache_hygiene an_entry_that_is_not_a_plain_file_is_refused602 PASS [ 0.016s] ( 583/1035) iets::aterm_crosscheck upstream_invariants_ca_floating_dependency603 PASS [ 0.016s] ( 584/1035) iets::cache_hygiene an_input_observation_marks_its_entry_as_used604 PASS [ 0.024s] ( 585/1035) iets::aterm_crosscheck upstream_drvs_roundtrip_byte_exact605 PASS [ 0.008s] ( 586/1035) iets::cache_hygiene input_touch_child606 PASS [ 0.008s] ( 587/1035) iets::cache_hygiene unix_only::a_cache_is_private_to_its_owner607 PASS [ 0.021s] ( 588/1035) iets::cache_hygiene a_corrupt_entry_is_dropped_and_a_corrupt_store_is_wiped608 PASS [ 0.006s] ( 589/1035) iets::cache_hygiene unix_only::a_link_or_a_fifo_is_not_an_entry609 PASS [ 0.029s] ( 590/1035) iets::cache_hygiene a_changed_byte_or_a_copied_entry_is_a_miss610 PASS [ 0.041s] ( 591/1035) iets::cache_hygiene cache_gc_removes_entries_past_the_ttl611 PASS [ 1.107s] ( 592/1035) iets lint::fixtures::every_lint_fires_on_its_fixture_only_when_asked612 PASS [ 0.774s] ( 593/1035) iets runtime::value::tests::union_iteration_merges_like_a_fold613 PASS [ 0.049s] ( 594/1035) iets::cache_semantics a_lint_warning_is_replayed_on_a_hit614 PASS [ 0.053s] ( 595/1035) iets::cache_semantics a_copy_in_place_misses615 PASS [ 0.053s] ( 596/1035) iets::cache_semantics a_hit_prints_paths_and_positions_the_same616 PASS [ 0.368s] ( 597/1035) iets treestore::pack::tests::a_changed_index_byte_is_not_a_pack617 PASS [ 0.063s] ( 598/1035) iets::cache_semantics the_cache_dir_keeps_what_it_did_not_make618 PASS [ 0.105s] ( 599/1035) iets::cache_semantics a_pure_run_never_reads_an_impure_entry619 PASS [ 0.089s] ( 600/1035) iets::cache_semantics the_file_argument_keeps_one_entry620 PASS [ 0.159s] ( 601/1035) iets::cache_semantics a_flake_keeps_one_entry621 PASS [ 0.118s] ( 602/1035) iets::cache_semantics uncacheable_runs_write_nothing622 PASS [ 0.133s] ( 603/1035) iets::cache_semantics search_uses_the_cache623 PASS [ 0.204s] ( 604/1035) iets::cache_semantics flags_that_turn_the_cache_off624 PASS [ 0.263s] ( 605/1035) iets::cache_hygiene concurrent_readers_and_writers_never_see_a_torn_entry625 PASS [ 0.095s] ( 606/1035) iets::classic_eval eval_jobs_summary626 PASS [ 0.376s] ( 607/1035) iets::classic_build dry_run_and_json_log_path627 PASS [ 0.507s] ( 608/1035) iets::cache_semantics hits_and_misses628 PASS [ 0.402s] ( 609/1035) iets::classic_build the_builder_setting629 PASS [ 0.605s] ( 610/1035) iets::classic_build activity_records630 PASS [ 0.505s] ( 611/1035) iets::classic_build the_roots_a_build_keeps631 PASS [ 1.467s] ( 612/1035) iets runtime::value::alloc_tests::a_full_string_table_records_no_more_but_still_shares632 PASS [ 0.396s] ( 613/1035) iets::classic_eval internal_json_errors633 PASS [ 0.529s] ( 614/1035) iets::classic_eval ignored_flags_and_settings634 PASS [ 0.915s] ( 615/1035) iets::classic_eval auto_call_a_function_file635 PASS [ 1.184s] ( 616/1035) iets::classic_build failures636 PASS [ 0.621s] ( 617/1035) iets::classic_eval nix_search637 PASS [ 2.860s] ( 618/1035) iets api::run::tests::helper_fibers_read_the_ir_cache638 PASS [ 0.168s] ( 619/1035) iets::classic_fallback a_full_stdout639 PASS [ 0.400s] ( 620/1035) iets::classic_eval the_builtins_names640 FAIL [ 1.448s] ( 621/1035) iets::classic_build out_links_and_roots641 stdout ---642643 running 1 test644 test out_links_and_roots ... FAILED645646 failures:647648 failures:649 out_links_and_roots650651 test result: FAILED. 0 passed; 1 failed; 0 ignored; 0 measured; 6 filtered out; finished in 1.44s652 653 stderr ---654655 thread 'out_links_and_roots' (3969) panicked at tests/e2e/mod.rs:466:13:656 1 failed:657 nix print-dev-env is iets print-dev-env: error: flake 'path:/tmp/iets-e2e.IZ52R5/pkgs' does not provide attribute 'devShells.x86_64-linux.default', 'devShell.x86_64-linux', 'packages.x86_64-linux.default' or 'defaultPackage.x86_64-linux'658659 note: run with `RUST_BACKTRACE=1` environment variable to display a backtrace660661 Cancelling due to test failure: 15 tests still running662 PASS [ 1.284s] ( 622/1035) iets::classic_eval nix_eval_of_a_flake663 PASS [ 0.618s] ( 623/1035) iets::classic_fallback fallbacks664 PASS [ 1.195s] ( 624/1035) iets::classic_eval symlinks_below_a_copied_path665 PASS [ 0.612s] ( 625/1035) iets::classic_shell nix_develop666 PASS [ 0.923s] ( 626/1035) iets::classic_fallback fetchers667 PASS [ 2.583s] ( 627/1035) iets::classic_cache the_tracing_cache668 PASS [ 2.242s] ( 628/1035) iets::classic_eval pure_eval_and_nix_conf669 PASS [ 1.943s] ( 629/1035) iets::classic_fallback fetch_git670 PASS [ 2.837s] ( 630/1035) iets::classic_eval nix_derivation_show671 PASS [ 5.750s] ( 631/1035) iets api::concurrent_eval::concurrent_eval_sums_arena_use_over_workers672 PASS [ 8.461s] ( 632/1035) iets::classic_build settings_reach_the_daemon673 PASS [ 8.700s] ( 633/1035) iets::classic_eval nix_instantiate674 PASS [ 22.459s] ( 634/1035) iets syntax::tests::deep_nesting_ends_with_an_error675 SLOW [> 60.000s] (---------) iets api::concurrent_eval::concurrent_eval_matches_sequential_eval676 SLOW [> 60.000s] (---------) iets::classic_eval nix_search_nixpkgs677 PASS [ 92.235s] ( 635/1035) iets::classic_eval nix_search_nixpkgs678 SLOW [>120.000s] (---------) iets api::concurrent_eval::concurrent_eval_matches_sequential_eval679 SLOW [>180.000s] (---------) iets api::concurrent_eval::concurrent_eval_matches_sequential_eval680 SLOW [>240.000s] (---------) iets api::concurrent_eval::concurrent_eval_matches_sequential_eval681 PASS [ 244.159s] ( 636/1035) iets api::concurrent_eval::concurrent_eval_matches_sequential_eval682------------683 Summary [ 244.160s] 636/1035 tests run: 635 passed (2 slow), 1 failed, 6 skipped684 FAIL [ 1.448s] ( 621/1035) iets::classic_build out_links_and_roots685warning: 399/1035 tests were not run due to test failure (run with --no-fail-fast to run all tests, or run with --max-fail)686error: test run failed