iets-nextest-0.1.0
checks.aarch64-linux.test
· build #442
· raw
1elastic-arm-5be5d98b: building cbvpy1myfxj8afjkkan2a2245zr1zn31-iets-nextest-0.1.0.drv
unpackPhase
2unpacking source archive /nix/store/fd9g8sqbh373fk8cgc88bfv4lf0wi1w3-source3source root is sourcepatchPhase
4Executing configureCargoCommonVars5decompressing cargo artifacts from /nix/store/hgrp7hd209cjnbpq1cagcwcc404690ww-iets-deps-0.1.0/target.tar.zst to targetconfigurePhase
6will append /build/source/.cargo-home/config.toml with contents of /nix/store/xxq0blv9rwlynz621b9rcxrpnkm5if8f-vendor-cargo-deps/config.toml7default configurePhase, nothing to dobuildPhase
8+++ command cargo --version9cargo 1.98.0 (797e8a9bc 2026-08-05)10+++ command cargo nextest --version11cargo-nextest 0.9.14612release: 0.9.14613host: aarch64-unknown-linux-gnucheckPhase
14+++ command cargo nextest run --cargo-profile dev15 Compiling iets v0.1.0 (/build/source)16 Finished `dev` profile [unoptimized + debuginfo] target(s) in 1m 48s17------------18 Nextest run ID 9dd45f13-1fd6-4770-9a42-c74c5ed1d9af with nextest profile: default19 Starting 984 tests across 23 binaries (6 tests skipped)20 PASS [ 0.023s] ( 1/984) iets api::installable::tests::the_name_a_program_takes_from_a_derivation_name21 PASS [ 0.025s] ( 2/984) iets api::drvshow::tests::floats_take_nlohmanns_form22 PASS [ 0.028s] ( 3/984) iets api::fetch::tests::the_fake_hash_moves_the_output_and_the_drv23 PASS [ 0.028s] ( 4/984) iets api::drvshow::tests::a_non_canonical_structured_attrs_text_is_renormalised24 PASS [ 0.032s] ( 5/984) iets api::drvshow::tests::a_fixed_output_shows_its_content_address_and_no_path25 PASS [ 0.032s] ( 6/984) iets api::installable::tests::default_and_fragment_attr_paths26 PASS [ 0.031s] ( 7/984) iets api::drvshow::tests::a_multi_output_derivation27 PASS [ 0.032s] ( 8/984) iets api::drvshow::tests::inputs_and_structured_attrs28 PASS [ 0.033s] ( 9/984) iets api::value::tests::apply_is_lazy29 PASS [ 0.036s] ( 10/984) iets api::run::tests::a_fiber_template_carries_the_configuration30 PASS [ 0.040s] ( 11/984) iets api::drvshow::tests::pretty_matches_serde_json31 PASS [ 0.049s] ( 12/984) iets api::fetch::tests::only_a_fixed_output_drv_can_be_prefetched32 PASS [ 0.019s] ( 13/984) iets argv::tests::every_byte_round_trips33 PASS [ 0.030s] ( 14/984) iets api::value::tests::force_deep_forces_the_whole_tree34 PASS [ 0.033s] ( 15/984) iets api::value::tests::thunk_reads_as_thunk35 PASS [ 0.042s] ( 16/984) iets api::value::tests::attrs_by_name_and_index36 PASS [ 0.030s] ( 17/984) iets api::value::tests::wrong_type_is_an_error37 PASS [ 0.019s] ( 18/984) iets build::backend::tests::base_names_drop_the_store_dir38 PASS [ 0.037s] ( 19/984) iets api::value::tests::missing_attribute39 PASS [ 0.049s] ( 20/984) iets api::value::tests::calling_a_function40 PASS [ 0.049s] ( 21/984) iets api::value::tests::construction41 PASS [ 0.047s] ( 22/984) iets api::value::tests::lists42 PASS [ 0.045s] ( 23/984) iets api::value::tests::strings_and_context43 PASS [ 0.021s] ( 24/984) iets build::backend::tests::the_timings_report_with_every_line44 PASS [ 0.023s] ( 25/984) iets build::event::tests::durations45 PASS [ 0.021s] ( 26/984) iets build::executor::tests::a_feature_the_place_lacks_rules_it_out46 PASS [ 0.020s] ( 27/984) iets build::executor::tests::an_unsupported_url_says_what_is_expected47 PASS [ 0.029s] ( 28/984) iets build::backend::tests::output_specs48 PASS [ 0.024s] ( 29/984) iets build::executor::tests::a_refusal_names_every_place_and_what_it_declared49 PASS [ 0.059s] ( 30/984) iets api::value::tests::scalars50 PASS [ 0.023s] ( 31/984) iets build::executor::tests::no_place_at_all_is_a_usage_error51 PASS [ 0.028s] ( 32/984) iets build::executor::tests::a_declared_system_filters52 PASS [ 0.017s] ( 33/984) iets build::executor::tests::the_first_place_that_takes_it_wins53 PASS [ 0.022s] ( 34/984) iets build::executor::tests::one_place_declaring_nothing_takes_everything54 PASS [ 0.019s] ( 35/984) iets build::fixhash::tests::two_matches_are_left_alone55 PASS [ 0.015s] ( 36/984) iets build::render::tests::a_daemon_failure_message_decides_the_verdict56 PASS [ 0.023s] ( 37/984) iets build::fixhash::tests::a_longer_hash_is_not_a_match57 PASS [ 0.015s] ( 38/984) iets build::render::tests::a_long_attribute_keeps_its_ends58 PASS [ 0.034s] ( 39/984) iets build::fanout::tests::a_failed_dependency_blocks_its_dependants59 PASS [ 0.027s] ( 40/984) iets build::render::tests::a_build_log_never_reports_a_mismatch60 PASS [ 0.025s] ( 41/984) iets build::render::tests::a_build_the_backend_saw_succeed_is_verdicted_at_once61 PASS [ 0.023s] ( 42/984) iets build::render::tests::a_failure_shows_a_short_extract62 PASS [ 0.032s] ( 43/984) iets build::fanout::tests::dependencies_run_first63 PASS [ 0.031s] ( 44/984) iets build::render::tests::a_failure_after_the_activity_ended_never_claims_a_success64 PASS [ 0.021s] ( 45/984) iets build::render::tests::an_owned_build_is_verdicted_once_by_its_op65 PASS [ 0.051s] ( 46/984) iets build::fixhash::tests::one_match_is_rewritten_in_its_own_spelling66 PASS [ 0.019s] ( 47/984) iets build::render::tests::logs_of_two_builds_do_not_interleave67 PASS [ 0.032s] ( 48/984) iets build::render::tests::a_stalled_build_that_fails_still_shows_its_cause68 PASS [ 0.026s] ( 49/984) iets build::render::tests::ci_folds_a_success_and_never_a_failure69 PASS [ 0.019s] ( 50/984) iets build::render::tests::one_build_needs_no_summary70 PASS [ 0.024s] ( 51/984) iets build::render::tests::heartbeat_names_running_builds71 PASS [ 0.023s] ( 52/984) iets build::render::tests::the_live_region_spins_and_counts72 PASS [ 0.031s] ( 53/984) iets build::render::tests::drv_paths_of_a_failure_message73 PASS [ 0.036s] ( 54/984) iets build::render::tests::an_unfolded_success_ends_with_its_verdict74 PASS [ 0.023s] ( 55/984) iets build::render::tests::the_status_line_takes_the_colours_of_the_rows_above75 PASS [ 0.019s] ( 56/984) iets build::render::tests::the_summary_follows_more_than_one_build76 PASS [ 0.018s] ( 57/984) iets build::render::tests::tty_keeps_successful_logs_off_the_screen77 PASS [ 0.023s] ( 58/984) iets builtins::derivation::tests::the_two_placeholders_are_not_the_same78 PASS [ 0.024s] ( 59/984) iets build::tests::hash_stripping79 PASS [ 0.024s] ( 60/984) iets build::tests::targets_become_jobs80 PASS [ 0.094s] ( 61/984) iets build::fanout::tests::at_most_limit_builds_run_at_once81 PASS [ 0.034s] ( 62/984) iets builtins::derivation::tests::a_dynamic_output_renders_the_placeholder_nix_renders82 PASS [ 0.052s] ( 63/984) iets build::tests::a_target_with_no_verdict_fails83 PASS [ 0.037s] ( 64/984) iets builtins::fetch::tests::nix_sees_no_mark84 PASS [ 0.045s] ( 65/984) iets builtins::fetch::tests::an_entry_of_the_compiled_file_cache_keeps_the_site85 PASS [ 0.054s] ( 66/984) iets build::tests::a_fan_out_backend_keeps_the_cap_and_the_log_blocks86 PASS [ 0.034s] ( 67/984) iets builtins::fetch_git::tests::a_working_tree_is_a_file_url_of_an_absolute_path87 PASS [ 0.022s] ( 68/984) iets builtins::fetch_git::tests::only_a_plain_rev_or_ref_is_read_by_iets88 PASS [ 0.073s] ( 69/984) iets builtins::fetch::tests::a_read_of_the_count_is_one_finding_for_each_tree89 PASS [ 0.032s] ( 70/984) iets builtins::store_hooks::tests::a_relative_path_inside_an_entry_joins_once90 PASS [ 0.064s] ( 71/984) iets builtins::fetch::tests::the_mark_follows_the_string_like_store_context91 PASS [ 0.034s] ( 72/984) iets builtins::text::fromtoml::tests::inline_tables_stay_on_one_line92 PASS [ 0.086s] ( 73/984) iets builtins::fetch::tests::a_read_that_is_not_a_selection_has_no_site93 PASS [ 0.038s] ( 74/984) iets builtins::store_hooks::tests::virtual_tree_reads_go_to_the_local_files94 PASS [ 0.023s] ( 75/984) iets builtins::text::fromtoml::tests::new_escapes_are_refused95 PASS [ 0.075s] ( 76/984) iets builtins::fetch::tests::the_first_read_of_a_tree_gives_its_finding96 PASS [ 0.025s] ( 77/984) iets builtins::text::regex::tests::names97 PASS [ 0.069s] ( 78/984) iets builtins::fetch::tests::the_tree_decides_the_level98 PASS [ 0.019s] ( 79/984) iets cachefs::tests::a_stamp_in_the_future_is_due99 PASS [ 0.026s] ( 80/984) iets cachefs::tests::a_directory_that_is_not_ours_is_refused_untouched100 PASS [ 0.029s] ( 81/984) iets cachefs::tests::a_store_without_a_version_file_is_wiped_once101 PASS [ 0.114s] ( 82/984) iets builtins::fetch::tests::a_selection_of_the_count_is_the_site102 PASS [ 0.037s] ( 83/984) iets builtins::text::regex::tests::size_limit103 PASS [ 0.029s] ( 84/984) iets cachefs::tests::a_sweep_runs_once_per_interval104 PASS [ 0.024s] ( 85/984) iets cachefs::tests::a_wait_lock_waits_for_its_holder105 PASS [ 0.021s] ( 86/984) iets cachefs::tests::a_wipe_keeps_what_iets_did_not_create106 PASS [ 0.028s] ( 87/984) iets cachefs::tests::a_touch_inside_the_interval_writes_nothing107 PASS [ 0.026s] ( 88/984) iets cachefs::tests::a_wipe_of_the_ir_cache_walks_its_shards108 PASS [ 0.017s] ( 89/984) iets cachefs::tests::garbled_stamp_wipes_the_store109 PASS [ 0.019s] ( 90/984) iets cachefs::tests::sweep_drops_old_entries_and_keeps_young_ones110 PASS [ 0.025s] ( 91/984) iets cachefs::tests::sweep_ages_a_root_by_its_link_not_by_what_it_names111 PASS [ 0.122s] ( 92/984) iets builtins::fetch::tests::the_name_on_a_value_that_is_not_a_tree_is_silent112 PASS [ 0.024s] ( 93/984) iets cachefs::tests::sweep_walks_the_shards_of_the_ir_cache113 PASS [ 0.034s] ( 94/984) iets cachefs::tests::an_empty_directory_is_ours_to_take114 PASS [ 0.030s] ( 95/984) iets cachefs::tests::an_input_store_of_the_spool_layout_is_wiped115 PASS [ 0.018s] ( 96/984) iets cli::build::tests::a_success_with_no_output_path_is_named116 PASS [ 0.021s] ( 97/984) iets cli::build::tests::a_path_on_stdout_is_silent117 PASS [ 0.013s] ( 98/984) iets cli::build::tests::an_out_flag_that_matches_nothing_is_named118 PASS [ 0.032s] ( 99/984) iets cachefs::tests::version_mismatch_wipes_the_store119 PASS [ 0.024s] (100/984) iets cli::build::tests::a_failed_build_reports_itself120 PASS [ 0.018s] (101/984) iets cli::build::tests::no_build_result_is_named121 PASS [ 0.079s] (102/984) iets cachefs::tests::a_lock_that_cannot_be_opened_is_not_a_busy_lock122 PASS [ 0.025s] (103/984) iets cli::build::tests::installables_are_sorted_without_repeats123 PASS [ 0.025s] (104/984) iets cli::build::tests::out_links_are_named_as_nix_build_names_them124 PASS [ 0.021s] (105/984) iets cli::classic::nix::tests::flake_registry_is_the_setting125 PASS [ 0.021s] (106/984) iets cli::classic::shell::tests::outputs_become_placeholders126 PASS [ 0.035s] (107/984) iets cli::build::tests::no_outcome_at_all_is_named127 PASS [ 0.022s] (108/984) iets cli::classic::shell::tests::sh_var_names128 PASS [ 0.024s] (109/984) iets cli::classic::nix::tests::eval_takes_print_build_logs129 PASS [ 0.025s] (110/984) iets cli::classic::shell::tests::declares_for_every_bash_shaped_value130 PASS [ 0.019s] (111/984) iets cli::classic::tests::a_flag_with_no_effect_is_noted_and_one_that_holds_is_not131 PASS [ 0.016s] (112/984) iets cli::complete::tests::a_positional_is_left_to_the_shell132 PASS [ 0.016s] (113/984) iets cli::complete::tests::commands_complete_with_their_summary133 PASS [ 0.028s] (114/984) iets cli::complete::tests::a_flag_value_completes_by_its_placeholder134 PASS [ 0.013s] (115/984) iets cli::diff::tests::a_name_ends_at_the_first_dash_before_a_digit135 PASS [ 0.015s] (116/984) iets cli::complete::tests::subcommands_and_topics136 PASS [ 0.014s] (117/984) iets cli::docs::tests::the_topic_list_fits_80_columns137 PASS [ 0.020s] (118/984) iets cli::complete::tests::flags_complete_after_a_dash138 PASS [ 0.039s] (119/984) iets cli::complete::tests::every_script_asks_the_binary139 PASS [ 0.036s] (120/984) iets cli::docs::tests::every_embedded_page_has_a_heading140 PASS [ 0.022s] (121/984) iets cli::plumbing::tests::a_file_url_needs_one_slash_not_three141 PASS [ 0.024s] (122/984) iets cli::help::tests::messages142 PASS [ 0.030s] (123/984) iets cli::help::tests::help_fits_80_columns143 PASS [ 0.035s] (124/984) iets cli::docs::tests::topics_resolve_bare_and_qualified144 PASS [ 0.019s] (125/984) iets cli::render::tests::sizes_render_as_nix_renders_them145 PASS [ 0.032s] (126/984) iets cli::help::tests::a_mistyped_command_is_suggested146 PASS [ 0.024s] (127/984) iets cli::plumbing::tests::a_url_is_the_positional_fetch_takes_itself147 PASS [ 0.033s] (128/984) iets cli::help::tests::suggestions_come_from_the_help148 PASS [ 0.018s] (129/984) iets cli::search::tests::merged_highlights149 PASS [ 0.019s] (130/984) iets cli::search::tests::drv_names150 PASS [ 0.024s] (131/984) iets cli::render::text::tests::a_long_value_shows_the_lines_that_differ151 PASS [ 0.123s] (132/984) iets cachefs::tests::the_writer_lock_excludes_one_holder_at_a_time152 PASS [ 0.026s] (133/984) iets cli::search::tests::index_round_trip153 PASS [ 0.031s] (134/984) iets cli::run::tests::a_usage_error_is_an_exit_code_and_a_message154 PASS [ 0.024s] (135/984) iets config::tests::a_classic_name_leaves_an_unimplemented_setting_to_nix155 PASS [ 0.016s] (136/984) iets config::tests::bad_typed_values_error_where_they_are_set156 PASS [ 0.039s] (137/984) iets compile::cache::tests::a_malformed_entry_is_a_miss_and_never_a_crash157 PASS [ 0.021s] (138/984) iets config::tests::basic_syntax158 PASS [ 0.024s] (139/984) iets config::tests::an_alias_is_its_setting159 PASS [ 0.028s] (140/984) iets config::tests::a_setting_with_no_effect_is_noted160 PASS [ 0.016s] (141/984) iets config::tests::bool_spellings161 PASS [ 0.016s] (142/984) iets config::tests::extra_appends_to_list_settings_only162 PASS [ 0.020s] (143/984) iets config::tests::include_chain163 PASS [ 0.019s] (144/984) iets config::tests::max_jobs_auto_is_the_cpu_count164 PASS [ 0.017s] (145/984) iets config::tests::option_nix_path_replaces_nix_path_and_extra_adds165 PASS [ 0.017s] (146/984) iets config::tests::missing_include_errors_and_bang_include_does_not166 PASS [ 0.054s] (147/984) iets compile::cache::tests::nesting_past_the_cap_misses167 PASS [ 0.075s] (148/984) iets cli::run::tests::the_hosts_environment_reaches_the_lint_configuration168 PASS [ 0.016s] (149/984) iets config::tests::syntax_errors169 PASS [ 0.076s] (150/984) iets cli::run::tests::eval_prints_its_value170 PASS [ 0.024s] (151/984) iets config::tests::overrides_win_over_files171 PASS [ 0.016s] (152/984) iets devenv::tests::cached_result_roundtrip172 PASS [ 0.025s] (153/984) iets config::tests::the_daemon_gets_the_store_settings_set_outside_the_system_file173 PASS [ 0.017s] (154/984) iets devenv::tests::json_roundtrip_and_bash_forms174 PASS [ 0.024s] (155/984) iets devenv::tests::get_env_sh_store_path_matches_nix175 PASS [ 0.099s] (156/984) iets compile::cache::tests::a_changed_byte_never_makes_the_evaluator_read_past_its_env176 PASS [ 0.027s] (157/984) iets config::tests::unknown_settings_are_kept177 PASS [ 0.030s] (158/984) iets config::tests::user_conf_files_are_in_precedence_order178 PASS [ 0.031s] (159/984) iets config::tests::typed_getters_and_defaults179 PASS [ 0.020s] (160/984) iets devenv::tests::output_checks_are_erased_only_when_present180 PASS [ 0.023s] (161/984) iets devenv::tests::rewrites_apply_in_map_order_to_every_occurrence181 PASS [ 0.024s] (162/984) iets devenv::tests::rc_script_rewrites_outputs_and_writes_attrs182 PASS [ 0.034s] (163/984) iets devenv::tests::non_bash_builder_is_refused183 PASS [ 0.019s] (164/984) iets display::tests::a_region_taller_than_the_screen_is_clamped184 PASS [ 0.052s] (165/984) iets config::tests::the_setting_tables_name_nix_settings185 PASS [ 0.027s] (166/984) iets devenv::tests::shell_escaping186 PASS [ 0.026s] (167/984) iets display::tests::a_full_width_line_keeps_its_last_column187 PASS [ 0.028s] (168/984) iets display::tests::a_frame_is_one_synchronized_write188 PASS [ 0.035s] (169/984) iets display::tests::a_region_that_grows_and_shrinks_loses_no_output189 PASS [ 0.027s] (170/984) iets display::tests::a_resize_burst_never_erases190 PASS [ 0.023s] (171/984) iets display::tests::colour_and_width191 PASS [ 0.024s] (172/984) iets display::tests::growth_does_not_eat_output192 PASS [ 0.025s] (173/984) iets display::tests::a_resize_keeps_one_region193 PASS [ 0.018s] (174/984) iets display::tests::output_starts_at_the_origin194 PASS [ 0.033s] (175/984) iets display::tests::the_region_comes_down_on_close195 PASS [ 0.036s] (176/984) iets display::tests::output_scrolls_and_the_region_stays_at_the_bottom196 PASS [ 0.032s] (177/984) iets display::tests::the_region_keeps_its_rows_until_a_smaller_size_lasts197 PASS [ 0.035s] (178/984) iets display::tests::wrapped_output_does_not_corrupt_the_region198 PASS [ 0.034s] (179/984) iets eval::tests::a_second_pseudo_file_keeps_its_own_positions199 PASS [ 0.036s] (180/984) iets eval::tests::an_invalid_regex_fails_before_the_string_is_forced200 PASS [ 0.051s] (181/984) iets eval::tests::arithmetic_and_strings201 PASS [ 0.034s] (182/984) iets eval::tests::derivation_wrapper_exists202 PASS [ 0.060s] (183/984) iets eval::tests::a_function_select_is_a_fresh_slot_when_its_subject_is_forced203 PASS [ 0.568s] (184/984) iets api::run::tests::the_counters_cover_the_helper_fibers204 PASS [ 0.045s] (185/984) iets eval::tests::fetch_mercurial_names_a_way_out205 PASS [ 0.063s] (186/984) iets eval::tests::derivation_keeps_env_and_args_that_are_not_utf8206 PASS [ 0.040s] (187/984) iets eval::tests::from_json_and_toml_reject_null_bytes207 PASS [ 0.057s] (188/984) iets eval::tests::equality208 PASS [ 0.079s] (189/984) iets eval::tests::attrs_and_lists209 PASS [ 0.054s] (190/984) iets eval::tests::fetchurl_needs_a_sha256_in_every_mode210 PASS [ 0.069s] (191/984) iets eval::tests::fetchurl_checks_its_argument_like_nix211 PASS [ 0.058s] (192/984) iets eval::tests::nix_eq_forces_what_the_shortcut_skips212 PASS [ 0.275s] (193/984) iets compile::cache::tests::a_changed_byte_of_a_stored_entry_is_a_miss213 PASS [ 0.063s] (194/984) iets eval::tests::update_forces_the_right_operand_first214 PASS [ 0.095s] (195/984) iets eval::tests::laziness_and_recursion215 PASS [ 0.076s] (196/984) iets eval::tests::try_eval_and_errors216 PASS [ 0.099s] (197/984) iets eval::tests::printing217 PASS [ 0.028s] (198/984) iets fetch::http::tests::credentials_in_the_url_are_sent_and_never_printed218 PASS [ 0.091s] (199/984) iets eval::tests::sets_compare_in_the_symbol_order_of_nix219 PASS [ 0.109s] (200/984) iets eval::tests::reading_a_derivation_output_is_unsupported220 PASS [ 0.019s] (201/984) iets fetch::http::tests::file_urls_name_a_local_path221 PASS [ 0.112s] (202/984) iets eval::tests::scoping222 PASS [ 0.018s] (203/984) iets fetch::http::tests::magic_bytes223 PASS [ 0.041s] (204/984) iets fetch::http::tests::credentials_stay_on_the_first_origin224 PASS [ 0.017s] (205/984) iets fetch::http::tests::redirects_resolve225 PASS [ 0.022s] (206/984) iets fetch::http::tests::redirects_keep_credentials_only_on_the_same_origin226 PASS [ 0.020s] (207/984) iets fetch::http::tests::urls_split227 PASS [ 0.018s] (208/984) iets fetch::roots::tests::a_named_file_that_is_missing_or_empty_is_an_error228 PASS [ 0.025s] (209/984) iets fetch::http::tests::trailing_bytes_and_a_second_layer229 PASS [ 0.022s] (210/984) iets fetch::roots::tests::an_empty_nix_ssl_cert_file_hides_ssl_cert_file230 PASS [ 0.018s] (211/984) iets fetch::roots::tests::no_bundle_anywhere_gives_the_compiled_in_set231 PASS [ 0.025s] (212/984) iets fetch::roots::tests::nix_ssl_cert_file_wins_over_ssl_cert_file_and_the_platform232 PASS [ 0.024s] (213/984) iets fetch::roots::tests::the_platform_store_wins_over_the_compiled_in_set233 PASS [ 0.028s] (214/984) iets fetch::spool::tests::a_changed_index_byte_is_a_miss234 PASS [ 0.025s] (215/984) iets fetch::spool::tests::a_sparse_member_counts_against_the_size_limit235 PASS [ 0.023s] (216/984) iets fetch::spool::tests::an_empty_archive_is_an_empty_directory236 PASS [ 0.036s] (217/984) iets fetch::spool::tests::a_hard_link_never_replaces_a_member237 PASS [ 0.034s] (218/984) iets fetch::spool::tests::a_stored_tree_dumps_the_spools_nar238 PASS [ 0.027s] (219/984) iets fetch::spool::tests::nar_hash_of_the_fixture239 PASS [ 0.022s] (220/984) iets fetch::spool::tests::spool_matches_the_tree240 PASS [ 0.036s] (221/984) iets fetch::spool::tests::archives_the_git_sink_accepts241 PASS [ 0.014s] (222/984) iets fetch::spool::tests::the_scratch_file_never_follows_a_symlink242 PASS [ 0.027s] (223/984) iets fetch::spool::tests::pax_sparse_members_are_expanded243 PASS [ 0.029s] (224/984) iets fetch::spool::tests::spool_matches_the_tree_on_the_top_level244 PASS [ 0.024s] (225/984) iets fetch::spool::tests::the_errors_match245 PASS [ 0.024s] (226/984) iets fetch::unpack::tests::a_repeated_member_keeps_the_last_copy246 PASS [ 0.021s] (227/984) iets fetch::unpack::tests::an_unsupported_member_type_is_an_error247 PASS [ 0.023s] (228/984) iets fetch::unpack::tests::member_names_are_made_relative_and_cannot_escape248 PASS [ 0.026s] (229/984) iets fetch::unpack::tests::keeps_the_root_when_it_is_not_a_single_directory249 PASS [ 0.026s] (230/984) iets fetch::unpack::tests::modes_symlinks_and_empty_dirs250 PASS [ 0.021s] (231/984) iets fetch::unpack::tests::strips_one_leading_component251 PASS [ 0.024s] (232/984) iets fetch::unpack::tests::nar_hash_of_the_fixture252 PASS [ 0.018s] (233/984) iets flake::flakeref::tests::errors_and_unsupported253 PASS [ 0.020s] (234/984) iets flake::flakeref::tests::git_urls_are_fixed_like_nix254 PASS [ 0.017s] (235/984) iets flake::flakeref::tests::round_trips255 PASS [ 0.232s] (236/984) iets eval::tests::pure_eval_answers_like_nix256 PASS [ 0.025s] (237/984) iets flake::flakeref::tests::parses_the_kept_schemes257 PASS [ 0.017s] (238/984) iets flake::tests::attr_paths258 PASS [ 0.027s] (239/984) iets flake::tests::a_pinned_checkout_is_its_revision259 PASS [ 0.014s] (240/984) iets jobs::constituents::tests::fnmatch_basics260 PASS [ 0.023s] (241/984) iets flake::tests::refs_resolve_against_cwd_and_home261 PASS [ 0.040s] (242/984) iets flake::flakeref::tests::refuses_a_github_ref_named_twice262 PASS [ 0.034s] (243/984) iets flake::flakeref::tests::to_string_from_attrs263 PASS [ 0.027s] (244/984) iets jobs::constituents::tests::topo_sort_orders_and_detects_cycles264 PASS [ 0.027s] (245/984) iets jobs::line::tests::split_and_round_trip265 PASS [ 0.019s] (246/984) iets jobs::line::tests::stats_survive_the_collector266 PASS [ 0.030s] (247/984) iets jobs::line::tests::error_line_round_trip267 PASS [ 0.020s] (248/984) iets lint::allow::tests::comment_names268 PASS [ 0.028s] (249/984) iets jobs::tests::a_numeric_name_selects_an_attribute_under_a_set269 PASS [ 0.032s] (250/984) iets lint::allow::tests::lines270 PASS [ 0.022s] (251/984) iets lint::cases::a_project_file_may_not_set_nix_bin_dir271 PASS [ 0.054s] (252/984) iets lint::cases::a_family_selector_selects_its_members272 PASS [ 0.048s] (253/984) iets lint::cases::an_unknown_name_in_iets_lint_is_a_warning_and_the_rest_counts273 PASS [ 0.037s] (254/984) iets lint::cases::one_warning_per_site274 PASS [ 0.056s] (255/984) iets lint::cases::an_unknown_name_in_iets_toml_is_a_warning_and_the_rest_counts275 PASS [ 0.078s] (256/984) iets lint::cases::a_later_flag_wins_over_all_and_a_name_beats_a_later_all276 PASS [ 0.267s] (257/984) iets fetch::http::tests::downloads_stop_at_the_size_limit277 PASS [ 0.039s] (258/984) iets lint::cli_cases::a_finding_at_error_has_the_span_and_no_edit278 PASS [ 0.054s] (259/984) iets lint::cases::try_eval_does_not_catch_a_lint_error279 PASS [ 0.066s] (260/984) iets lint::cases::the_user_iets_toml_sets_a_level_and_the_project_file_wins_over_it280 PASS [ 0.109s] (261/984) iets lint::cases::scope_attributes_a_derivation_to_the_users_binding281 PASS [ 0.756s] (262/984) iets builtins::text::regex::tests::long_inputs_do_not_recurse282 PASS [ 0.097s] (263/984) iets lint::cases::the_project_iets_toml_sets_a_level_and_a_name_beats_its_family283 PASS [ 0.063s] (264/984) iets lint::cli_cases::a_finding_record_has_the_span_and_the_edit_on_a_cache_hit_too284 PASS [ 0.113s] (265/984) iets lint::cases::scope_limits_a_lint_to_the_entry_directory_until_it_is_opened285 PASS [ 0.026s] (266/984) iets lint::cli_cases::an_unknown_lint_name_in_a_flag_is_a_usage_error286 PASS [ 0.054s] (267/984) iets lint::cli_cases::a_warning_is_replayed_on_a_cache_hit287 PASS [ 0.024s] (268/984) iets lint::cli_cases::lint_list_shows_the_effective_levels_and_the_scope288 PASS [ 0.164s] (269/984) iets lint::cases::iets_lint_sets_a_level_and_a_flag_beats_it289 PASS [ 0.049s] (270/984) iets lint::cli_cases::an_unknown_name_in_iets_lint_is_a_record290 PASS [ 0.094s] (271/984) iets lint::cli_cases::an_allow_comment_is_part_of_the_cache_key_and_a_hit_replays_nothing291 PASS [ 0.061s] (272/984) iets lint::cli_cases::the_scope_is_part_of_the_cache_key292 PASS [ 0.233s] (273/984) iets lint::cases::allow_comments_silence_the_lines_they_cover293 PASS [ 0.140s] (274/984) iets lint::cli_cases::an_allow_table_travels_in_the_ir_cache_entry_and_a_load_stays_silent294 PASS [ 0.148s] (275/984) iets lint::flake_cases::a_tree_meta_finding_is_a_record_with_a_span_on_a_cache_hit_too295 PASS [ 0.177s] (276/984) iets lint::flake_cases::a_copy_under_the_root_or_an_input_is_not_a_recopy296 PASS [ 0.177s] (277/984) iets lint::flake_cases::a_directory_under_the_root_is_dir_copy_flake_not_path_copy297 PASS [ 0.031s] (278/984) iets lint::site::tests::a_literal_lint_of_nix_has_an_edit298 PASS [ 0.027s] (279/984) iets lint::site::tests::the_span_is_the_innermost_node_of_the_kind_of_the_lint299 PASS [ 0.020s] (280/984) iets lint::tests::an_unknown_name_is_a_warning_in_a_file_and_an_error_in_a_flag300 PASS [ 0.040s] (281/984) iets lint::tests::keys301 PASS [ 0.032s] (282/984) iets lint::tests::names_are_unique_kebab_case302 PASS [ 0.029s] (283/984) iets lint::tests::scope_and_inputs303 PASS [ 0.019s] (284/984) iets lint::tests::specificity_inside_a_source_and_order_between_sources304 PASS [ 0.025s] (285/984) iets lint::tests::selectors_and_order305 PASS [ 0.031s] (286/984) iets lint::tests::the_project_file_walk_stops_at_the_project_root306 PASS [ 0.025s] (287/984) iets lint::tests::toml_table307 PASS [ 0.023s] (288/984) iets log::tests::a_coloured_error_is_an_error_record308 PASS [ 0.031s] (289/984) iets log::tests::a_fixed_hash_has_the_shape_of_a_finding_with_an_edit309 PASS [ 0.023s] (290/984) iets log::tests::a_forged_mismatch_is_dropped310 PASS [ 0.008s] (291/984) iets log::tests::a_mismatch_reason_keeps_both_hashes311 PASS [ 0.275s] (292/984) iets lint::flake_cases::an_input_or_an_allowed_site_is_silent_and_the_scope_opens_the_input312 PASS [ 0.224s] (293/984) iets lint::flake_cases::the_roots_metadata_in_a_derivation_is_reported_by_default313 PASS [ 0.043s] (294/984) iets log::tests::a_half_line_waits_for_its_newline314 PASS [ 0.035s] (295/984) iets log::tests::a_hash_mismatch_names_the_hash_it_got315 PASS [ 0.302s] (296/984) iets lint::flake_cases::an_input_is_silent_until_the_scope_or_the_inputs_table_opens_it316 PASS [ 0.016s] (297/984) iets log::tests::a_region_stays_under_the_output_that_scrolls_above_it317 PASS [ 0.268s] (298/984) iets lint::flake_cases::the_project_file_sets_tree_meta_per_tree318 PASS [ 0.292s] (299/984) iets lint::flake_cases::the_level_of_tree_meta_comes_from_the_flag_the_env_and_the_user_file319 PASS [ 0.023s] (300/984) iets log::tests::a_resolved_copy_reports_its_mismatch_as_a_line320 PASS [ 0.040s] (301/984) iets log::tests::a_pause_takes_the_view_down_for_a_prompt321 PASS [ 0.024s] (302/984) iets log::tests::a_session_id_is_a_uuid_v7322 PASS [ 0.023s] (303/984) iets log::tests::activity_records_are_nix_json_logger_records323 PASS [ 0.016s] (304/984) iets log::tests::ansi_stripping324 PASS [ 0.016s] (305/984) iets log::tests::escapes_are_filtered_the_way_nix_filters_them325 PASS [ 0.013s] (306/984) iets log::tests::exit_status_flags_combine_like_nix326 PASS [ 0.035s] (307/984) iets log::tests::a_resize_redraws_the_region_once327 PASS [ 0.017s] (308/984) iets log::tests::lint_warning_is_a_level_1_record328 PASS [ 0.019s] (309/984) iets log::tests::record_is_nix_log_ei_plus_code_and_hint329 PASS [ 0.016s] (310/984) iets nixbin::tests::farm_marker_is_found_through_two_hops330 PASS [ 0.022s] (311/984) iets log::tests::without_a_terminal_output_is_plain331 PASS [ 0.023s] (312/984) iets log::tests::text_shows_the_hint_of_an_unsupported_error332 PASS [ 0.024s] (313/984) iets log::tests::the_status_line_goes_under_the_region333 PASS [ 0.027s] (314/984) iets nixbin::tests::every_iets_build_is_skipped334 PASS [ 0.029s] (315/984) iets log::tests::record_without_position335 PASS [ 0.022s] (316/984) iets parallel::fiber::tests::reservation_is_capped_and_mmap_failure_is_an_error336 PASS [ 0.036s] (317/984) iets parallel::deque::tests::lifo_owner_fifo_thief337 PASS [ 0.021s] (318/984) iets parallel::fiber::tests::resume_yield_finish338 PASS [ 0.031s] (319/984) iets parallel::fiber::tests::migrates_between_threads339 PASS [ 0.011s] (320/984) iets parallel::interner::tests::empty_name_misses_the_cache_sentinel340 PASS [ 0.037s] (321/984) iets parallel::fiber::tests::large_stack_use_and_release341 PASS [ 0.797s] (322/984) iets fetch::http::tests::a_transient_status_is_retried342 PASS [ 0.020s] (323/984) iets parallel::sched::tests::a_task_survives_packing_past_the_old_24_bit_start343 PASS [ 0.036s] (324/984) iets parallel::interner::tests::intern_is_stable_and_shared344 PASS [ 0.025s] (325/984) iets print::tests::float_formatting_edge_cases345 PASS [ 0.106s] (326/984) iets parallel::deque::tests::concurrent_sum346 PASS [ 0.061s] (327/984) iets parallel::sched::tests::main_parks_and_is_woken_by_helper347 PASS [ 0.101s] (328/984) iets parallel::fiber::tests::a_freed_stack_frees_its_guard_entry348 PASS [ 0.065s] (329/984) iets parallel::sched::tests::fan_out_from_main349 PASS [ 0.022s] (330/984) iets profile::tests::a_frame_keeps_its_call_site_and_its_name350 PASS [ 0.028s] (331/984) iets profile::tests::a_weight_is_bytes_when_the_profile_asks_for_them351 PASS [ 0.032s] (332/984) iets profile::tests::an_unwind_returns_to_a_depth352 PASS [ 0.033s] (333/984) iets profile::tests::a_sample_is_taken_once_per_tick353 PASS [ 0.023s] (334/984) iets progress::tests::a_download_inside_a_copy_is_part_of_the_copy354 PASS [ 0.102s] (335/984) iets parallel::sched::tests::park_and_wake_across_workers355 PASS [ 0.019s] (336/984) iets progress::tests::a_log_hears_of_a_task_after_first_and_then_every_heartbeat356 PASS [ 0.104s] (337/984) iets parallel::thunk::tests::deadlocked_fibers_are_cancelled357 PASS [ 0.017s] (338/984) iets progress::tests::store_hashes_are_left_out358 PASS [ 0.018s] (339/984) iets project::tests::a_config_file_never_shrinks_the_root359 PASS [ 0.014s] (340/984) iets project::tests::each_marker_is_a_root360 PASS [ 0.154s] (341/984) iets parallel::interner::tests::concurrent_intern_agrees361 PASS [ 0.017s] (342/984) iets project::tests::a_working_tree_wins_over_a_file_marker_below_it362 PASS [ 0.033s] (343/984) iets progress::tests::a_transfer_that_does_not_move_says_so363 PASS [ 0.033s] (344/984) iets progress::tests::several_of_a_kind_are_counted364 PASS [ 0.021s] (345/984) iets project::tests::the_nearest_flake_wins_without_a_working_tree365 PASS [ 0.018s] (346/984) iets provenance::tests::locate_takes_the_longest_prefix366 PASS [ 0.019s] (347/984) iets provenance::tests::failed_line_names_the_attribute_and_the_position367 PASS [ 0.025s] (348/984) iets provenance::tests::a_shared_position_is_left_off_the_started_line_only368 PASS [ 0.029s] (349/984) iets provenance::tests::a_tree_copied_from_a_store_tree_resolves_to_the_local_one369 PASS [ 0.017s] (350/984) iets provenance::tests::locate_without_a_match_is_none370 PASS [ 0.108s] (351/984) iets profile::tests::a_deep_stack_is_capped371 PASS [ 0.038s] (352/984) iets provenance::tests::a_path_followed_by_a_colour_escape_still_matches372 PASS [ 0.016s] (353/984) iets provenance::tests::rewrite_replaces_every_known_path_in_a_line373 PASS [ 0.039s] (354/984) iets provenance::tests::an_input_file_is_labelled_by_its_lock_node374 PASS [ 0.025s] (355/984) iets provenance::tests::rewrite_leaves_unknown_text_alone375 PASS [ 0.022s] (356/984) iets remote::grpc::backend::tests::a_built_input_stops_the_walk376 PASS [ 0.024s] (357/984) iets remote::grpc::build::tests::a_local_upload_failure_beats_the_stream_ended_status377 PASS [ 0.015s] (358/984) iets remote::grpc::build::tests::reschedules_back_off_past_a_dead_worker378 PASS [ 0.028s] (359/984) iets remote::grpc::backend::tests::an_input_below_a_built_one_is_not_built379 PASS [ 0.015s] (360/984) iets remote::grpc::build::tests::the_timings_report_with_every_line380 PASS [ 0.032s] (361/984) iets remote::grpc::backend::tests::a_cold_store_is_asked_the_rest_in_one_call381 PASS [ 0.025s] (362/984) iets remote::grpc::build::tests::required_features_come_from_the_env_or_structured_attrs382 PASS [ 0.013s] (363/984) iets remote::grpc::drvwire::tests::build_result_round_trips_a_daemon_reply383 PASS [ 0.017s] (364/984) iets remote::grpc::build::tests::topo_sort_puts_references_first384 PASS [ 0.018s] (365/984) iets remote::grpc::drvwire::tests::an_unresolvable_input_output_is_an_error385 PASS [ 0.014s] (366/984) iets remote::grpc::drvwire::tests::path_info_round_trips386 PASS [ 0.020s] (367/984) iets remote::grpc::drvwire::tests::a_failure_keeps_its_message387 PASS [ 0.025s] (368/984) iets remote::grpc::drvwire::tests::basic_derivation_matches_the_cxx_field_order388 PASS [ 0.063s] (369/984) iets remote::grpc::backend::tests::a_built_root_asks_nothing_below_it389 PASS [ 0.015s] (370/984) iets remote::grpc::health::tests::a_passed_cooldown_lets_one_caller_through390 PASS [ 0.056s] (371/984) iets remote::grpc::build::tests::a_self_reference_does_not_loop391 PASS [ 1.028s] (372/984) iets fetch::http::tests::a_stalled_download_fails392 PASS [ 0.018s] (373/984) iets remote::grpc::health::tests::a_completed_build_clears_the_history393 PASS [ 0.019s] (374/984) iets remote::grpc::health::tests::one_bounce_does_not_refuse_an_address394 PASS [ 0.021s] (375/984) iets remote::grpc::health::tests::an_unknown_address_is_usable395 PASS [ 0.026s] (376/984) iets remote::grpc::health::tests::the_cooldown_grows_and_stops_at_30s396 PASS [ 0.032s] (377/984) iets remote::grpc::health::tests::one_address_does_not_refuse_another397 PASS [ 0.020s] (378/984) iets remote::grpc::tests::a_token_needs_tls_and_unknown_parameters_are_errors398 PASS [ 0.020s] (379/984) iets remote::grpc::tests::defaults_match_the_cxx_settings399 PASS [ 0.021s] (380/984) iets remote::grpc::health::tests::two_bounces_refuse_it400 PASS [ 0.019s] (381/984) iets remote::grpc::tests::mtls_needs_both_halves401 PASS [ 0.031s] (382/984) iets remote::grpc::tests::every_parameter_parses402 PASS [ 0.024s] (383/984) iets remote::grpc::tests::percent_escapes_decode_in_values403 PASS [ 0.017s] (384/984) iets remote::plan::tests::a_held_root_answers_for_its_closure404 PASS [ 0.038s] (385/984) iets remote::grpc::tests::insecure_is_a_bare_flag_or_a_boolean405 PASS [ 0.023s] (386/984) iets remote::plan::tests::hash_source_matches_nar_hash406 PASS [ 0.027s] (387/984) iets remote::plan::tests::a_held_input_answers_for_its_closure407 PASS [ 0.027s] (388/984) iets remote::plan::tests::a_cold_store_is_asked_the_rest_in_one_call408 PASS [ 0.028s] (389/984) iets remote::plan::tests::an_answered_root_is_not_asked_again409 PASS [ 0.025s] (390/984) iets remote::plan::tests::memory_source_matches_dump_string410 PASS [ 0.020s] (391/984) iets remote::worker::counts_tests::each_change_is_a_verdict_in_order411 PASS [ 0.021s] (392/984) iets remote::worker::counts_tests::a_repeated_update_claims_nothing412 PASS [ 0.014s] (393/984) iets remote::worker::tests::a_status_over_a_byte_is_not_a_success413 PASS [ 0.018s] (394/984) iets remote::worker::tests::an_ssh_host_is_never_an_option414 PASS [ 0.024s] (395/984) iets remote::worker::wire::tests::build_results_are_read_as_nix_reads_them415 PASS [ 0.028s] (396/984) iets remote::worker::tests::nix_sshopts_split_like_a_shell416 PASS [ 0.027s] (397/984) iets remote::worker::tests::ssh_argv_puts_the_host_first417 PASS [ 0.024s] (398/984) iets remote::worker::wire::tests::framed_sink_frames_and_terminates418 PASS [ 0.027s] (399/984) iets remote::worker::wire::tests::strings_are_padded419 PASS [ 0.027s] (400/984) iets remote::worker::wire::tests::replies_are_read_as_nix_reads_them420 PASS [ 0.036s] (401/984) iets remote::worker::tests::transport_from_url421 PASS [ 0.032s] (402/984) iets runtime::heap::tests::release_tombstones_every_chunk422 PASS [ 0.019s] (403/984) iets runtime::value::alloc_tests::a_speculated_thunk_is_forced_but_not_demanded423 PASS [ 0.021s] (404/984) iets runtime::value::alloc_tests::a_list_too_long_to_address_has_no_size424 PASS [ 0.024s] (405/984) iets runtime::value::layout::a_primop_pays_nothing_for_its_symbol425 PASS [ 0.029s] (406/984) iets runtime::value::tests::union_lookup_agrees_with_iteration426 PASS [ 0.037s] (407/984) iets runtime::value::alloc_tests::a_static_slice_is_interned_without_a_copy427 PASS [ 0.021s] (408/984) iets settings::tests::a_flag_carries_several_places_separated_by_a_semicolon428 PASS [ 0.035s] (409/984) iets session::tests::two_sessions_share_no_state429 PASS [ 0.021s] (410/984) iets settings::tests::a_project_file_holds_lint_and_nothing_else430 PASS [ 0.032s] (411/984) iets settings::tests::a_missing_file_is_skipped_and_the_defaults_hold431 PASS [ 0.023s] (412/984) iets settings::tests::a_settings_file_may_hold_lint_and_the_other_sources_may_not432 PASS [ 0.017s] (413/984) iets settings::tests::a_wrong_type_names_the_key_and_the_file433 PASS [ 0.058s] (414/984) iets session::tests::a_value_used_after_release_is_loud434 PASS [ 0.019s] (415/984) iets settings::tests::builder_reads_all_three_forms435 PASS [ 0.083s] (416/984) iets session::tests::a_parallel_run_releases_its_session436 PASS [ 0.027s] (417/984) iets settings::tests::each_source_wins_over_the_one_before437 PASS [ 0.016s] (418/984) iets settings::tests::the_flag_leaves_the_argv438 PASS [ 0.024s] (419/984) iets settings::tests::source_map_adds_up_and_every_other_key_replaces439 PASS [ 0.024s] (420/984) iets settings::tests::the_environment_wins_over_the_file440 PASS [ 0.015s] (421/984) iets settings::tests::unknown_key_names_the_file441 PASS [ 0.023s] (422/984) iets settings::tests::the_user_file_turns_purity_off442 PASS [ 0.023s] (423/984) iets settings::tests::the_flag_pairs_are_kept_for_a_second_iets443 PASS [ 0.041s] (424/984) iets settings::tests::the_file_is_the_users444 PASS [ 0.026s] (425/984) iets settings::tests::the_flag_value_is_toml_when_it_reads_as_toml445 PASS [ 0.028s] (426/984) iets source::local::tests::accepted_set_adds_parent_directories446 PASS [ 0.118s] (427/984) iets session::tests::a_released_session_leaves_the_other_alone447 PASS [ 0.026s] (428/984) iets source::local::tests::max_mtime_covers_root_and_children448 PASS [ 0.023s] (429/984) iets source::lock::tests::declared_inputs_must_match_the_lock449 PASS [ 0.026s] (430/984) iets source::local::tests::only_a_content_addressed_store_path_names_its_content450 PASS [ 0.026s] (431/984) iets source::lock::tests::empty_lock_has_no_inputs451 PASS [ 0.029s] (432/984) iets source::lock::tests::complete_lock_passes452 PASS [ 0.024s] (433/984) iets source::lock::tests::incomplete_locks_fail453 PASS [ 0.021s] (434/984) iets source::remote::tests::a_leftover_is_not_a_valid_path454 PASS [ 0.022s] (435/984) iets source::remote::tests::download_urls_match_the_fetchers455 PASS [ 0.019s] (436/984) iets source::remote::tests::nix_literal_escapes456 PASS [ 0.024s] (437/984) iets source::scm::git::tests::a_directory_in_a_repository_is_found457 PASS [ 0.034s] (438/984) iets source::remote::tests::access_tokens_match_the_longest_prefix458 PASS [ 0.032s] (439/984) iets source::remote::tests::only_the_archive_types_are_fetched_by_iets459 PASS [ 0.040s] (440/984) iets source::scm::ledger::tests::a_directory_in_a_working_tree_is_found460 PASS [ 0.020s] (441/984) iets source::tests::dates461 PASS [ 0.051s] (442/984) iets source::scm::ledger::tests::a_name_resolves_to_a_revision_and_a_revision_has_a_tree462 PASS [ 0.072s] (443/984) iets source::scm::ledger::tests::an_untracked_file_is_the_error_of_nix463 PASS [ 0.029s] (444/984) iets store::drv::tests::an_env_key_named_json_is_refused464 PASS [ 0.034s] (445/984) iets store::drv::tests::a_dynamic_input_writes_the_versioned_aterm_and_parses_back465 PASS [ 0.014s] (446/984) iets store::drv::tests::fixed_output_from_scratch466 PASS [ 0.103s] (447/984) iets source::scm::ledger::tests::the_metadata_has_the_mark_of_its_tree467 PASS [ 0.104s] (448/984) iets source::scm::ledger::tests::the_count_is_lazy_and_kept_by_revision468 PASS [ 0.132s] (449/984) iets source::scm::ledger::tests::a_change_of_the_ledger_is_a_change_of_the_working_tree469 PASS [ 0.048s] (450/984) iets store::drv::tests::fixtures_roundtrip_byte_exact470 PASS [ 0.024s] (451/984) iets store::drv::tests::input_drvs_hash_modulo_from_scratch471 PASS [ 0.056s] (452/984) iets store::drv::tests::fixtures_output_paths_recompute472 PASS [ 0.028s] (453/984) iets store::drv::tests::input_addressed_multi_output_from_scratch473 PASS [ 0.024s] (454/984) iets store::drv::tests::masked_unparse_blanks_output_paths_and_env474 PASS [ 0.008s] (455/984) iets store::drv::tests::string_escapes_roundtrip475 PASS [ 0.063s] (456/984) iets store::drv::tests::fixtures_drv_path_matches_store_path476 PASS [ 0.015s] (457/984) iets store::drvdiff::tests::env_name_shows_only_when_it_is_not_the_derivation_name477 PASS [ 0.015s] (458/984) iets store::drvdiff::tests::json_names_what_differs478 PASS [ 0.023s] (459/984) iets store::drvdiff::tests::an_input_source_an_added_input_drv_and_a_fixed_output_show_up479 PASS [ 0.029s] (460/984) iets store::drvdiff::tests::a_changed_input_drv_is_paired_by_name_and_recursed_into480 PASS [ 0.021s] (461/984) iets store::drvdiff::tests::the_local_fields_the_env_and_an_absent_value481 PASS [ 0.018s] (462/984) iets store::hash::tests::base64_roundtrip482 PASS [ 0.013s] (463/984) iets store::hash::tests::empty_sha256483 PASS [ 0.023s] (464/984) iets store::drvdiff::tests::the_same_derivation_is_empty484 PASS [ 0.036s] (465/984) iets store::drvdiff::tests::the_depth_limit_names_the_input_without_walking_it485 PASS [ 0.023s] (466/984) iets store::hash::tests::compress_hash_xors486 PASS [ 0.014s] (467/984) iets store::hash::tests::sha256_nix32487 PASS [ 0.013s] (468/984) iets store::hash::tests::sha256_sri488 PASS [ 0.031s] (469/984) iets store::hash::tests::md5_nix32489 PASS [ 0.019s] (470/984) iets store::hash::tests::parse_any_all_formats490 PASS [ 0.024s] (471/984) iets store::hash::tests::sha1_nix32491 PASS [ 0.029s] (472/984) iets store::hash::tests::nix32_roundtrip_and_reject492 PASS [ 0.194s] (473/984) iets source::scm::ledger::tests::the_tracked_files_and_the_metadata_are_the_tree493 PASS [ 0.014s] (474/984) iets store::hash::tests::streaming_matches_oneshot494 PASS [ 0.015s] (475/984) iets store::nar::tests::directory_nar495 PASS [ 0.014s] (476/984) iets store::nar::tests::directory_nar_hash_formats496 PASS [ 0.025s] (477/984) iets store::hash::tests::sha512_nix32_base64497 PASS [ 0.014s] (478/984) iets store::nar::tests::regular_file_nar498 PASS [ 0.018s] (479/984) iets store::nar::tests::restore_rejects_garbage499 PASS [ 0.030s] (480/984) iets store::nar::tests::directory_nar_with_an_executable500 PASS [ 0.023s] (481/984) iets store::nar::tests::filter_sees_types_and_paths501 PASS [ 0.022s] (482/984) iets store::nar::tests::readers_refuse_what_nix_refuses502 PASS [ 0.035s] (483/984) iets store::nar::tests::executable_file_nar503 PASS [ 0.022s] (484/984) iets store::nar::tests::restore_roundtrip504 PASS [ 0.011s] (485/984) iets store::path::tests::a_multibyte_char_across_the_hash_part_is_an_error505 PASS [ 0.012s] (486/984) iets store::path::tests::check_name_rules506 PASS [ 0.020s] (487/984) iets store::nar::tests::script_nar507 PASS [ 0.021s] (488/984) iets store::nar::tests::symlink_nar508 PASS [ 0.019s] (489/984) iets store::path::tests::an_override_is_absolute_and_has_no_trailing_separator509 PASS [ 0.013s] (490/984) iets store::path::tests::fixed_flat_sha1510 PASS [ 0.010s] (491/984) iets store::path::tests::fixed_flat_sha256511 PASS [ 0.025s] (492/984) iets store::path::tests::filter_source512 PASS [ 0.032s] (493/984) iets store::path::tests::fixed_recursive_sha256513 PASS [ 0.016s] (494/984) iets store::path::tests::parse_and_accessors514 PASS [ 0.021s] (495/984) iets store::path::tests::output_names515 PASS [ 0.020s] (496/984) iets store::path::tests::path_copy_directory516 PASS [ 0.020s] (497/984) iets store::path::tests::placeholder517 PASS [ 0.026s] (498/984) iets store::path::tests::path_copy_file518 PASS [ 0.028s] (499/984) iets store::path::tests::path_with_name519 PASS [ 0.020s] (500/984) iets store::path::tests::the_host_picks_the_store_directory520 PASS [ 0.021s] (501/984) iets store::path::tests::the_directory_is_found_as_a_string_and_as_a_path521 PASS [ 0.017s] (502/984) iets syntax::tests::a_line_ends_at_cr_lf_and_lone_cr522 PASS [ 0.019s] (503/984) iets store::path::tests::to_file523 PASS [ 0.026s] (504/984) iets store::path::tests::to_file_with_reference524 PASS [ 0.021s] (505/984) iets syntax::tests::allow_comments525 PASS [ 0.023s] (506/984) iets syntax::tests::an_interpolated_name_is_static_when_nix_has_one_string_node526 PASS [ 0.033s] (507/984) iets syntax::tests::comments_and_misc527 PASS [ 0.028s] (508/984) iets syntax::tests::end_of_file_inside_a_path_is_at_its_last_token528 PASS [ 0.022s] (509/984) iets syntax::tests::json_gives_every_node_its_kind_and_span529 PASS [ 0.027s] (510/984) iets syntax::tests::indented_string_stripping530 PASS [ 0.040s] (511/984) iets syntax::tests::attrs_and_bindings531 PASS [ 0.019s] (512/984) iets syntax::tests::numbers532 PASS [ 0.027s] (513/984) iets syntax::tests::line_col_counts_bytes533 PASS [ 0.030s] (514/984) iets syntax::tests::nul_in_string_literals534 PASS [ 0.068s] (515/984) iets syntax::tests::lambdas535 PASS [ 0.043s] (516/984) iets syntax::tests::operator_precedence536 PASS [ 0.026s] (517/984) iets syntax::tests::spans_cover_tokens537 PASS [ 0.043s] (518/984) iets syntax::tests::paths538 PASS [ 0.036s] (519/984) iets syntax::tests::string_escapes_and_interpolation539 PASS [ 0.019s] (520/984) iets sys::winpath::tests::a_bare_drive_is_not_its_root540 PASS [ 0.023s] (521/984) iets sys::winpath::tests::a_drive_is_the_first_component541 PASS [ 0.023s] (522/984) iets sys::winpath::tests::a_relative_name_that_starts_with_unc_is_not_a_share542 PASS [ 0.024s] (523/984) iets sys::winpath::tests::a_leading_double_slash_is_not_a_share543 PASS [ 0.026s] (524/984) iets sys::winpath::tests::a_round_trip_is_stable544 PASS [ 0.047s] (525/984) iets syntax::tests::the_error_reported_is_the_one_nix_meets_first545 PASS [ 0.026s] (526/984) iets sys::winpath::tests::device_paths_are_not_shares_and_survive_a_round_trip546 PASS [ 0.019s] (527/984) iets sys::winpath::tests::forward_slashes_make_a_share_too547 PASS [ 0.018s] (528/984) iets sys::winpath::tests::mixed_separators_agree548 PASS [ 0.024s] (529/984) iets sys::winpath::tests::dot_dot_stops_at_the_anchor549 PASS [ 0.016s] (530/984) iets sys::winpath::tests::network_shares_sit_under_unc550 PASS [ 0.025s] (531/984) iets sys::winpath::tests::native_names_come_back551 PASS [ 0.018s] (532/984) iets sys::winpath::tests::relative_and_rooted_paths_only_change_separator552 PASS [ 0.022s] (533/984) iets sys::winpath::tests::the_evaluators_form_is_left_alone553 PASS [ 0.030s] (534/984) iets trace::store::tests::one_rename_publishes_every_part554 PASS [ 0.039s] (535/984) iets trace::store::tests::bytes_that_are_not_an_entry_are_bad_not_a_panic555 PASS [ 0.053s] (536/984) iets trace::key::tests::key_is_order_and_value_sensitive556 PASS [ 0.051s] (537/984) iets trace::key::tests::relative_path_detection557 PASS [ 0.048s] (538/984) iets trace::store::tests::a_reader_of_one_generation_never_sees_the_next558 PASS [ 1.372s] (539/984) iets lint::flake_cases::a_pre_existing_store_path_is_still_a_recopy559 PASS [ 0.022s] (540/984) iets trace::tests::dump_fingerprint_matches_the_separate_walk560 PASS [ 0.024s] (541/984) iets trace::tests::dedupe_keeps_conflicting_values561 PASS [ 0.020s] (542/984) iets trace::validate::dir_hash_tests::dir_hash_agrees_with_dir_listing_hash562 PASS [ 0.031s] (543/984) iets trace::tests::fingerprint_changes_with_content_size_and_seen_entries563 PASS [ 0.030s] (544/984) iets trace::tests::only_a_named_query_is_an_observation564 PASS [ 0.012s] (545/984) iets trace::validate::tests::a_resolved_path_validates_as_the_same565 PASS [ 0.021s] (546/984) iets trace::validate::tests::a_copy_in_place_that_keeps_the_stat_still_misses566 PASS [ 0.031s] (547/984) iets trace::validate::tests::dir_stat_env_checks567 PASS [ 0.020s] (548/984) iets trace::watch::tests::only_the_paths_an_mtime_can_speak_for568 PASS [ 0.033s] (549/984) iets trace::validate::tests::what_a_native_path_records_validates569 PASS [ 0.036s] (550/984) iets trace::validate::tests::file_touch_refreshes_edit_misses570 PASS [ 0.028s] (551/984) iets trace::wire::tests::drvs_sources_roots_roundtrip571 PASS [ 0.036s] (552/984) iets trace::wire::tests::readset_roundtrip572 PASS [ 0.047s] (553/984) iets treestore::pack::tests::a_pack_reads_back_what_was_written573 PASS [ 0.036s] (554/984) iets treestore::pack::tests::a_reader_sees_a_pack_written_after_it_listed574 PASS [ 0.031s] (555/984) iets treestore::pack::tests::a_set_finds_objects_across_packs_and_drops_a_broken_one575 PASS [ 0.050s] (556/984) iets treestore::pack::tests::an_empty_writer_leaves_no_file576 PASS [ 0.052s] (557/984) iets treestore::tests::a_flat_file_is_named_by_the_hash_of_its_bytes577 PASS [ 0.061s] (558/984) iets treestore::pack::tests::collect_removes_dead_packs_and_compacts_mostly_dead_ones578 PASS [ 0.037s] (559/984) iets treestore::tests::a_put_after_a_collection_brings_its_own_objects579 PASS [ 0.028s] (560/984) iets treestore::tests::a_staged_directory_goes_when_it_is_dropped580 PASS [ 0.019s] (561/984) iets treestore::tests::a_tree_is_named_by_its_nar_hash581 PASS [ 0.043s] (562/984) iets treestore::tests::a_stored_input_reads_back_and_a_wrong_hash_is_refused582 PASS [ 0.040s] (563/984) iets::aterm_crosscheck bytes_that_are_not_utf8_roundtrip583 PASS [ 0.212s] (564/984) iets treestore::pack::tests::a_changed_index_byte_is_not_a_pack584 PASS [ 0.016s] (565/984) iets::aterm_crosscheck fixed_output_inputs_hide_their_provenance585 PASS [ 0.013s] (566/984) iets::aterm_crosscheck fixed_output_path_is_recomputed_not_trusted586 PASS [ 0.083s] (567/984) iets treestore::tests::collect_keeps_what_an_entry_names587 PASS [ 0.071s] (568/984) iets treestore::tests::two_inputs_share_their_common_files588 PASS [ 0.304s] (569/984) iets trace::tests::dedupe_of_many_repeats_is_linear589 PASS [ 0.011s] (570/984) iets::aterm_crosscheck harmonia_cases_roundtrip590 PASS [ 0.019s] (571/984) iets::aterm_crosscheck floating_ca_defers_itself_and_downstream591 PASS [ 0.012s] (572/984) iets::aterm_crosscheck malformed_aterm_is_an_error592 PASS [ 0.283s] (573/984) iets trace::validate::tests::the_lowest_failing_observation_is_the_one_reported593 PASS [ 0.022s] (574/984) iets::aterm_crosscheck masked_and_unmasked_hashes_differ_once_filled594 PASS [ 0.016s] (575/984) iets::aterm_crosscheck upstream_bad_drvs_are_rejected595 PASS [ 0.013s] (576/984) iets::aterm_crosscheck upstream_input_addressed_paths_recompute596 PASS [ 0.017s] (577/984) iets::aterm_crosscheck upstream_bench_drvs_parse_and_reprint_stably597 PASS [ 0.028s] (578/984) iets::aterm_crosscheck upstream_invariants_ca_floating_dependency598 PASS [ 0.028s] (579/984) iets::aterm_crosscheck upstream_invariants_fill_in_deferred599 PASS [ 0.047s] (580/984) iets::aterm_crosscheck upstream_drvs_roundtrip_byte_exact600 PASS [ 0.041s] (581/984) iets::aterm_crosscheck upstream_invariants_input_addressed_kept_or_rejected601 PASS [ 2.131s] (582/984) iets fetch::http::tests::a_decompression_bomb_is_refused602 PASS [ 0.022s] (583/984) iets::cache_hygiene an_entry_that_is_not_a_plain_file_is_refused603 PASS [ 0.051s] (584/984) iets::cache_hygiene a_corrupt_entry_is_dropped_and_a_corrupt_store_is_wiped604 PASS [ 0.053s] (585/984) iets::cache_hygiene a_changed_byte_or_a_copied_entry_is_a_miss605 PASS [ 0.013s] (586/984) iets::cache_hygiene unix_only::a_link_or_a_fifo_is_not_an_entry606 PASS [ 0.027s] (587/984) iets::cache_hygiene input_touch_child607 PASS [ 0.033s] (588/984) iets::cache_hygiene unix_only::a_cache_is_private_to_its_owner608 PASS [ 1.355s] (589/984) iets parallel::thunk::tests::many_fibers_force_one_shared_graph609 PASS [ 0.071s] (590/984) iets::cache_hygiene an_input_observation_marks_its_entry_as_used610 PASS [ 0.134s] (591/984) iets::cache_hygiene cache_gc_removes_entries_past_the_ttl611 PASS [ 0.731s] (592/984) iets syntax::tests::lang_corpus612 PASS [ 0.372s] (593/984) iets::cache_semantics a_hit_prints_paths_and_positions_the_same613 PASS [ 0.466s] (594/984) iets::cache_hygiene concurrent_readers_and_writers_never_see_a_torn_entry614 PASS [ 0.458s] (595/984) iets::cache_semantics a_lint_warning_is_replayed_on_a_hit615 PASS [ 0.530s] (596/984) iets::cache_semantics a_copy_in_place_misses616 PASS [ 0.701s] (597/984) iets::cache_semantics a_pure_run_never_reads_an_impure_entry617 PASS [ 0.442s] (598/984) iets::cache_semantics the_cache_dir_keeps_what_it_did_not_make618 PASS [ 0.342s] (599/984) iets::cli a_bad_command_line_names_the_problem619 PASS [ 0.722s] (600/984) iets::cache_semantics the_file_argument_keeps_one_entry620 PASS [ 0.318s] (601/984) iets::cli build_evaluates_every_installable621 PASS [ 0.414s] (602/984) iets::cli build_cache_ignores_installable_order622 PASS [ 1.123s] (603/984) iets::cache_semantics search_uses_the_cache623 PASS [ 0.237s] (604/984) iets::cli completion_asks_the_binary_and_ignores_settings624 PASS [ 1.418s] (605/984) iets::cache_semantics a_flake_keeps_one_entry625 PASS [ 0.137s] (606/984) iets::cli eval_json_forces_without_strict626 PASS [ 0.083s] (607/984) iets::cli io_errors_read_like_strerror627 PASS [ 0.795s] (608/984) iets::cli a_flake_fragment_completes_to_the_outputs_attribute_names628 PASS [ 0.029s] (609/984) iets::diff an_unknown_flag_is_a_usage_error629 PASS [ 1.060s] (610/984) iets::cache_semantics uncacheable_runs_write_nothing630 PASS [ 0.212s] (611/984) iets::diff an_env_name_that_repeats_the_derivation_name_is_left_out631 PASS [ 0.168s] (612/984) iets::diff depth_zero_stops_at_the_input_derivation632 PASS [ 0.299s] (613/984) iets::cli help_and_version_go_to_stdout633 PASS [ 0.172s] (614/984) iets::diff equal_derivations_exit_0634 PASS [ 0.544s] (615/984) iets::cli dash_a_completes_the_attribute_names_under_its_root635 PASS [ 0.083s] (616/984) iets::diff one_side_is_a_usage_error636 PASS [ 0.533s] (617/984) iets::cli dash_f_names_the_file_in_the_native_namespace637 PASS [ 0.164s] (618/984) iets::diff the_json_object_names_the_same_differences638 PASS [ 2.018s] (619/984) iets::cache_semantics flags_that_turn_the_cache_off639 PASS [ 0.363s] (620/984) iets::diff the_text_names_the_env_the_source_and_the_input_drv640 PASS [ 0.384s] (621/984) iets::diff two_installables_are_one_evaluation_each641 FAIL [ 0.287s] (622/984) iets::e2e_build dry_run_over_a_tree642 stdout ---643644 running 1 test645 test dry_run_over_a_tree ... FAILED646647 failures:648649 failures:650 dry_run_over_a_tree651652 test result: FAILED. 0 passed; 1 failed; 0 ignored; 0 measured; 6 filtered out; finished in 0.27s653 654 stderr ---655656 thread 'dry_run_over_a_tree' (3919) panicked at tests/e2e_build.rs:215:5:657 error: nothing to build: the expression has no derivation in it658659 note: run with `RUST_BACKTRACE=1` environment variable to display a backtrace660661 Cancelling due to test failure: 15 tests still running662 PASS [ 0.667s] (623/984) iets::e2e_build a_build_log_cannot_forge_a_hash_mismatch663 PASS [ 0.356s] (624/984) iets::e2e_build no_build_uploads_every_installable664 FAIL [ 0.655s] (625/984) iets::e2e_build a_tree_builds_past_a_failure665 stdout ---666667 running 1 test668 test a_tree_builds_past_a_failure ... FAILED669670 failures:671672 failures:673 a_tree_builds_past_a_failure674675 test result: FAILED. 0 passed; 1 failed; 0 ignored; 0 measured; 6 filtered out; finished in 0.65s676 677 stderr ---678679 thread 'a_tree_builds_past_a_failure' (3908) panicked at tests/e2e_build.rs:110:5:680 assertion `left == right` failed: error: nothing to build: the expression has no derivation in it681682 left: Some(1)683 right: Some(100)684 note: run with `RUST_BACKTRACE=1` environment variable to display a backtrace685686 PASS [ 1.048s] (626/984) iets::diff dash_f_is_the_positional_file687 PASS [ 0.536s] (627/984) iets::e2e_build no_verdict_without_an_evaluation688 FAIL [ 0.727s] (628/984) iets::e2e_build one_root689 stdout ---690691 running 1 test692 test one_root ... FAILED693694 failures:695696 failures:697 one_root698699 test result: FAILED. 0 passed; 1 failed; 0 ignored; 0 measured; 6 filtered out; finished in 0.71s700 701 stderr ---702703 thread 'one_root' (4029) panicked at tests/e2e_build.rs:199:5:704 error: nothing to build: the expression has no derivation in it705706 note: run with `RUST_BACKTRACE=1` environment variable to display a backtrace707708 PASS [ 1.135s] (629/984) iets::e2e_build a_failure_in_a_dependency709 PASS [ 4.231s] (630/984) iets runtime::value::alloc_tests::a_full_string_table_records_no_more_but_still_shares710 PASS [ 6.892s] (631/984) iets api::run::tests::helper_fibers_read_the_ir_cache711 PASS [ 4.596s] (632/984) iets::cache_semantics hits_and_misses712 PASS [ 8.380s] (633/984) iets lint::fixtures::every_lint_fires_on_its_fixture_only_when_asked713 PASS [ 16.672s] (634/984) iets api::concurrent_eval::concurrent_eval_sums_arena_use_over_workers714 PASS [ 22.285s] (635/984) iets runtime::value::tests::union_iteration_merges_like_a_fold715 SLOW [> 60.000s] (-------) iets api::concurrent_eval::concurrent_eval_matches_sequential_eval716 SLOW [> 60.000s] (-------) iets syntax::tests::deep_nesting_ends_with_an_error717 PASS [ 60.961s] (636/984) iets syntax::tests::deep_nesting_ends_with_an_error718 SLOW [>120.000s] (-------) iets api::concurrent_eval::concurrent_eval_matches_sequential_eval719 SLOW [>180.000s] (-------) iets api::concurrent_eval::concurrent_eval_matches_sequential_eval720 SLOW [>240.000s] (-------) iets api::concurrent_eval::concurrent_eval_matches_sequential_eval721 SLOW [>300.000s] (-------) iets api::concurrent_eval::concurrent_eval_matches_sequential_eval722 SLOW [>360.000s] (-------) iets api::concurrent_eval::concurrent_eval_matches_sequential_eval723 PASS [ 375.355s] (637/984) iets api::concurrent_eval::concurrent_eval_matches_sequential_eval724------------725 Summary [ 375.358s] 637/984 tests run: 634 passed (2 slow), 3 failed, 6 skipped726 FAIL [ 0.287s] (622/984) iets::e2e_build dry_run_over_a_tree727 FAIL [ 0.655s] (625/984) iets::e2e_build a_tree_builds_past_a_failure728 FAIL [ 0.727s] (628/984) iets::e2e_build one_root729warning: 347/984 tests were not run due to test failure (run with --no-fail-fast to run all tests, or run with --max-fail)730error: test run failed