iets-nextest-0.1.0
checks.aarch64-linux.nixpkgs-eval
· build #442
· raw
1elastic-arm-5be5d98b: building 3inhix95n08zvgn5wkf3q43zdpgw001x-iets-nextest-0.1.0.drv
unpackPhase
2unpacking source archive /nix/store/fd9g8sqbh373fk8cgc88bfv4lf0wi1w3-source3source root is sourcepatchPhase
4Executing configureCargoCommonVars5decompressing cargo artifacts from /nix/store/l64jzs86iclv4cvkyqrr3ahyrzkkndba-iets-deps-0.1.0/target.tar.zst to targetconfigurePhase
6will append /build/source/.cargo-home/config.toml with contents of /nix/store/xxq0blv9rwlynz621b9rcxrpnkm5if8f-vendor-cargo-deps/config.toml7default configurePhase, nothing to dobuildPhase
8+++ command cargo --version9cargo 1.98.0 (797e8a9bc 2026-08-05)10+++ command cargo nextest --version11cargo-nextest 0.9.14612release: 0.9.14613host: aarch64-unknown-linux-gnucheckPhase
14+++ command cargo nextest run --cargo-profile release --run-ignored only -E 'binary(nixpkgs_eval)'15 Compiling iets v0.1.0 (/build/source)16 Finished `release` profile [optimized + debuginfo] target(s) in 10m 42s17------------18 Nextest run ID f023a684-93d0-4f50-8f99-1284ef203c05 with nextest profile: default19 Starting 1 test across 1 binary (22 binaries skipped)20 FAIL [ 0.193s] (1/1) iets::nixpkgs_eval nixpkgs_drvs_match_nix21 stdout ---2223 running 1 test24 test nixpkgs_drvs_match_nix ... FAILED2526 failures:2728 failures:29 nixpkgs_drvs_match_nix3031 test result: FAILED. 0 passed; 1 failed; 0 ignored; 0 measured; 0 filtered out; finished in 0.18s32 33 stderr ---3435 thread 'nixpkgs_drvs_match_nix' (1090) panicked at tests/nixpkgs_eval.rs:27:5:36 env -u NIX_CONFIG NIX_CONF_DIR="/nonexistent" NIX_USER_CONF_FILES="" "/nix/store/q9i0sg55vl1nb8xxg33q1ziml4qxgr0r-nix-eval-jobs-2.35.4/bin/nix-eval-jobs" "--store" "dummy://?read-only=false" "--impure" "--no-instantiate" "--workers" "4" "--arg" "nixpkgs" "/nix/store/61zfbhpgh5k6a8708l6mcap1kjbs3mz7-r5l65vg4gi4dnx54zkwagfb8jmlqniy5-source" "--arg" "limit" "null" "/build/source/tests/nixpkgs_eval.nix": error: creating directory "/homeless-shelter/.cache/nix": Permission denied3738 note: run with `RUST_BACKTRACE=1` environment variable to display a backtrace3940 Cancelling due to test failure: 41------------42 Summary [ 0.196s] 1 test run: 0 passed, 1 failed, 0 skipped43 FAIL [ 0.193s] (1/1) iets::nixpkgs_eval nixpkgs_drvs_match_nix44error: test run failed