nixbot

builds

cancelled checks.x86_64-linux.classic-e2e build #192 · raw · eval 3.1 s · 473.1 MiB allocated · ·

1these 5 derivations will be built:2  /nix/store/gqnlsvmgwbyxx7mb3zbj3952z712gw8d-closure-info.drv3  /nix/store/aj721kn5i45fkjzsdwaxbc94bv5mdn9s-test-script.drv4  /nix/store/ja008clgsn5fnma3yx9z6sdwyyd8sgyv-driverConfiguration.json.drv5  /nix/store/9ribhqkdzlwcgz9pv94n8l24746hjy8m-nixos-test-driver-iets-classic-e2e.drv6  /nix/store/8g8djvw754lhmiwhaw46cidc5qry207z-container-test-run-iets-classic-e2e.drv7building '/nix/store/gqnlsvmgwbyxx7mb3zbj3952z712gw8d-closure-info.drv'8closure-info> structuredAttrs is enabled9building '/nix/store/aj721kn5i45fkjzsdwaxbc94bv5mdn9s-test-script.drv'10test-script> structuredAttrs is enabled11building '/nix/store/ja008clgsn5fnma3yx9z6sdwyyd8sgyv-driverConfiguration.json.drv'12driverConfiguration.json> structuredAttrs is enabled13building '/nix/store/9ribhqkdzlwcgz9pv94n8l24746hjy8m-nixos-test-driver-iets-classic-e2e.drv'14nixos-test-driver-iets-classic-e2e> Running type check (enable/disable: config.skipTypeCheck)15nixos-test-driver-iets-classic-e2e> See https://nixos.org/manual/nixos/stable/#test-opt-skipTypeCheck16nixos-test-driver-iets-classic-e2e> All checks passed!17nixos-test-driver-iets-classic-e2e> Linting test script (enable/disable: config.skipLint)18nixos-test-driver-iets-classic-e2e> See https://nixos.org/manual/nixos/stable/#test-opt-skipLint19nixos-test-driver-iets-classic-e2e> All checks passed!20building '/nix/store/8g8djvw754lhmiwhaw46cidc5qry207z-container-test-run-iets-classic-e2e.drv'21container-test-run-iets-classic-e2e> Machine state will be reset. To keep it, pass --keep-machine-state22container-test-run-iets-classic-e2e> start all VLans23container-test-run-iets-classic-e2e> (finished: start all VLans, in 0.01 seconds)24container-test-run-iets-classic-e2e> 25container-test-run-iets-classic-e2e> Test will time out and terminate in 3600.0 seconds26container-test-run-iets-classic-e2e> run the VM test script27container-test-run-iets-classic-e2e> additionally exposed symbols:28container-test-run-iets-classic-e2e>     machine,29container-test-run-iets-classic-e2e>     vlan1,30container-test-run-iets-classic-e2e>     start_all, test_script, machines, machines_qemu, machines_nspawn, vlans, driver, log, os, create_machine, subtest, run_tests, join_all, retry, serial_stdout_off, serial_stdout_on, polling_condition, BaseMachine, QemuMachine, NspawnMachine, t, debug, dump_machine_ssh31container-test-run-iets-classic-e2e> machine: waiting for unit multi-user.target32container-test-run-iets-classic-e2e> machine: systemd-nspawn running (pid 50)33container-test-run-iets-classic-e2e> machine: Waiting for journal at /build/vm-state-machine/var/log/journal...34container-test-run-iets-classic-e2e> nixos-nspawn(machine): TAP vde-tap1 not found; container will be isolated from VDE35container-test-run-iets-classic-e2e> nixos-nspawn(machine): A common reason for this is that /dev/net is not available in the Nix sandbox. Try adding /dev/net to extra-sandbox-paths.36container-test-run-iets-classic-e2e> Note: in a future version of systemd-nspawn the default set of permitted socket address families will be restricted to AF_INET, AF_INET6 and AF_UNIX. Use --restrict-address-families= to configure the set of permitted socket address families, or set RestrictAddressFamilies= in a .nspawn file.37container-test-run-iets-classic-e2e> ░ Spawning container machine on /build/vm-state-machine.38container-test-run-iets-classic-e2e> machine # No journal files were found.39container-test-run-iets-classic-e2e> machine # No journal boot entry found for the specified boot (+0).40container-test-run-iets-classic-e2e> machine # [1634024.095623] machine systemd-journald[57]: Journal started41container-test-run-iets-classic-e2e> machine # [1634024.095679] machine systemd-journald[57]: Runtime Journal (/run/log/journal/0751978452f8482f9a031805255b0732) is 8M, max 2.5G, 2.5G free.42container-test-run-iets-classic-e2e> machine # [1634024.135480] machine systemd[1]: Listening on Journal Log Access Socket.43container-test-run-iets-classic-e2e> machine # [1634024.136541] machine systemd[1]: Finished Apply Kernel Variables.44container-test-run-iets-classic-e2e> machine # [1634024.158144] machine systemd[1]: Finished Create Static Device Nodes in /dev gracefully.45container-test-run-iets-classic-e2e> machine # [1634024.190849] machine systemd[1]: Starting Flush Journal to Persistent Storage...46container-test-run-iets-classic-e2e> machine # [1634024.191751] machine systemd[1]: Starting Create Static Device Nodes in /dev...47container-test-run-iets-classic-e2e> machine # [1634024.218051] machine systemd-journald[57]: Time spent on flushing to /var/log/journal/0751978452f8482f9a031805255b0732 is 1.464ms for 7 entries.48container-test-run-iets-classic-e2e> machine # [1634024.218051] machine systemd-journald[57]: System Journal (/var/log/journal/0751978452f8482f9a031805255b0732) is 512B, max 4G, 3.9G free.49container-test-run-iets-classic-e2e> machine # [1634024.233445] machine systemd[1]: Finished Create Static Device Nodes in /dev.50container-test-run-iets-classic-e2e> machine # [1634024.234493] machine systemd[1]: Reached target Preparation for Local File Systems.51container-test-run-iets-classic-e2e> machine # [1634024.234640] machine systemd[1]: Rule-based Manager for Device Events and Files skipped, unmet condition check ConditionPathIsReadWrite=/sys52container-test-run-iets-classic-e2e> machine # [1634024.239483] machine systemd[1]: Finished Flush Journal to Persistent Storage.53container-test-run-iets-classic-e2e> machine # [1634024.320868] machine systemd[1]: Finished Firewall.54container-test-run-iets-classic-e2e> machine # [1634025.106833] machine systemd[1]: Mounting /run/wrappers...55container-test-run-iets-classic-e2e> machine # [1634025.151205] machine systemd[1]: Mounted /run/wrappers.56container-test-run-iets-classic-e2e> machine # [1634025.153637] machine systemd[1]: Reached target Local File Systems.57container-test-run-iets-classic-e2e> machine # [1634025.154678] machine systemd[1]: Listening on Boot Loader Control Service Socket.58container-test-run-iets-classic-e2e> machine # [1634025.156322] machine systemd[1]: Starting Create SUID/SGID Wrappers...59container-test-run-iets-classic-e2e> machine # [1634025.156355] machine systemd[1]: Update Boot Loader Random Seed skipped, unmet condition check ConditionVirtualization=!container60container-test-run-iets-classic-e2e> machine # [1634025.159105] machine systemd[1]: Starting Save Transient machine-id to Disk...61container-test-run-iets-classic-e2e> machine # [1634025.159943] machine systemd[1]: Starting Create System Files and Directories...62container-test-run-iets-classic-e2e> machine # [1634025.175034] machine systemd-tmpfiles[161]: Cannot set file attributes for '/var/empty', value=0x00000010, mask=0x00000010, ignoring: Operation not permitted63container-test-run-iets-classic-e2e> machine # [1634025.175844] machine systemd-tmpfiles[161]: fchmod() of /var/log/journal failed: Operation not permitted64container-test-run-iets-classic-e2e> machine # [1634025.175978] machine systemd-tmpfiles[161]: fchmod() of /var/log/journal/0751978452f8482f9a031805255b0732 failed: Operation not permitted65container-test-run-iets-classic-e2e> machine # [1634025.176158] machine systemd-tmpfiles[161]: fchmod() of /run/log/journal failed: Operation not permitted66container-test-run-iets-classic-e2e> machine # [1634025.195125] machine suid-sgid-wrappers-start[168]: chmod: changing permissions of '/run/wrappers/wrappers.27iT9x2Nak/chsh': Operation not permitted67container-test-run-iets-classic-e2e> machine # [1634025.198189] machine systemd[1]: Finished Create System Files and Directories.68container-test-run-iets-classic-e2e> machine # [1634025.226126] machine systemd[1]: suid-sgid-wrappers.service: Main process exited, code=exited, status=1/FAILURE69container-test-run-iets-classic-e2e> machine # [1634025.226226] machine systemd[1]: suid-sgid-wrappers.service: Failed with result 'exit-code'.70container-test-run-iets-classic-e2e> machine # [1634025.226401] machine systemd[1]: Failed to start Create SUID/SGID Wrappers.71container-test-run-iets-classic-e2e> machine # [1634025.233154] machine systemd[1]: Starting Rebuild Journal Catalog...72container-test-run-iets-classic-e2e> machine # [1634025.237130] machine systemd[1]: Starting Record System Boot/Shutdown in UTMP...73container-test-run-iets-classic-e2e> machine # [1634025.290252] machine systemd[1]: Finished Record System Boot/Shutdown in UTMP.74container-test-run-iets-classic-e2e> machine # [1634025.321500] machine systemd[1]: Finished Rebuild Journal Catalog.75container-test-run-iets-classic-e2e> machine # [1634025.325775] machine systemd[1]: Starting Update is Completed...76container-test-run-iets-classic-e2e> machine # [1634025.361357] machine systemd[1]: Finished Update is Completed.77container-test-run-iets-classic-e2e> machine # [1634025.361958] machine systemd[1]: Reached target System Initialization.78container-test-run-iets-classic-e2e> machine # [1634025.362102] machine systemd[1]: Discard unused filesystem blocks once a week skipped, unmet condition check ConditionVirtualization=!container79container-test-run-iets-classic-e2e> machine # [1634025.362138] machine systemd[1]: Started Daily Cleanup of Temporary Directories.80container-test-run-iets-classic-e2e> machine # [1634025.362161] machine systemd[1]: Reached target Timer Units.81container-test-run-iets-classic-e2e> machine # [1634025.362299] machine systemd[1]: Listening on D-Bus System Message Bus Socket.82container-test-run-iets-classic-e2e> machine # [1634025.362636] machine systemd[1]: Listening on Virtual Machine and Container Registration Service Socket.83container-test-run-iets-classic-e2e> machine # [1634025.362667] machine systemd[1]: Reached target Socket Units.84container-test-run-iets-classic-e2e> machine # [1634025.362702] machine systemd[1]: Reached target Basic System.85container-test-run-iets-classic-e2e> machine # [1634025.363973] machine systemd[1]: Starting Import lastlog data into lastlog2 database...86container-test-run-iets-classic-e2e> machine # [1634025.366728] machine systemd[1]: Starting Name Service Cache Daemon (nsncd)...87container-test-run-iets-classic-e2e> machine # [1634025.370131] machine systemd[1]: Starting resolvconf update...88container-test-run-iets-classic-e2e> machine # [1634025.403928] machine systemd[1]: Finished Import lastlog data into lastlog2 database.89container-test-run-iets-classic-e2e> machine # [1634025.459666] machine systemd[1]: nscd.service: Deactivated successfully.90container-test-run-iets-classic-e2e> machine # [1634025.460031] machine systemd[1]: Stopped Name Service Cache Daemon (nsncd).91container-test-run-iets-classic-e2e> machine # [1634025.462562] machine systemd[1]: Starting Name Service Cache Daemon (nsncd)...92container-test-run-iets-classic-e2e> machine # [1634025.479422] machine resolvconf-start[234]: setfacl: /run/resolvconf: Operation not supported93container-test-run-iets-classic-e2e> machine # [1634025.483938] machine systemd[1]: resolvconf.service: Main process exited, code=exited, status=1/FAILURE94container-test-run-iets-classic-e2e> machine # [1634025.484050] machine systemd[1]: resolvconf.service: Failed with result 'exit-code'.95container-test-run-iets-classic-e2e> machine # [1634025.495949] machine systemd[1]: Failed to start resolvconf update.96container-test-run-iets-classic-e2e> machine # [1634025.496318] machine systemd[1]: Reached target Preparation for Network.97container-test-run-iets-classic-e2e> machine # [1634025.497411] machine systemd[1]: Starting Address configuration of eth1...98container-test-run-iets-classic-e2e> machine # [1634025.498346] machine systemd[1]: Starting Extra networking commands....99container-test-run-iets-classic-e2e> machine # [1634025.523561] machine network-addresses-eth1-start[237]: adding address 192.168.1.1/24... done100container-test-run-iets-classic-e2e> machine # [1634025.526856] machine network-addresses-eth1-start[237]: adding address 2001:db8:1::1/64... done101container-test-run-iets-classic-e2e> machine # [1634025.531324] machine systemd[1]: Finished Address configuration of eth1.102container-test-run-iets-classic-e2e> machine # [1634025.568021] machine systemd[1]: Finished Extra networking commands..103container-test-run-iets-classic-e2e> machine # [1634025.568189] machine systemd[1]: Reached target Network.104container-test-run-iets-classic-e2e> machine # [1634025.674372] machine systemd[1]: etc-machine\x2did.mount: Deactivated successfully.105container-test-run-iets-classic-e2e> machine # [1634025.675709] machine systemd[1]: Finished Save Transient machine-id to Disk.106container-test-run-iets-classic-e2e> machine # [1634025.771111] machine nsncd[224]: Oct 13 20:53:16.501 INFO started, config: Config { ignored_request_types: {}, worker_count: 8, handoff_timeout: 10s }, path: "/var/run/nscd/socket"107container-test-run-iets-classic-e2e> machine # [1634025.771375] machine systemd[1]: Started Name Service Cache Daemon (nsncd).108container-test-run-iets-classic-e2e> machine # [1634025.771475] machine systemd[1]: Reached target Host and Network Name Lookups.109container-test-run-iets-classic-e2e> machine # [1634025.771542] machine systemd[1]: Reached target User and Group Name Lookups.110container-test-run-iets-classic-e2e> machine # [1634025.772998] machine systemd[1]: Starting User Login Management...111container-test-run-iets-classic-e2e> machine # [1634025.774015] machine systemd[1]: Starting Permit User Sessions...112container-test-run-iets-classic-e2e> machine # [1634025.836252] machine systemd[1]: Finished Permit User Sessions.113container-test-run-iets-classic-e2e> machine # [1634025.838287] machine systemd[1]: Started Console Getty.114container-test-run-iets-classic-e2e> machine # [1634025.838360] machine systemd[1]: Getty on tty1 skipped, unmet condition check ConditionPathExists=/dev/tty0115container-test-run-iets-classic-e2e> machine # [1634025.838385] machine systemd[1]: Reached target Login Prompts.116container-test-run-iets-classic-e2e> machine # [1634027.486848] machine systemd-logind[306]: New seat seat0.117container-test-run-iets-classic-e2e> machine # [1634027.487799] machine systemd[1]: Starting D-Bus System Message Bus...118container-test-run-iets-classic-e2e> machine # [1634027.487904] machine systemd[1]: Started User Login Management.119container-test-run-iets-classic-e2e> machine # [1634027.488795] machine systemd[1]: Starting linger-users.service...120container-test-run-iets-classic-e2e> machine # [1634027.535784] machine systemd[1]: linger-users.service: Deactivated successfully.121container-test-run-iets-classic-e2e> machine # [1634027.536183] machine systemd[1]: Finished linger-users.service.122container-test-run-iets-classic-e2e> machine # [1634027.536385] machine systemd[1]: Reached target Multi-User System.123container-test-run-iets-classic-e2e> machine: (finished: waiting for unit multi-user.target, in 5.67 seconds)124container-test-run-iets-classic-e2e> machine: must succeed: /nix/store/hbyzr3c9k3n51a3zyb3h74dqi8a2n1p5-writable-store /nix/store/hrqpqbh7lmmb8jnys1bb095bsvlgqa0n-closure-info125container-test-run-iets-classic-e2e> machine # [1634027.987356] machine dbus-broker-launch[316]: Looking up NSS user entry for 'systemd-timesync'...126container-test-run-iets-classic-e2e> machine # [1634027.990080] machine dbus-broker-launch[316]: NSS returned no entry for 'systemd-timesync'127container-test-run-iets-classic-e2e> machine # [1634027.990080] machine dbus-broker-launch[316]: Invalid user-name in /nix/store/z441alblwy32lyxiy8466qf85iyi2sdj-system-path/share/dbus-1/system.d/org.freedesktop.timesync1.conf +16: user="systemd-timesync"128container-test-run-iets-classic-e2e> machine # [1634027.990669] machine systemd[1]: Started D-Bus System Message Bus.129container-test-run-iets-classic-e2e> machine # [1634027.991048] machine systemd[1]: Startup finished in 4.487s.130container-test-run-iets-classic-e2e> machine # [1634027.999111] machine dbus-broker-launch[316]: Ready131container-test-run-iets-classic-e2e> warning: '--json' without '--json-format' is deprecated; please specify '--json-format 1' or '--json-format 2'. This will become an error in a future release.132container-test-run-iets-classic-e2e> machine: (finished: must succeed: /nix/store/hbyzr3c9k3n51a3zyb3h74dqi8a2n1p5-writable-store /nix/store/hrqpqbh7lmmb8jnys1bb095bsvlgqa0n-closure-info, in 15.62 seconds)133container-test-run-iets-classic-e2e> machine: must succeed: systemctl start nix-daemon.socket134container-test-run-iets-classic-e2e> machine: (finished: must succeed: systemctl start nix-daemon.socket, in 0.02 seconds)135container-test-run-iets-classic-e2e> machine: must succeed: /nix/store/cgg4r9lrvb6gcsr7ffpvi9ka3xkldmk9-leftovers136container-test-run-iets-classic-e2e> machine: (finished: must succeed: /nix/store/cgg4r9lrvb6gcsr7ffpvi9ka3xkldmk9-leftovers, in 0.20 seconds)137container-test-run-iets-classic-e2e> machine: must succeed: cp -r /nix/store/4yx3kizg4nw8pwjzyx6qy2a0bm8pmhyl-source /home/alice/iets && chmod -R u+w /home/alice/iets && chown -R alice /home/alice/iets138container-test-run-iets-classic-e2e> machine: (finished: must succeed: cp -r /nix/store/4yx3kizg4nw8pwjzyx6qy2a0bm8pmhyl-source /home/alice/iets && chmod -R u+w /home/alice/iets && chown -R alice /home/alice/iets, in 0.16 seconds)139container-test-run-iets-classic-e2e> machine: must succeed: runuser -l alice -c 'cd iets && git init -q && git add -A && git -c user.name=e2e -c user.email=e2e@example.com commit -q -m e2e'140container-test-run-iets-classic-e2e> machine # [1634043.938920] machine systemd[1]: Listening on Nix Daemon Socket.141container-test-run-iets-classic-e2e> machine: (finished: must succeed: runuser -l alice -c 'cd iets && git init -q && git add -A && git -c user.name=e2e -c user.email=e2e@example.com commit -q -m e2e', in 0.24 seconds)142container-test-run-iets-classic-e2e> machine: must succeed: runuser -l alice -c 'cd iets && IETS=/nix/store/sd8kf88fmxl9i003vcr3vv48d8ps5im0-iets-0.1.0/bin/iets NIXPKGS=/nix/store/hhfnpma32czw4h3bqpag8dciax0bcmar-source E2E_OFFLINE=1   nu scripts/classic-e2e.nu' >&2143container-test-run-iets-classic-e2e> machine # [1634044.314553] machine runuser[4978]: pam_unix(runuser-l:session): session opened for user alice(uid=1000) by (uid=0)144container-test-run-iets-classic-e2e> machine # [1634044.539210] machine runuser[4978]: pam_unix(runuser-l:session): session closed for user alice145container-test-run-iets-classic-e2e> machine # [1634044.575347] machine runuser[4991]: pam_unix(runuser-l:session): session opened for user alice(uid=1000) by (uid=0)146container-test-run-iets-classic-e2e> real nix: /nix/store/6ph2h5b0v19yihxr0id244wh83whwasq-nix-2.34.8/bin147container-test-run-iets-classic-e2e> ok   builtins --impure []: the same names nix has148container-test-run-iets-classic-e2e> ok   builtins --impure [dynamic-derivations]: the same names nix has149container-test-run-iets-classic-e2e> ok   builtins --impure [dynamic-derivations fetch-closure fetch-tree]: the same names nix has150container-test-run-iets-classic-e2e> ok   builtins --pure-eval []: the same names nix has151container-test-run-iets-classic-e2e> ok   builtins --pure-eval [dynamic-derivations]: the same names nix has152container-test-run-iets-classic-e2e> ok   builtins --pure-eval [dynamic-derivations fetch-closure fetch-tree]: the same names nix has153container-test-run-iets-classic-e2e> machine # [1634052.518889] machine systemd[1]: Started Nix Daemon.154container-test-run-iets-classic-e2e> machine # [1634052.576612] machine nix-daemon[5312]: accepted connection from pid 5305, user alice (trusted)155container-test-run-iets-classic-e2e> ok   instantiate <nixpkgs> -A hello156container-test-run-iets-classic-e2e> machine # [1634053.314480] machine nix-daemon[5312]: accepted connection from pid 5429, user alice (trusted)157container-test-run-iets-classic-e2e> machine # [1634055.084314] machine nix-daemon[5312]: accepted connection from pid 5450, user alice (trusted)158container-test-run-iets-classic-e2e> ok   instantiate <nixpkgs> -A glibc (multi-output)159container-test-run-iets-classic-e2e> machine # [1634055.374257] machine nix-daemon[5312]: accepted connection from pid 5461, user alice (trusted)160container-test-run-iets-classic-e2e> machine # [1634056.981559] machine nix-daemon[5312]: accepted connection from pid 5482, user alice (trusted)161container-test-run-iets-classic-e2e> ok   instantiate <nixpkgs> -A glibc.dev (!output suffix)162container-test-run-iets-classic-e2e> machine # [1634057.242863] machine nix-daemon[5312]: accepted connection from pid 5493, user alice (trusted)163container-test-run-iets-classic-e2e> machine # [1634059.266238] machine nix-daemon[5312]: accepted connection from pid 5514, user alice (trusted)164container-test-run-iets-classic-e2e> machine # [1634059.538586] machine nix-daemon[5312]: accepted connection from pid 5525, user alice (trusted)165container-test-run-iets-classic-e2e> ok   instantiate two -A in one run166container-test-run-iets-classic-e2e> machine # [1634061.619566] machine nix-daemon[5312]: accepted connection from pid 5546, user alice (trusted)167container-test-run-iets-classic-e2e> machine # [1634061.976680] machine nix-daemon[5312]: accepted connection from pid 5557, user alice (trusted)168container-test-run-iets-classic-e2e> ok   instantiate two -A that name one derivation169container-test-run-iets-classic-e2e> machine # [1634063.506913] machine nix-daemon[5312]: accepted connection from pid 5578, user alice (trusted)170container-test-run-iets-classic-e2e> machine # [1634063.783703] machine nix-daemon[5312]: accepted connection from pid 5589, user alice (trusted)171container-test-run-iets-classic-e2e> ok   instantiate --add-root ''172container-test-run-iets-classic-e2e> ok   instantiate --eval --strict --json173container-test-run-iets-classic-e2e> ok   instantiate --eval174container-test-run-iets-classic-e2e> ok   instantiate --eval --raw175container-test-run-iets-classic-e2e> ok   instantiate --eval --raw a path176container-test-run-iets-classic-e2e> ok   instantiate --eval --raw an outPath177container-test-run-iets-classic-e2e> ok   instantiate --eval, one --arg name twice178container-test-run-iets-classic-e2e> ok   instantiate --eval, --arg then --argstr of one name179container-test-run-iets-classic-e2e> ok   instantiate --eval, a later expression throws180container-test-run-iets-classic-e2e> ok   instantiate --eval --argstr181container-test-run-iets-classic-e2e> ok   instantiate a custom drv182container-test-run-iets-classic-e2e> machine # [1634070.658311] machine nix-daemon[5312]: accepted connection from pid 5844, user alice (trusted)183container-test-run-iets-classic-e2e> machine # [1634070.866564] machine nix-daemon[5312]: accepted connection from pid 5856, user alice (trusted)184container-test-run-iets-classic-e2e> ok   drv closure follows the references of a toFile185container-test-run-iets-classic-e2e> ok   instantiate builtins.outputOf, once and nested186container-test-run-iets-classic-e2e> machine # [1634071.261908] machine nix-daemon[5312]: accepted connection from pid 5877, user alice (trusted)187container-test-run-iets-classic-e2e> machine # [1634071.325958] machine nix-daemon[5312]: accepted connection from pid 5892, user alice (trusted)188container-test-run-iets-classic-e2e> machine # [1634071.416220] machine nix-daemon[5312]: accepted connection from pid 5913, user alice (trusted)189container-test-run-iets-classic-e2e> machine # [1634071.470566] machine nix-daemon[5312]: accepted connection from pid 5935, user alice (trusted)190container-test-run-iets-classic-e2e> machine # [1634071.525333] machine nix-daemon[5312]: accepted connection from pid 5956, user alice (trusted)191container-test-run-iets-classic-e2e> ok   eval builtins.outputOf placeholders192container-test-run-iets-classic-e2e> ok   two consumers of one dynamic producer stay apart193container-test-run-iets-classic-e2e> machine # [1634071.581831] machine nix-daemon[5312]: accepted connection from pid 5978, user alice (trusted)194container-test-run-iets-classic-e2e> machine # [1634071.644297] machine nix-daemon[5312]: accepted connection from pid 5999, user alice (trusted)195container-test-run-iets-classic-e2e> machine # [1634071.704252] machine nix-daemon[5312]: accepted connection from pid 6021, user alice (trusted)196container-test-run-iets-classic-e2e> ok   instantiate --readonly-mode197container-test-run-iets-classic-e2e> machine # [1634072.291900] machine nix-daemon[5312]: accepted connection from pid 6068, user alice (trusted)198container-test-run-iets-classic-e2e> machine # [1634072.350880] machine nix-daemon[5312]: accepted connection from pid 6091, user alice (trusted)199container-test-run-iets-classic-e2e> ok   --add-root links and registers a gc root200container-test-run-iets-classic-e2e> machine # [1634073.253787] machine nix-daemon[5312]: accepted connection from pid 6112, user alice (trusted)201container-test-run-iets-classic-e2e> machine # [1634073.320463] machine nix-daemon[5312]: accepted connection from pid 6125, user alice (trusted)202container-test-run-iets-classic-e2e> machine # [1634073.384205] machine nix-daemon[5312]: accepted connection from pid 6146, user alice (trusted)203container-test-run-iets-classic-e2e> machine # [1634074.423239] machine nix-daemon[5312]: accepted connection from pid 6196, user alice (trusted)204container-test-run-iets-classic-e2e> machine # [1634074.564869] machine nix-daemon[5312]: accepted connection from pid 6237, user alice (trusted)205container-test-run-iets-classic-e2e> machine # [1634075.839755] machine nix-daemon[5312]: accepted connection from pid 6287, user alice (trusted)206container-test-run-iets-classic-e2e> machine # [1634076.102608] machine nix-daemon[5312]: accepted connection from pid 6330, user alice (trusted)207container-test-run-iets-classic-e2e> machine # [1634076.668117] machine nix-daemon[5312]: accepted connection from pid 6382, user alice (trusted)208container-test-run-iets-classic-e2e> machine # [1634076.972559] machine nix-daemon[5312]: accepted connection from pid 6425, user alice (trusted)209container-test-run-iets-classic-e2e> ok   -o over an existing path acts as Nix does210container-test-run-iets-classic-e2e> machine # [1634077.462974] machine nix-daemon[5312]: accepted connection from pid 6477, user alice (trusted)211container-test-run-iets-classic-e2e> machine # [1634077.746526] machine nix-daemon[5312]: accepted connection from pid 6518, user alice (trusted)212container-test-run-iets-classic-e2e> ok   build a custom drv, default result213container-test-run-iets-classic-e2e> machine # [1634078.031199] machine nix-daemon[5312]: accepted connection from pid 6562, user alice (trusted)214container-test-run-iets-classic-e2e> machine # [1634078.306701] machine nix-daemon[5312]: accepted connection from pid 6597, user alice (trusted)215container-test-run-iets-classic-e2e> ok   build -o link216container-test-run-iets-classic-e2e> machine # [1634078.736466] machine nix-daemon[5312]: accepted connection from pid 6641, user alice (trusted)217container-test-run-iets-classic-e2e> machine # [1634078.922814] machine nix-daemon[5312]: accepted connection from pid 6676, user alice (trusted)218container-test-run-iets-classic-e2e> ok   build --no-out-link219container-test-run-iets-classic-e2e> machine # [1634079.130838] machine nix-daemon[5312]: accepted connection from pid 6720, user alice (trusted)220container-test-run-iets-classic-e2e> machine # [1634079.384767] machine nix-daemon[5312]: accepted connection from pid 6755, user alice (trusted)221container-test-run-iets-classic-e2e> ok   build two outputs of one drv222container-test-run-iets-classic-e2e> machine # [1634080.719853] machine nix-daemon[5312]: accepted connection from pid 6807, user alice (trusted)223container-test-run-iets-classic-e2e> machine # [1634080.800713] machine nix-daemon[5312]: accepted connection from pid 6823, user alice (trusted)224container-test-run-iets-classic-e2e> ok   build two drvs225container-test-run-iets-classic-e2e> machine # [1634081.442419] machine nix-daemon[5312]: accepted connection from pid 6872, user alice (trusted)226container-test-run-iets-classic-e2e> ok   builder = unix://SCRATCH builds there and registers here227container-test-run-iets-classic-e2e> machine # [1634082.145912] machine nix-daemon[5312]: accepted connection from pid 6930, user alice (trusted)228container-test-run-iets-classic-e2e> machine # [1634082.250182] machine nix-daemon[5312]: accepted connection from pid 6967, user alice (trusted)229container-test-run-iets-classic-e2e> machine # [1634082.328354] machine nix-daemon[5312]: accepted connection from pid 6988, user alice (trusted)230container-test-run-iets-classic-e2e> ok   fetchGit of a clean working tree231container-test-run-iets-classic-e2e> machine # [1634083.303748] machine nix-daemon[5312]: accepted connection from pid 7057, user alice (trusted)232container-test-run-iets-classic-e2e> ok   fetchGit of a file URL233container-test-run-iets-classic-e2e> machine # [1634084.551159] machine nix-daemon[5312]: accepted connection from pid 7094, user alice (trusted)234container-test-run-iets-classic-e2e> ok   fetchGit with name, shallow and exportIgnore = false235container-test-run-iets-classic-e2e> machine # [1634085.414081] machine nix-daemon[5312]: accepted connection from pid 7127, user alice (trusted)236container-test-run-iets-classic-e2e> ok   fetchGit of a rev237container-test-run-iets-classic-e2e> machine # [1634085.879504] machine nix-daemon[5312]: accepted connection from pid 7149, user alice (trusted)238container-test-run-iets-classic-e2e> machine # [1634086.047191] machine nix-daemon[5312]: accepted connection from pid 7168, user alice (trusted)239container-test-run-iets-classic-e2e> machine # [1634086.362377] machine nix-daemon[5312]: accepted connection from pid 7190, user alice (trusted)240container-test-run-iets-classic-e2e> ok   fetchGit of a rev in pure mode241container-test-run-iets-classic-e2e> machine # [1634086.479706] machine nix-daemon[5312]: accepted connection from pid 7209, user alice (trusted)242container-test-run-iets-classic-e2e> ok   fetchGit of a ref243container-test-run-iets-classic-e2e> machine # [1634086.699235] machine nix-daemon[5312]: accepted connection from pid 7231, user alice (trusted)244container-test-run-iets-classic-e2e> machine # [1634086.820205] machine nix-daemon[5312]: accepted connection from pid 7252, user alice (trusted)245container-test-run-iets-classic-e2e> ok   fetchGit of an unlocked tree in pure mode246container-test-run-iets-classic-e2e> ok   fetchGit of a ref that is a tag247container-test-run-iets-classic-e2e> machine # [1634087.405718] machine nix-daemon[5312]: accepted connection from pid 7301, user alice (trusted)248container-test-run-iets-classic-e2e> machine # [1634087.541852] machine nix-daemon[5312]: accepted connection from pid 7322, user alice (trusted)249container-test-run-iets-classic-e2e> ok   fetchGit of a ref that is an annotated tag250container-test-run-iets-classic-e2e> machine # [1634087.964120] machine nix-daemon[5312]: accepted connection from pid 7344, user alice (trusted)251container-test-run-iets-classic-e2e> machine # [1634088.090549] machine nix-daemon[5312]: accepted connection from pid 7365, user alice (trusted)252container-test-run-iets-classic-e2e> ok   fetchGit of a branch with an executable, a symlink and a submodule253container-test-run-iets-classic-e2e> machine # [1634088.408658] machine nix-daemon[5312]: accepted connection from pid 7412, user alice (trusted)254container-test-run-iets-classic-e2e> machine # [1634088.786320] machine nix-daemon[5312]: accepted connection from pid 7434, user alice (trusted)255container-test-run-iets-classic-e2e> ok   fetchGit of a rev and a ref256container-test-run-iets-classic-e2e> machine # [1634088.916816] machine nix-daemon[5312]: accepted connection from pid 7453, user alice (trusted)257container-test-run-iets-classic-e2e> ok   fetchGit of a rev with exportIgnore = false258container-test-run-iets-classic-e2e> ok   fetchGit of a ref that names nothing259container-test-run-iets-classic-e2e> machine # [1634089.162470] machine nix-daemon[5312]: accepted connection from pid 7492, user alice (trusted)260container-test-run-iets-classic-e2e> ok   fetchGit { url = "/tmp/iets-classic-e2e.ihqf8r/fetchgit repo"; rev = "5230ce608c046a82f452fd6a36f7e6a86c3c5c3f"; } runs no nix261container-test-run-iets-classic-e2e> ok   fetchGit { url = "/tmp/iets-classic-e2e.ihqf8r/fetchgit repo"; ref = "ann"; } runs no nix262container-test-run-iets-classic-e2e> machine # [1634090.260826] machine nix-daemon[5312]: accepted connection from pid 7565, user alice (trusted)263container-test-run-iets-classic-e2e> machine # [1634090.433732] machine nix-daemon[5312]: accepted connection from pid 7584, user alice (trusted)264container-test-run-iets-classic-e2e> ok   fetchGit of a dirty working tree265container-test-run-iets-classic-e2e> ok   fetchGit of a dirty working tree warns as Nix does266container-test-run-iets-classic-e2e> machine # [1634090.708459] machine nix-daemon[5312]: accepted connection from pid 7630, user alice (trusted)267container-test-run-iets-classic-e2e> ok   lib.fileset.gitTracked of a dirty working tree268container-test-run-iets-classic-e2e> machine # [1634091.345571] machine nix-daemon[5312]: accepted connection from pid 7682, user alice (trusted)269container-test-run-iets-classic-e2e> machine # [1634091.376902] machine nix-daemon[5312]: accepted connection from pid 7682, user alice (trusted)270container-test-run-iets-classic-e2e> ok   lib.fileset.gitTracked of a clean working tree271container-test-run-iets-classic-e2e> ok   --parse execs the real nix-instantiate272container-test-run-iets-classic-e2e> ok   --iets-option never reaches the fallback nix273container-test-run-iets-classic-e2e> ok   the fallback prints one line on stderr274container-test-run-iets-classic-e2e> ok   IETS_NO_FALLBACK=1 exits 1275container-test-run-iets-classic-e2e> ok   nix-bin-dir full of iets: the fallback stops, it does not loop276container-test-run-iets-classic-e2e> machine # [1634091.801475] machine nix-daemon[5312]: accepted connection from pid 7731, user alice (trusted)277container-test-run-iets-classic-e2e> machine # [1634091.832617] machine nix-daemon[5312]: accepted connection from pid 7731, user alice (trusted)278container-test-run-iets-classic-e2e> ok   nix eval > /dev/full279container-test-run-iets-classic-e2e> ok   nix-instantiate --eval > /dev/full280container-test-run-iets-classic-e2e> ok   iets version > /dev/full reports, not aborts281container-test-run-iets-classic-e2e> ok   iets parse /tmp/iets-classic-e2e.ihqf8r/case/multi.nix > /dev/full reports, not aborts282container-test-run-iets-classic-e2e> ok   iets --help > /dev/full reports, not aborts283container-test-run-iets-classic-e2e> ok   iets lint list > /dev/full reports, not aborts284container-test-run-iets-classic-e2e> ok   a bad iets.toml and 'iets version'285container-test-run-iets-classic-e2e> ok   a bad iets.toml and 'iets --help'286container-test-run-iets-classic-e2e> ok   a bad iets.toml and 'iets eval -E 1'287container-test-run-iets-classic-e2e> ok   an early error is a record under internal-json288container-test-run-iets-classic-e2e> ok   fetchTarball falls back and prints the real result289container-test-run-iets-classic-e2e> ok   fetchMercurial falls back with one 'iets:' prefix290container-test-run-iets-classic-e2e> machine # [1634092.609330] machine nix-daemon[5312]: accepted connection from pid 7962, user alice (trusted)291container-test-run-iets-classic-e2e> machine # [1634092.695774] machine nix-daemon[5312]: accepted connection from pid 7988, user alice (trusted)292container-test-run-iets-classic-e2e> ok   iets eval fetchMercurial names fetchTree on stderr293container-test-run-iets-classic-e2e> ok   fetchurl with a sha256 has nix's store path294container-test-run-iets-classic-e2e> machine # [1634093.100930] machine nix-daemon[5312]: accepted connection from pid 8034, user alice (trusted)295container-test-run-iets-classic-e2e> machine # [1634093.350605] machine nix-daemon[5312]: accepted connection from pid 8066, user alice (trusted)296container-test-run-iets-classic-e2e> ok   nix eval reads what fetchurl got297container-test-run-iets-classic-e2e> ok   fetchurl without a hash falls back in an impure evaluation298container-test-run-iets-classic-e2e> machine # [1634094.737283] machine nix-daemon[5312]: accepted connection from pid 8089, user alice (trusted)299container-test-run-iets-classic-e2e> machine # [1634094.801864] machine nix-daemon[5312]: accepted connection from pid 8114, user alice (trusted)300container-test-run-iets-classic-e2e> ok   fetchurl without a hash in a pure evaluation301container-test-run-iets-classic-e2e> ok   fetchurl does not take an invalid path302container-test-run-iets-classic-e2e> machine # [1634096.525499] machine nix-daemon[5312]: accepted connection from pid 8162, user alice (trusted)303container-test-run-iets-classic-e2e> machine # [1634096.600268] machine nix-daemon[5312]: accepted connection from pid 8174, user alice (trusted)304container-test-run-iets-classic-e2e> ok   fetchurl with a wrong hash does not take an invalid path305container-test-run-iets-classic-e2e> machine # [1634097.626177] machine nix-daemon[5312]: accepted connection from pid 8197, user alice (trusted)306container-test-run-iets-classic-e2e> machine # [1634097.708031] machine nix-daemon[5312]: accepted connection from pid 8209, user alice (trusted)307container-test-run-iets-classic-e2e> ok   fetchTarball does not take an invalid path308container-test-run-iets-classic-e2e> machine # [1634098.329701] machine nix-daemon[5312]: accepted connection from pid 8249, user alice (trusted)309container-test-run-iets-classic-e2e> machine # [1634098.365193] machine nix-daemon[5312]: accepted connection from pid 8249, user alice (trusted)310container-test-run-iets-classic-e2e> machine # [1634098.547926] machine nix-daemon[5312]: accepted connection from pid 8263, user alice (trusted)311container-test-run-iets-classic-e2e> ok   import from derivation falls back312container-test-run-iets-classic-e2e> machine # [1634099.858392] machine nix-daemon[5312]: accepted connection from pid 8285, user alice (trusted)313container-test-run-iets-classic-e2e> machine # [1634099.926372] machine nix-daemon[5312]: accepted connection from pid 8310, user alice (trusted)314container-test-run-iets-classic-e2e> ok   iets eval refuses import from derivation315container-test-run-iets-classic-e2e> ok   instantiate --eval a non-UTF-8 file name316container-test-run-iets-classic-e2e> ok   iets eval a non-UTF-8 file name317container-test-run-iets-classic-e2e> ok   a non-UTF-8 file name reaches the fallback intact318container-test-run-iets-classic-e2e> ok   the 'nix' name falls back319container-test-run-iets-classic-e2e> ok   nix eval --json .#x320container-test-run-iets-classic-e2e> machine # [1634103.787235] machine nix-daemon[5312]: accepted connection from pid 8442, user alice (trusted)321container-test-run-iets-classic-e2e> ok   nix eval --raw .#x322container-test-run-iets-classic-e2e> machine # [1634105.012383] machine nix-daemon[5312]: accepted connection from pid 8471, user alice (trusted)323container-test-run-iets-classic-e2e> ok   nix eval .#s (attrset, list, float)324container-test-run-iets-classic-e2e> machine # [1634105.900507] machine nix-daemon[5312]: accepted connection from pid 8500, user alice (trusted)325container-test-run-iets-classic-e2e> ok   nix eval .#l326container-test-run-iets-classic-e2e> ok   nix flake prefetch-inputs, no inputs327container-test-run-iets-classic-e2e> ok   nix flake prefetch-inputs is iets's own328container-test-run-iets-classic-e2e> machine # [1634106.635981] machine nix-daemon[5312]: accepted connection from pid 8529, user alice (trusted)329container-test-run-iets-classic-e2e> machine # [1634106.875522] machine nix-daemon[5312]: accepted connection from pid 8555, user alice (trusted)330container-test-run-iets-classic-e2e> ok   nix eval .#x, no flake.lock331container-test-run-iets-classic-e2e> ok   nix eval .#x, no flake.lock is iets's own332container-test-run-iets-classic-e2e> machine # [1634107.476827] machine nix-daemon[5312]: accepted connection from pid 8584, user alice (trusted)333container-test-run-iets-classic-e2e> ok   nix eval .#pkg.drvPath, no flake.lock334container-test-run-iets-classic-e2e> ok   nix eval .#pkg.drvPath, no flake.lock is iets's own335container-test-run-iets-classic-e2e> machine # [1634108.265278] machine nix-daemon[5312]: accepted connection from pid 8613, user alice (trusted)336container-test-run-iets-classic-e2e> ok   nix build .#pkg, no flake.lock337container-test-run-iets-classic-e2e> ok   nix build .#pkg, no flake.lock is iets's own338container-test-run-iets-classic-e2e> ok   no flake.lock: neither side writes one339container-test-run-iets-classic-e2e> machine # [1634108.870958] machine nix-daemon[5312]: accepted connection from pid 8635, user alice (trusted)340container-test-run-iets-classic-e2e> machine # [1634108.975927] machine nix-daemon[5312]: accepted connection from pid 8635, user alice (trusted)341container-test-run-iets-classic-e2e> machine # [1634109.014459] machine nix-daemon[5312]: accepted connection from pid 8672, user alice (trusted)342container-test-run-iets-classic-e2e> ok   nix eval, farm first on PATH, fresh tree343container-test-run-iets-classic-e2e> ok   fallback through the farm marker, real nix off PATH344container-test-run-iets-classic-e2e> machine # [1634109.614535] machine nix-daemon[5312]: accepted connection from pid 8701, user alice (trusted)345container-test-run-iets-classic-e2e> ok   nix eval .#pkg (a derivation)346container-test-run-iets-classic-e2e> machine # [1634110.741162] machine nix-daemon[5312]: accepted connection from pid 8771, user alice (trusted)347container-test-run-iets-classic-e2e> ok   nix eval . (packages.<system>.default)348container-test-run-iets-classic-e2e> ok   nix eval --expr349container-test-run-iets-classic-e2e> machine # [1634111.519945] machine nix-daemon[5312]: accepted connection from pid 8800, user alice (trusted)350container-test-run-iets-classic-e2e> ok   nix eval --expr is pure351container-test-run-iets-classic-e2e> ok   nix eval --impure --expr352container-test-run-iets-classic-e2e> ok   nix --option pure-eval false eval --expr353container-test-run-iets-classic-e2e> ok   nix eval -f is impure354container-test-run-iets-classic-e2e> ok   nix eval .#x is pure355container-test-run-iets-classic-e2e> machine # [1634114.759940] machine nix-daemon[5312]: accepted connection from pid 8962, user alice (trusted)356container-test-run-iets-classic-e2e> ok   nix-instantiate is impure357container-test-run-iets-classic-e2e> ok   nix-instantiate --pure-eval358container-test-run-iets-classic-e2e> ok   nix-instantiate --option pure-eval true359container-test-run-iets-classic-e2e> ok   nix-instantiate --pure-eval refuses a local file360container-test-run-iets-classic-e2e> ok   nix.conf system reaches builtins.currentSystem361container-test-run-iets-classic-e2e> ok   NIX_USER_CONF_FILES empty362container-test-run-iets-classic-e2e> ok   NIX_USER_CONF_FILES unset363container-test-run-iets-classic-e2e> ok   nix eval -f with pure-eval from the system nix.conf364container-test-run-iets-classic-e2e> ok   nix eval -f with pure-eval from a user nix.conf365container-test-run-iets-classic-e2e> ok   nix eval -f with pure-eval from NIX_CONFIG366container-test-run-iets-classic-e2e> ok   nix eval -f with pure-eval from --option367container-test-run-iets-classic-e2e> ok   nix eval -f with pure-eval from --impure368container-test-run-iets-classic-e2e> ok   instantiate -j 4294967296369container-test-run-iets-classic-e2e> ok   instantiate --cores 4294967296370container-test-run-iets-classic-e2e> ok   instantiate -j auto371container-test-run-iets-classic-e2e> ok   instantiate --cores 1K372container-test-run-iets-classic-e2e> ok   instantiate -j 2373container-test-run-iets-classic-e2e> ok   instantiate -Ifoo=/etc374container-test-run-iets-classic-e2e> ok   nix-eval-jobs prints no summary375container-test-run-iets-classic-e2e> ok   iets eval-jobs keeps its summary376container-test-run-iets-classic-e2e> ok   nix.conf 'pure-eval = maybe'377container-test-run-iets-classic-e2e> ok   nix.conf 'show-trace = maybe'378container-test-run-iets-classic-e2e> ok   nix.conf 'sandbox = maybe'379container-test-run-iets-classic-e2e> ok   nix.conf 'eval-cache = 2'380container-test-run-iets-classic-e2e> ok   nix.conf 'connect-timeout = abc'381container-test-run-iets-classic-e2e> ok   nix.conf 'cores = -1'382container-test-run-iets-classic-e2e> ok   nix.conf 'cores = 4294967296'383container-test-run-iets-classic-e2e> ok   nix.conf 'max-jobs = abc'384container-test-run-iets-classic-e2e> ok   nix.conf 'cores = 1K'385container-test-run-iets-classic-e2e> ok   nix.conf 'min-free = 2G'386container-test-run-iets-classic-e2e> ok   nix.conf 'max-jobs = auto'387container-test-run-iets-classic-e2e> ok   nix.conf 'sandbox = relaxed'388container-test-run-iets-classic-e2e> ok   nix eval --expr, a nested error389container-test-run-iets-classic-e2e> ok   nix eval --expr, repeated and empty values390container-test-run-iets-classic-e2e> ok   nix eval --expr, functions391container-test-run-iets-classic-e2e> machine # [1634128.094248] machine nix-daemon[5312]: accepted connection from pid 9803, user alice (trusted)392container-test-run-iets-classic-e2e> ok   symlink: readFile through a copy of the link itself393container-test-run-iets-classic-e2e> machine # [1634128.788252] machine nix-daemon[5312]: accepted connection from pid 9832, user alice (trusted)394container-test-run-iets-classic-e2e> ok   symlink: readFile of a target the filter left out395container-test-run-iets-classic-e2e> machine # [1634129.235855] machine nix-daemon[5312]: accepted connection from pid 9861, user alice (trusted)396container-test-run-iets-classic-e2e> ok   symlink: readDir through a copy of the link itself397container-test-run-iets-classic-e2e> machine # [1634130.158750] machine nix-daemon[5312]: accepted connection from pid 9890, user alice (trusted)398container-test-run-iets-classic-e2e> ok   symlink: hashFile through a copy of the link itself399container-test-run-iets-classic-e2e> machine # [1634130.798665] machine nix-daemon[5312]: accepted connection from pid 9919, user alice (trusted)400container-test-run-iets-classic-e2e> ok   symlink: readFile below a link in a copied tree401container-test-run-iets-classic-e2e> machine # [1634131.454050] machine nix-daemon[5312]: accepted connection from pid 9948, user alice (trusted)402container-test-run-iets-classic-e2e> ok   symlink: readDir of a link in a copied tree403container-test-run-iets-classic-e2e> ok   symlink: pathExists below a link in a copied tree404container-test-run-iets-classic-e2e> machine # [1634131.920419] machine nix-daemon[5312]: accepted connection from pid 9977, user alice (trusted)405container-test-run-iets-classic-e2e> machine # [1634132.125762] machine nix-daemon[5312]: accepted connection from pid 10006, user alice (trusted)406container-test-run-iets-classic-e2e> ok   symlink: path of a link in a copied tree407container-test-run-iets-classic-e2e> machine # [1634132.644415] machine nix-daemon[5312]: accepted connection from pid 10035, user alice (trusted)408container-test-run-iets-classic-e2e> ok   symlink: path of a link, local and copied agree409container-test-run-iets-classic-e2e> machine # [1634133.127839] machine nix-daemon[5312]: accepted connection from pid 10064, user alice (trusted)410container-test-run-iets-classic-e2e> ok   symlink: path of a dangling link411container-test-run-iets-classic-e2e> machine # [1634133.756391] machine nix-daemon[5312]: accepted connection from pid 10093, user alice (trusted)412container-test-run-iets-classic-e2e> machine # [1634133.789094] machine nix-daemon[10113]: unexpected Nix daemon error: error: interrupted by the user413container-test-run-iets-classic-e2e> ok   symlink: path of a dangling link in a copied tree414container-test-run-iets-classic-e2e> machine # [1634134.209025] machine nix-daemon[5312]: accepted connection from pid 10122, user alice (trusted)415container-test-run-iets-classic-e2e> machine # [1634134.215282] machine nix-daemon[10142]: unexpected Nix daemon error: error: interrupted by the user416container-test-run-iets-classic-e2e> ok   symlink: storePath below a link in a copied tree417container-test-run-iets-classic-e2e> machine # [1634135.920442] machine nix-daemon[5312]: accepted connection from pid 10151, user alice (trusted)418container-test-run-iets-classic-e2e> ok   symlink: filterSource sees the store path of an unfiltered copy419container-test-run-iets-classic-e2e> machine # [1634137.241927] machine nix-daemon[5312]: accepted connection from pid 10180, user alice (trusted)420container-test-run-iets-classic-e2e> ok   symlink: path keeps the references of a store path421container-test-run-iets-classic-e2e> machine # [1634138.020457] machine nix-daemon[5312]: accepted connection from pid 10209, user alice (trusted)422container-test-run-iets-classic-e2e> machine # [1634138.068512] machine nix-daemon[5312]: accepted connection from pid 10229, user alice (trusted)423container-test-run-iets-classic-e2e> ok   symlink: path flat refuses a store path with references424container-test-run-iets-classic-e2e> ok   nix eval -f FILE ATTR425container-test-run-iets-classic-e2e> machine # [1634138.771037] machine nix-daemon[5312]: accepted connection from pid 10258, user alice (trusted)426container-test-run-iets-classic-e2e> machine # [1634138.814693] machine nix-daemon[5312]: accepted connection from pid 10278, user alice (trusted)427container-test-run-iets-classic-e2e> ok   nix eval --json -f FILE ATTR428container-test-run-iets-classic-e2e> ok   auto-call a function file, defaults: nix-instantiate429container-test-run-iets-classic-e2e> ok   auto-call a function file, defaults: iets eval430container-test-run-iets-classic-e2e> ok   auto-call a '...' function file, defaults: nix-instantiate431container-test-run-iets-classic-e2e> ok   auto-call a '...' function file, defaults: iets eval432container-test-run-iets-classic-e2e> ok   auto-call a function file, --arg: nix-instantiate433container-test-run-iets-classic-e2e> ok   auto-call a function file, --arg: iets eval434container-test-run-iets-classic-e2e> ok   auto-call a '...' function file, --arg: nix-instantiate435container-test-run-iets-classic-e2e> ok   auto-call a '...' function file, --arg: iets eval436container-test-run-iets-classic-e2e> ok   auto-call a function file, --argstr: nix-instantiate437container-test-run-iets-classic-e2e> ok   auto-call a function file, --argstr: iets eval438container-test-run-iets-classic-e2e> ok   auto-call a '...' function file, --argstr: nix-instantiate439container-test-run-iets-classic-e2e> ok   auto-call a '...' function file, --argstr: iets eval440container-test-run-iets-classic-e2e> ok   a required --arg that is missing: the same first error line everywhere441container-test-run-iets-classic-e2e> ok   nix search, every package442container-test-run-iets-classic-e2e> ok   nix search --json443container-test-run-iets-classic-e2e> ok   nix search --json --pretty444container-test-run-iets-classic-e2e> ok   nix search, two regexes are ANDed445container-test-run-iets-classic-e2e> ok   nix search --exclude446container-test-run-iets-classic-e2e> ok   nix search is case insensitive447container-test-run-iets-classic-e2e> ok   nix search, a bracket expression448container-test-run-iets-classic-e2e> ok   nix search, an alternation449container-test-run-iets-classic-e2e> ok   nix search, no results450container-test-run-iets-classic-e2e> ok   nix search --json, no results451container-test-run-iets-classic-e2e> machine # [1634174.671845] machine nix-daemon[5312]: accepted connection from pid 10970, user alice (trusted)