nixbot

builds

cancelled checks.x86_64-linux.classic-e2e build #191 · raw · eval 3.2 s · 487.3 MiB allocated · ·

1these 5 derivations will be built:2  /nix/store/vyyhf6zg6hgn3xfdx9pfahgqidhfcjyk-closure-info.drv3  /nix/store/gdhdncgf27bdz1hshjh357hal223ai1i-test-script.drv4  /nix/store/5kiz9yz1brm4gaq9fbdafjg17m1kd256-driverConfiguration.json.drv5  /nix/store/l7qb0kqx4klmyqk8f7kxnsm6xg6i3g1d-nixos-test-driver-iets-classic-e2e.drv6  /nix/store/kvl4ic7ap8sg6327wyz0xkzxba53gk55-container-test-run-iets-classic-e2e.drv7building '/nix/store/vyyhf6zg6hgn3xfdx9pfahgqidhfcjyk-closure-info.drv'8closure-info> structuredAttrs is enabled9building '/nix/store/gdhdncgf27bdz1hshjh357hal223ai1i-test-script.drv'10test-script> structuredAttrs is enabled11building '/nix/store/5kiz9yz1brm4gaq9fbdafjg17m1kd256-driverConfiguration.json.drv'12driverConfiguration.json> structuredAttrs is enabled13building '/nix/store/l7qb0kqx4klmyqk8f7kxnsm6xg6i3g1d-nixos-test-driver-iets-classic-e2e.drv'14nixos-test-driver-iets-classic-e2e> Running type check (enable/disable: config.skipTypeCheck)15nixos-test-driver-iets-classic-e2e> See https://nixos.org/manual/nixos/stable/#test-opt-skipTypeCheck16nixos-test-driver-iets-classic-e2e> All checks passed!17nixos-test-driver-iets-classic-e2e> Linting test script (enable/disable: config.skipLint)18nixos-test-driver-iets-classic-e2e> See https://nixos.org/manual/nixos/stable/#test-opt-skipLint19nixos-test-driver-iets-classic-e2e> All checks passed!20building '/nix/store/kvl4ic7ap8sg6327wyz0xkzxba53gk55-container-test-run-iets-classic-e2e.drv'21container-test-run-iets-classic-e2e> Machine state will be reset. To keep it, pass --keep-machine-state22container-test-run-iets-classic-e2e> start all VLans23container-test-run-iets-classic-e2e> (finished: start all VLans, in 0.01 seconds)24container-test-run-iets-classic-e2e> 25container-test-run-iets-classic-e2e> Test will time out and terminate in 3600.0 seconds26container-test-run-iets-classic-e2e> run the VM test script27container-test-run-iets-classic-e2e> additionally exposed symbols:28container-test-run-iets-classic-e2e>     machine,29container-test-run-iets-classic-e2e>     vlan1,30container-test-run-iets-classic-e2e>     start_all, test_script, machines, machines_qemu, machines_nspawn, vlans, driver, log, os, create_machine, subtest, run_tests, join_all, retry, serial_stdout_off, serial_stdout_on, polling_condition, BaseMachine, QemuMachine, NspawnMachine, t, debug, dump_machine_ssh31container-test-run-iets-classic-e2e> machine: waiting for unit multi-user.target32container-test-run-iets-classic-e2e> machine: systemd-nspawn running (pid 50)33container-test-run-iets-classic-e2e> machine: Waiting for journal at /build/vm-state-machine/var/log/journal...34container-test-run-iets-classic-e2e> nixos-nspawn(machine): TAP vde-tap1 not found; container will be isolated from VDE35container-test-run-iets-classic-e2e> nixos-nspawn(machine): A common reason for this is that /dev/net is not available in the Nix sandbox. Try adding /dev/net to extra-sandbox-paths.36container-test-run-iets-classic-e2e> Note: in a future version of systemd-nspawn the default set of permitted socket address families will be restricted to AF_INET, AF_INET6 and AF_UNIX. Use --restrict-address-families= to configure the set of permitted socket address families, or set RestrictAddressFamilies= in a .nspawn file.37container-test-run-iets-classic-e2e> ░ Spawning container machine on /build/vm-state-machine.38container-test-run-iets-classic-e2e> machine # No journal files were found.39container-test-run-iets-classic-e2e> machine # No journal boot entry found for the specified boot (+0).40container-test-run-iets-classic-e2e> machine # [1634008.755246] machine systemd-journald[57]: Journal started41container-test-run-iets-classic-e2e> machine # [1634008.755314] machine systemd-journald[57]: Runtime Journal (/run/log/journal/54807daf91c940f59245734cec4cded4) is 8M, max 2.5G, 2.5G free.42container-test-run-iets-classic-e2e> machine # [1634008.767855] machine systemd[1]: Finished Apply Kernel Variables.43container-test-run-iets-classic-e2e> machine # [1634008.787220] machine systemd[1]: Finished Create Static Device Nodes in /dev gracefully.44container-test-run-iets-classic-e2e> machine # [1634008.805985] machine systemd[1]: Starting Flush Journal to Persistent Storage...45container-test-run-iets-classic-e2e> machine # [1634008.807550] machine systemd[1]: Starting Create Static Device Nodes in /dev...46container-test-run-iets-classic-e2e> machine # [1634008.840035] machine systemd-journald[57]: Time spent on flushing to /var/log/journal/54807daf91c940f59245734cec4cded4 is 2.151ms for 6 entries.47container-test-run-iets-classic-e2e> machine # [1634008.840035] machine systemd-journald[57]: System Journal (/var/log/journal/54807daf91c940f59245734cec4cded4) is 512B, max 4G, 3.9G free.48container-test-run-iets-classic-e2e> machine # [1634008.870261] machine systemd[1]: Finished Create Static Device Nodes in /dev.49container-test-run-iets-classic-e2e> machine # [1634008.871388] machine systemd[1]: Reached target Preparation for Local File Systems.50container-test-run-iets-classic-e2e> machine # [1634008.871512] machine systemd[1]: Rule-based Manager for Device Events and Files skipped, unmet condition check ConditionPathIsReadWrite=/sys51container-test-run-iets-classic-e2e> machine # [1634008.872708] machine systemd[1]: Finished Flush Journal to Persistent Storage.52container-test-run-iets-classic-e2e> machine # [1634008.936228] machine systemd[1]: Finished Firewall.53container-test-run-iets-classic-e2e> machine # [1634009.754747] machine systemd[1]: Mounting /run/wrappers...54container-test-run-iets-classic-e2e> machine # [1634009.838401] machine systemd[1]: Mounted /run/wrappers.55container-test-run-iets-classic-e2e> machine # [1634009.839415] machine systemd[1]: Reached target Local File Systems.56container-test-run-iets-classic-e2e> machine # [1634009.841007] machine systemd[1]: Listening on Boot Loader Control Service Socket.57container-test-run-iets-classic-e2e> machine # [1634009.842224] machine systemd[1]: Starting Create SUID/SGID Wrappers...58container-test-run-iets-classic-e2e> machine # [1634009.842257] machine systemd[1]: Update Boot Loader Random Seed skipped, unmet condition check ConditionVirtualization=!container59container-test-run-iets-classic-e2e> machine # [1634009.843272] machine systemd[1]: Starting Save Transient machine-id to Disk...60container-test-run-iets-classic-e2e> machine # [1634009.844135] machine systemd[1]: Starting Create System Files and Directories...61container-test-run-iets-classic-e2e> machine # [1634009.858775] machine suid-sgid-wrappers-start[168]: chmod: changing permissions of '/run/wrappers/wrappers.yHc3mI56sh/chsh': Operation not permitted62container-test-run-iets-classic-e2e> machine # [1634009.862876] machine systemd-tmpfiles[161]: Cannot set file attributes for '/var/empty', value=0x00000010, mask=0x00000010, ignoring: Operation not permitted63container-test-run-iets-classic-e2e> machine # [1634009.863030] machine systemd-tmpfiles[161]: fchmod() of /var/log/journal failed: Operation not permitted64container-test-run-iets-classic-e2e> machine # [1634009.863129] machine systemd-tmpfiles[161]: fchmod() of /var/log/journal/54807daf91c940f59245734cec4cded4 failed: Operation not permitted65container-test-run-iets-classic-e2e> machine # [1634009.863265] machine systemd-tmpfiles[161]: fchmod() of /run/log/journal failed: Operation not permitted66container-test-run-iets-classic-e2e> machine # [1634009.868935] machine systemd[1]: suid-sgid-wrappers.service: Main process exited, code=exited, status=1/FAILURE67container-test-run-iets-classic-e2e> machine # [1634009.869029] machine systemd[1]: suid-sgid-wrappers.service: Failed with result 'exit-code'.68container-test-run-iets-classic-e2e> machine # [1634009.869274] machine systemd[1]: Failed to start Create SUID/SGID Wrappers.69container-test-run-iets-classic-e2e> machine # [1634009.871277] machine systemd[1]: Finished Create System Files and Directories.70container-test-run-iets-classic-e2e> machine # [1634009.893167] machine systemd[1]: Starting Rebuild Journal Catalog...71container-test-run-iets-classic-e2e> machine # [1634009.897116] machine systemd[1]: Starting Record System Boot/Shutdown in UTMP...72container-test-run-iets-classic-e2e> machine # [1634009.926761] machine systemd[1]: Finished Record System Boot/Shutdown in UTMP.73container-test-run-iets-classic-e2e> machine # [1634009.934223] machine systemd[1]: Finished Rebuild Journal Catalog.74container-test-run-iets-classic-e2e> machine # [1634009.935827] machine systemd[1]: Starting Update is Completed...75container-test-run-iets-classic-e2e> machine # [1634010.032103] machine systemd[1]: Finished Update is Completed.76container-test-run-iets-classic-e2e> machine # [1634010.032218] machine systemd[1]: Reached target System Initialization.77container-test-run-iets-classic-e2e> machine # [1634010.032283] machine systemd[1]: Discard unused filesystem blocks once a week skipped, unmet condition check ConditionVirtualization=!container78container-test-run-iets-classic-e2e> machine # [1634010.032309] machine systemd[1]: Started Daily Cleanup of Temporary Directories.79container-test-run-iets-classic-e2e> machine # [1634010.032322] machine systemd[1]: Reached target Timer Units.80container-test-run-iets-classic-e2e> machine # [1634010.032411] machine systemd[1]: Listening on D-Bus System Message Bus Socket.81container-test-run-iets-classic-e2e> machine # [1634010.032676] machine systemd[1]: Listening on Virtual Machine and Container Registration Service Socket.82container-test-run-iets-classic-e2e> machine # [1634010.032698] machine systemd[1]: Reached target Socket Units.83container-test-run-iets-classic-e2e> machine # [1634010.032716] machine systemd[1]: Reached target Basic System.84container-test-run-iets-classic-e2e> machine # [1634010.033663] machine systemd[1]: Starting Import lastlog data into lastlog2 database...85container-test-run-iets-classic-e2e> machine # [1634010.034284] machine systemd[1]: Starting Name Service Cache Daemon (nsncd)...86container-test-run-iets-classic-e2e> machine # [1634010.034979] machine systemd[1]: Starting resolvconf update...87container-test-run-iets-classic-e2e> machine # [1634010.054440] machine systemd[1]: Finished Import lastlog data into lastlog2 database.88container-test-run-iets-classic-e2e> machine # [1634010.094162] machine systemd[1]: nscd.service: Deactivated successfully.89container-test-run-iets-classic-e2e> machine # [1634010.094382] machine systemd[1]: Stopped Name Service Cache Daemon (nsncd).90container-test-run-iets-classic-e2e> machine # [1634010.096612] machine systemd[1]: Starting Name Service Cache Daemon (nsncd)...91container-test-run-iets-classic-e2e> machine # [1634010.118624] machine resolvconf-start[234]: setfacl: /run/resolvconf: Operation not supported92container-test-run-iets-classic-e2e> machine # [1634010.123527] machine systemd[1]: resolvconf.service: Main process exited, code=exited, status=1/FAILURE93container-test-run-iets-classic-e2e> machine # [1634010.123618] machine systemd[1]: resolvconf.service: Failed with result 'exit-code'.94container-test-run-iets-classic-e2e> machine # [1634010.148180] machine systemd[1]: Failed to start resolvconf update.95container-test-run-iets-classic-e2e> machine # [1634010.148493] machine systemd[1]: Reached target Preparation for Network.96container-test-run-iets-classic-e2e> machine # [1634010.149662] machine systemd[1]: Starting Address configuration of eth1...97container-test-run-iets-classic-e2e> machine # [1634010.151384] machine systemd[1]: Starting Extra networking commands....98container-test-run-iets-classic-e2e> machine # [1634010.168189] machine network-addresses-eth1-start[237]: adding address 192.168.1.1/24... done99container-test-run-iets-classic-e2e> machine # [1634010.171485] machine network-addresses-eth1-start[237]: adding address 2001:db8:1::1/64... done100container-test-run-iets-classic-e2e> machine # [1634010.176285] machine systemd[1]: Finished Address configuration of eth1.101container-test-run-iets-classic-e2e> machine # [1634010.225675] machine systemd[1]: Finished Extra networking commands..102container-test-run-iets-classic-e2e> machine # [1634010.225832] machine systemd[1]: Reached target Network.103container-test-run-iets-classic-e2e> machine # [1634010.342525] machine systemd[1]: Started Name Service Cache Daemon (nsncd).104container-test-run-iets-classic-e2e> machine # [1634010.342611] machine systemd[1]: Reached target Host and Network Name Lookups.105container-test-run-iets-classic-e2e> machine # [1634010.342668] machine systemd[1]: Reached target User and Group Name Lookups.106container-test-run-iets-classic-e2e> machine # [1634010.343298] machine nsncd[223]: Oct 13 20:53:01.073 INFO started, config: Config { ignored_request_types: {}, worker_count: 8, handoff_timeout: 10s }, path: "/var/run/nscd/socket"107container-test-run-iets-classic-e2e> machine # [1634010.343917] machine systemd[1]: Starting User Login Management...108container-test-run-iets-classic-e2e> machine # [1634010.344921] machine systemd[1]: Starting Permit User Sessions...109container-test-run-iets-classic-e2e> machine # [1634010.367279] machine systemd[1]: Finished Permit User Sessions.110container-test-run-iets-classic-e2e> machine # [1634010.368814] machine systemd[1]: Started Console Getty.111container-test-run-iets-classic-e2e> machine # [1634010.368867] machine systemd[1]: Getty on tty1 skipped, unmet condition check ConditionPathExists=/dev/tty0112container-test-run-iets-classic-e2e> machine # [1634010.368887] machine systemd[1]: Reached target Login Prompts.113container-test-run-iets-classic-e2e> machine # [1634010.517613] machine systemd[1]: etc-machine\x2did.mount: Deactivated successfully.114container-test-run-iets-classic-e2e> machine # [1634010.518919] machine systemd[1]: Finished Save Transient machine-id to Disk.115container-test-run-iets-classic-e2e> machine # [1634011.685181] machine systemd-logind[305]: New seat seat0.116container-test-run-iets-classic-e2e> machine # [1634011.686520] machine systemd[1]: Starting D-Bus System Message Bus...117container-test-run-iets-classic-e2e> machine # [1634011.686969] machine systemd[1]: Started User Login Management.118container-test-run-iets-classic-e2e> machine # [1634011.687921] machine systemd[1]: Starting linger-users.service...119container-test-run-iets-classic-e2e> machine # [1634011.757769] machine systemd[1]: linger-users.service: Deactivated successfully.120container-test-run-iets-classic-e2e> machine # [1634011.758024] machine systemd[1]: Finished linger-users.service.121container-test-run-iets-classic-e2e> machine # [1634011.760722] machine systemd[1]: Reached target Multi-User System.122container-test-run-iets-classic-e2e> machine: (finished: waiting for unit multi-user.target, in 4.66 seconds)123container-test-run-iets-classic-e2e> machine: must succeed: /nix/store/hbyzr3c9k3n51a3zyb3h74dqi8a2n1p5-writable-store /nix/store/p5wljpr3665b54v6w4y87bc8f0gdm27w-closure-info124container-test-run-iets-classic-e2e> machine # [1634012.239158] machine dbus-broker-launch[316]: Looking up NSS user entry for 'systemd-timesync'...125container-test-run-iets-classic-e2e> machine # [1634012.243906] machine dbus-broker-launch[316]: NSS returned no entry for 'systemd-timesync'126container-test-run-iets-classic-e2e> machine # [1634012.243906] machine dbus-broker-launch[316]: Invalid user-name in /nix/store/z441alblwy32lyxiy8466qf85iyi2sdj-system-path/share/dbus-1/system.d/org.freedesktop.timesync1.conf +16: user="systemd-timesync"127container-test-run-iets-classic-e2e> machine # [1634012.245198] machine systemd[1]: Started D-Bus System Message Bus.128container-test-run-iets-classic-e2e> machine # [1634012.245780] machine systemd[1]: Startup finished in 3.969s.129container-test-run-iets-classic-e2e> machine # [1634012.253468] machine dbus-broker-launch[316]: Ready130container-test-run-iets-classic-e2e> warning: '--json' without '--json-format' is deprecated; please specify '--json-format 1' or '--json-format 2'. This will become an error in a future release.131container-test-run-iets-classic-e2e> machine: (finished: must succeed: /nix/store/hbyzr3c9k3n51a3zyb3h74dqi8a2n1p5-writable-store /nix/store/p5wljpr3665b54v6w4y87bc8f0gdm27w-closure-info, in 15.43 seconds)132container-test-run-iets-classic-e2e> machine: must succeed: systemctl start nix-daemon.socket133container-test-run-iets-classic-e2e> machine: (finished: must succeed: systemctl start nix-daemon.socket, in 0.01 seconds)134container-test-run-iets-classic-e2e> machine: must succeed: /nix/store/cgg4r9lrvb6gcsr7ffpvi9ka3xkldmk9-leftovers135container-test-run-iets-classic-e2e> machine: (finished: must succeed: /nix/store/cgg4r9lrvb6gcsr7ffpvi9ka3xkldmk9-leftovers, in 0.19 seconds)136container-test-run-iets-classic-e2e> machine: must succeed: cp -r /nix/store/dwp3vamykd1qw1y7vbcnv0awji18gy2v-source /home/alice/iets && chmod -R u+w /home/alice/iets && chown -R alice /home/alice/iets137container-test-run-iets-classic-e2e> machine # [1634027.712178] machine systemd[1]: Listening on Nix Daemon Socket.138container-test-run-iets-classic-e2e> machine: (finished: must succeed: cp -r /nix/store/dwp3vamykd1qw1y7vbcnv0awji18gy2v-source /home/alice/iets && chmod -R u+w /home/alice/iets && chown -R alice /home/alice/iets, in 0.15 seconds)139container-test-run-iets-classic-e2e> machine: must succeed: runuser -l alice -c 'cd iets && git init -q && git add -A && git -c user.name=e2e -c user.email=e2e@example.com commit -q -m e2e'140container-test-run-iets-classic-e2e> machine # [1634028.075528] machine runuser[4978]: pam_unix(runuser-l:session): session opened for user alice(uid=1000) by (uid=0)141container-test-run-iets-classic-e2e> machine: (finished: must succeed: runuser -l alice -c 'cd iets && git init -q && git add -A && git -c user.name=e2e -c user.email=e2e@example.com commit -q -m e2e', in 0.53 seconds)142container-test-run-iets-classic-e2e> machine: must succeed: runuser -l alice -c 'cd iets && IETS=/nix/store/9sqnmx04c8rbs3qkiip5wv92al8gygwm-iets-0.1.0/bin/iets NIXPKGS=/nix/store/hhfnpma32czw4h3bqpag8dciax0bcmar-source E2E_OFFLINE=1   nu scripts/classic-e2e.nu' >&2143container-test-run-iets-classic-e2e> machine # [1634028.588133] machine runuser[4978]: pam_unix(runuser-l:session): session closed for user alice144container-test-run-iets-classic-e2e> machine # [1634028.610984] machine runuser[4991]: pam_unix(runuser-l:session): session opened for user alice(uid=1000) by (uid=0)145container-test-run-iets-classic-e2e> real nix: /nix/store/6ph2h5b0v19yihxr0id244wh83whwasq-nix-2.34.8/bin146container-test-run-iets-classic-e2e> ok   builtins --impure []: the same names nix has147container-test-run-iets-classic-e2e> ok   builtins --impure [dynamic-derivations]: the same names nix has148container-test-run-iets-classic-e2e> ok   builtins --impure [dynamic-derivations fetch-closure fetch-tree]: the same names nix has149container-test-run-iets-classic-e2e> ok   builtins --pure-eval []: the same names nix has150container-test-run-iets-classic-e2e> ok   builtins --pure-eval [dynamic-derivations]: the same names nix has151container-test-run-iets-classic-e2e> ok   builtins --pure-eval [dynamic-derivations fetch-closure fetch-tree]: the same names nix has152container-test-run-iets-classic-e2e> machine # [1634036.152955] machine systemd[1]: Started Nix Daemon.153container-test-run-iets-classic-e2e> machine # [1634036.233140] machine nix-daemon[5312]: accepted connection from pid 5305, user alice (trusted)154container-test-run-iets-classic-e2e> ok   instantiate <nixpkgs> -A hello155container-test-run-iets-classic-e2e> machine # [1634037.427625] machine nix-daemon[5312]: accepted connection from pid 5429, user alice (trusted)156container-test-run-iets-classic-e2e> machine # [1634042.911612] machine nix-daemon[5312]: accepted connection from pid 5450, user alice (trusted)157container-test-run-iets-classic-e2e> machine # [1634043.245885] machine nix-daemon[5312]: accepted connection from pid 5461, user alice (trusted)158container-test-run-iets-classic-e2e> ok   instantiate <nixpkgs> -A glibc (multi-output)159container-test-run-iets-classic-e2e> machine # [1634047.483745] machine nix-daemon[5312]: accepted connection from pid 5482, user alice (trusted)160container-test-run-iets-classic-e2e> ok   instantiate <nixpkgs> -A glibc.dev (!output suffix)161container-test-run-iets-classic-e2e> machine # [1634047.831705] machine nix-daemon[5312]: accepted connection from pid 5493, user alice (trusted)162container-test-run-iets-classic-e2e> machine # [1634050.053695] machine nix-daemon[5312]: accepted connection from pid 5514, user alice (trusted)163container-test-run-iets-classic-e2e> machine # [1634050.362810] machine nix-daemon[5312]: accepted connection from pid 5525, user alice (trusted)164container-test-run-iets-classic-e2e> ok   instantiate two -A in one run165container-test-run-iets-classic-e2e> machine # [1634053.741784] machine nix-daemon[5312]: accepted connection from pid 5546, user alice (trusted)166container-test-run-iets-classic-e2e> machine # [1634054.030833] machine nix-daemon[5312]: accepted connection from pid 5557, user alice (trusted)167container-test-run-iets-classic-e2e> ok   instantiate two -A that name one derivation168container-test-run-iets-classic-e2e> machine # [1634055.651271] machine nix-daemon[5312]: accepted connection from pid 5578, user alice (trusted)169container-test-run-iets-classic-e2e> machine # [1634055.909150] machine nix-daemon[5312]: accepted connection from pid 5589, user alice (trusted)170container-test-run-iets-classic-e2e> ok   instantiate --add-root ''171container-test-run-iets-classic-e2e> ok   instantiate --eval --strict --json172container-test-run-iets-classic-e2e> ok   instantiate --eval173container-test-run-iets-classic-e2e> ok   instantiate --eval --raw174container-test-run-iets-classic-e2e> ok   instantiate --eval --raw a path175container-test-run-iets-classic-e2e> ok   instantiate --eval --raw an outPath176container-test-run-iets-classic-e2e> ok   instantiate --eval, one --arg name twice177container-test-run-iets-classic-e2e> ok   instantiate --eval, --arg then --argstr of one name178container-test-run-iets-classic-e2e> ok   instantiate --eval, a later expression throws179container-test-run-iets-classic-e2e> ok   instantiate --eval --argstr180container-test-run-iets-classic-e2e> ok   instantiate a custom drv181container-test-run-iets-classic-e2e> machine # [1634061.416577] machine nix-daemon[5312]: accepted connection from pid 5844, user alice (trusted)182container-test-run-iets-classic-e2e> machine # [1634061.564723] machine nix-daemon[5312]: accepted connection from pid 5856, user alice (trusted)183container-test-run-iets-classic-e2e> ok   drv closure follows the references of a toFile184container-test-run-iets-classic-e2e> machine # [1634062.152055] machine nix-daemon[5312]: accepted connection from pid 5877, user alice (trusted)185container-test-run-iets-classic-e2e> machine # [1634062.217874] machine nix-daemon[5312]: accepted connection from pid 5892, user alice (trusted)186container-test-run-iets-classic-e2e> ok   instantiate builtins.outputOf, once and nested187container-test-run-iets-classic-e2e> ok   eval builtins.outputOf placeholders188container-test-run-iets-classic-e2e> machine # [1634062.420275] machine nix-daemon[5312]: accepted connection from pid 5913, user alice (trusted)189container-test-run-iets-classic-e2e> machine # [1634062.474391] machine nix-daemon[5312]: accepted connection from pid 5935, user alice (trusted)190container-test-run-iets-classic-e2e> machine # [1634062.580532] machine nix-daemon[5312]: accepted connection from pid 5956, user alice (trusted)191container-test-run-iets-classic-e2e> machine # [1634062.633813] machine nix-daemon[5312]: accepted connection from pid 5978, user alice (trusted)192container-test-run-iets-classic-e2e> ok   two consumers of one dynamic producer stay apart193container-test-run-iets-classic-e2e> machine # [1634062.727655] machine nix-daemon[5312]: accepted connection from pid 5999, user alice (trusted)194container-test-run-iets-classic-e2e> machine # [1634062.787636] machine nix-daemon[5312]: accepted connection from pid 6021, user alice (trusted)195container-test-run-iets-classic-e2e> ok   instantiate --readonly-mode196container-test-run-iets-classic-e2e> machine # [1634063.941468] machine nix-daemon[5312]: accepted connection from pid 6068, user alice (trusted)197container-test-run-iets-classic-e2e> machine # [1634064.036724] machine nix-daemon[5312]: accepted connection from pid 6091, user alice (trusted)198container-test-run-iets-classic-e2e> ok   --add-root links and registers a gc root199container-test-run-iets-classic-e2e> machine # [1634064.641286] machine nix-daemon[5312]: accepted connection from pid 6112, user alice (trusted)200container-test-run-iets-classic-e2e> machine # [1634064.712133] machine nix-daemon[5312]: accepted connection from pid 6125, user alice (trusted)201container-test-run-iets-classic-e2e> machine # [1634064.776131] machine nix-daemon[5312]: accepted connection from pid 6146, user alice (trusted)202container-test-run-iets-classic-e2e> machine # [1634065.556949] machine nix-daemon[5312]: accepted connection from pid 6196, user alice (trusted)203container-test-run-iets-classic-e2e> machine # [1634065.702671] machine nix-daemon[5312]: accepted connection from pid 6237, user alice (trusted)204container-test-run-iets-classic-e2e> machine # [1634066.178447] machine nix-daemon[5312]: accepted connection from pid 6287, user alice (trusted)205container-test-run-iets-classic-e2e> machine # [1634066.335220] machine nix-daemon[5312]: accepted connection from pid 6330, user alice (trusted)206container-test-run-iets-classic-e2e> machine # [1634067.021432] machine nix-daemon[5312]: accepted connection from pid 6382, user alice (trusted)207container-test-run-iets-classic-e2e> machine # [1634067.192081] machine nix-daemon[5312]: accepted connection from pid 6425, user alice (trusted)208container-test-run-iets-classic-e2e> ok   -o over an existing path acts as Nix does209container-test-run-iets-classic-e2e> machine # [1634068.216495] machine nix-daemon[5312]: accepted connection from pid 6477, user alice (trusted)210container-test-run-iets-classic-e2e> machine # [1634068.367489] machine nix-daemon[5312]: accepted connection from pid 6518, user alice (trusted)211container-test-run-iets-classic-e2e> ok   build a custom drv, default result212container-test-run-iets-classic-e2e> machine # [1634068.977335] machine nix-daemon[5312]: accepted connection from pid 6562, user alice (trusted)213container-test-run-iets-classic-e2e> machine # [1634069.125972] machine nix-daemon[5312]: accepted connection from pid 6597, user alice (trusted)214container-test-run-iets-classic-e2e> ok   build -o link215container-test-run-iets-classic-e2e> machine # [1634069.818680] machine nix-daemon[5312]: accepted connection from pid 6641, user alice (trusted)216container-test-run-iets-classic-e2e> machine # [1634069.998750] machine nix-daemon[5312]: accepted connection from pid 6676, user alice (trusted)217container-test-run-iets-classic-e2e> ok   build --no-out-link218container-test-run-iets-classic-e2e> machine # [1634070.692909] machine nix-daemon[5312]: accepted connection from pid 6720, user alice (trusted)219container-test-run-iets-classic-e2e> machine # [1634070.847656] machine nix-daemon[5312]: accepted connection from pid 6755, user alice (trusted)220container-test-run-iets-classic-e2e> ok   build two outputs of one drv221container-test-run-iets-classic-e2e> machine # [1634071.433921] machine nix-daemon[5312]: accepted connection from pid 6807, user alice (trusted)222container-test-run-iets-classic-e2e> machine # [1634071.496383] machine nix-daemon[5312]: accepted connection from pid 6823, user alice (trusted)223container-test-run-iets-classic-e2e> ok   build two drvs224container-test-run-iets-classic-e2e> machine # [1634072.560827] machine nix-daemon[5312]: accepted connection from pid 6872, user alice (trusted)225container-test-run-iets-classic-e2e> ok   builder = unix://SCRATCH builds there and registers here226container-test-run-iets-classic-e2e> machine # [1634073.376930] machine nix-daemon[5312]: accepted connection from pid 6930, user alice (trusted)227container-test-run-iets-classic-e2e> machine # [1634073.454946] machine nix-daemon[5312]: accepted connection from pid 6967, user alice (trusted)228container-test-run-iets-classic-e2e> machine # [1634073.504344] machine nix-daemon[5312]: accepted connection from pid 6988, user alice (trusted)229container-test-run-iets-classic-e2e> ok   fetchGit of a clean working tree230container-test-run-iets-classic-e2e> machine # [1634074.395980] machine nix-daemon[5312]: accepted connection from pid 7057, user alice (trusted)231container-test-run-iets-classic-e2e> ok   fetchGit of a file URL232container-test-run-iets-classic-e2e> machine # [1634075.213974] machine nix-daemon[5312]: accepted connection from pid 7094, user alice (trusted)233container-test-run-iets-classic-e2e> ok   fetchGit with name, shallow and exportIgnore = false234container-test-run-iets-classic-e2e> machine # [1634075.804232] machine nix-daemon[5312]: accepted connection from pid 7127, user alice (trusted)235container-test-run-iets-classic-e2e> machine # [1634076.024253] machine nix-daemon[5312]: accepted connection from pid 7149, user alice (trusted)236container-test-run-iets-classic-e2e> machine # [1634076.165219] machine nix-daemon[5312]: accepted connection from pid 7168, user alice (trusted)237container-test-run-iets-classic-e2e> ok   fetchGit of a rev238container-test-run-iets-classic-e2e> ok   fetchGit of a rev in pure mode239container-test-run-iets-classic-e2e> machine # [1634076.437919] machine nix-daemon[5312]: accepted connection from pid 7190, user alice (trusted)240container-test-run-iets-classic-e2e> machine # [1634076.535344] machine nix-daemon[5312]: accepted connection from pid 7209, user alice (trusted)241container-test-run-iets-classic-e2e> ok   fetchGit of a ref242container-test-run-iets-classic-e2e> machine # [1634076.820309] machine nix-daemon[5312]: accepted connection from pid 7231, user alice (trusted)243container-test-run-iets-classic-e2e> machine # [1634076.991188] machine nix-daemon[5312]: accepted connection from pid 7252, user alice (trusted)244container-test-run-iets-classic-e2e> ok   fetchGit of an unlocked tree in pure mode245container-test-run-iets-classic-e2e> ok   fetchGit of a ref that is a tag246container-test-run-iets-classic-e2e> machine # [1634077.566682] machine nix-daemon[5312]: accepted connection from pid 7301, user alice (trusted)247container-test-run-iets-classic-e2e> machine # [1634077.731109] machine nix-daemon[5312]: accepted connection from pid 7322, user alice (trusted)248container-test-run-iets-classic-e2e> ok   fetchGit of a ref that is an annotated tag249container-test-run-iets-classic-e2e> machine # [1634078.191129] machine nix-daemon[5312]: accepted connection from pid 7344, user alice (trusted)250container-test-run-iets-classic-e2e> machine # [1634078.337506] machine nix-daemon[5312]: accepted connection from pid 7365, user alice (trusted)251container-test-run-iets-classic-e2e> ok   fetchGit of a branch with an executable, a symlink and a submodule252container-test-run-iets-classic-e2e> machine # [1634078.735300] machine nix-daemon[5312]: accepted connection from pid 7412, user alice (trusted)253container-test-run-iets-classic-e2e> machine # [1634078.890099] machine nix-daemon[5312]: accepted connection from pid 7434, user alice (trusted)254container-test-run-iets-classic-e2e> ok   fetchGit of a rev and a ref255container-test-run-iets-classic-e2e> machine # [1634079.110426] machine nix-daemon[5312]: accepted connection from pid 7453, user alice (trusted)256container-test-run-iets-classic-e2e> ok   fetchGit of a rev with exportIgnore = false257container-test-run-iets-classic-e2e> machine # [1634079.417488] machine nix-daemon[5312]: accepted connection from pid 7492, user alice (trusted)258container-test-run-iets-classic-e2e> ok   fetchGit of a ref that names nothing259container-test-run-iets-classic-e2e> ok   fetchGit { url = "/tmp/iets-classic-e2e.J7mjaS/fetchgit repo"; rev = "ba8d0cf87fc17ceba21b18fddf1a2c3c21bb9170"; } runs no nix260container-test-run-iets-classic-e2e> machine # [1634081.237397] machine nix-daemon[5312]: accepted connection from pid 7565, user alice (trusted)261container-test-run-iets-classic-e2e> ok   fetchGit { url = "/tmp/iets-classic-e2e.J7mjaS/fetchgit repo"; ref = "ann"; } runs no nix262container-test-run-iets-classic-e2e> machine # [1634082.447664] machine nix-daemon[5312]: accepted connection from pid 7584, user alice (trusted)263container-test-run-iets-classic-e2e> ok   fetchGit of a dirty working tree264container-test-run-iets-classic-e2e> machine # [1634084.535935] machine nix-daemon[5312]: accepted connection from pid 7630, user alice (trusted)265container-test-run-iets-classic-e2e> ok   fetchGit of a dirty working tree warns as Nix does266container-test-run-iets-classic-e2e> ok   lib.fileset.gitTracked of a dirty working tree267container-test-run-iets-classic-e2e> machine # [1634086.092289] machine nix-daemon[5312]: accepted connection from pid 7682, user alice (trusted)268container-test-run-iets-classic-e2e> machine # [1634086.135692] machine nix-daemon[5312]: accepted connection from pid 7682, user alice (trusted)269container-test-run-iets-classic-e2e> ok   lib.fileset.gitTracked of a clean working tree270container-test-run-iets-classic-e2e> ok   --parse execs the real nix-instantiate271container-test-run-iets-classic-e2e> ok   --iets-option never reaches the fallback nix272container-test-run-iets-classic-e2e> ok   the fallback prints one line on stderr273container-test-run-iets-classic-e2e> machine # [1634086.659863] machine nix-daemon[5312]: accepted connection from pid 7731, user alice (trusted)274container-test-run-iets-classic-e2e> machine # [1634086.717467] machine nix-daemon[5312]: accepted connection from pid 7731, user alice (trusted)275container-test-run-iets-classic-e2e> ok   IETS_NO_FALLBACK=1 exits 1276container-test-run-iets-classic-e2e> ok   nix-bin-dir full of iets: the fallback stops, it does not loop277container-test-run-iets-classic-e2e> ok   nix eval > /dev/full278container-test-run-iets-classic-e2e> ok   nix-instantiate --eval > /dev/full279container-test-run-iets-classic-e2e> ok   iets version > /dev/full reports, not aborts280container-test-run-iets-classic-e2e> ok   iets parse /tmp/iets-classic-e2e.J7mjaS/case/multi.nix > /dev/full reports, not aborts281container-test-run-iets-classic-e2e> ok   iets --help > /dev/full reports, not aborts282container-test-run-iets-classic-e2e> ok   iets lint list > /dev/full reports, not aborts283container-test-run-iets-classic-e2e> ok   a bad iets.toml and 'iets version'284container-test-run-iets-classic-e2e> ok   a bad iets.toml and 'iets --help'285container-test-run-iets-classic-e2e> ok   a bad iets.toml and 'iets eval -E 1'286container-test-run-iets-classic-e2e> ok   an early error is a record under internal-json287container-test-run-iets-classic-e2e> ok   fetchTarball falls back and prints the real result288container-test-run-iets-classic-e2e> machine # [1634088.223815] machine nix-daemon[5312]: accepted connection from pid 7962, user alice (trusted)289container-test-run-iets-classic-e2e> machine # [1634088.369532] machine nix-daemon[5312]: accepted connection from pid 7988, user alice (trusted)290container-test-run-iets-classic-e2e> ok   fetchMercurial falls back with one 'iets:' prefix291container-test-run-iets-classic-e2e> ok   iets eval fetchMercurial names fetchTree on stderr292container-test-run-iets-classic-e2e> ok   fetchurl with a sha256 has nix's store path293container-test-run-iets-classic-e2e> ok   nix eval reads what fetchurl got294container-test-run-iets-classic-e2e> machine # [1634088.966723] machine nix-daemon[5312]: accepted connection from pid 8034, user alice (trusted)295container-test-run-iets-classic-e2e> machine # [1634089.170259] machine nix-daemon[5312]: accepted connection from pid 8066, user alice (trusted)296container-test-run-iets-classic-e2e> ok   fetchurl without a hash falls back in an impure evaluation297container-test-run-iets-classic-e2e> machine # [1634089.380985] machine nix-daemon[5312]: accepted connection from pid 8089, user alice (trusted)298container-test-run-iets-classic-e2e> machine # [1634089.445233] machine nix-daemon[5312]: accepted connection from pid 8114, user alice (trusted)299container-test-run-iets-classic-e2e> ok   fetchurl without a hash in a pure evaluation300container-test-run-iets-classic-e2e> ok   fetchurl does not take an invalid path301container-test-run-iets-classic-e2e> machine # [1634090.136421] machine nix-daemon[5312]: accepted connection from pid 8162, user alice (trusted)302container-test-run-iets-classic-e2e> machine # [1634090.234907] machine nix-daemon[5312]: accepted connection from pid 8174, user alice (trusted)303container-test-run-iets-classic-e2e> ok   fetchurl with a wrong hash does not take an invalid path304container-test-run-iets-classic-e2e> machine # [1634090.448528] machine nix-daemon[5312]: accepted connection from pid 8197, user alice (trusted)305container-test-run-iets-classic-e2e> machine # [1634090.526564] machine nix-daemon[5312]: accepted connection from pid 8209, user alice (trusted)306container-test-run-iets-classic-e2e> machine # [1634090.709383] machine nix-daemon[5312]: accepted connection from pid 8249, user alice (trusted)307container-test-run-iets-classic-e2e> ok   fetchTarball does not take an invalid path308container-test-run-iets-classic-e2e> machine # [1634090.745303] machine nix-daemon[5312]: accepted connection from pid 8249, user alice (trusted)309container-test-run-iets-classic-e2e> machine # [1634090.810382] machine nix-daemon[5312]: accepted connection from pid 8263, user alice (trusted)310container-test-run-iets-classic-e2e> ok   import from derivation falls back311container-test-run-iets-classic-e2e> ok   iets eval refuses import from derivation312container-test-run-iets-classic-e2e> machine # [1634091.104808] machine nix-daemon[5312]: accepted connection from pid 8285, user alice (trusted)313container-test-run-iets-classic-e2e> machine # [1634091.171264] machine nix-daemon[5312]: accepted connection from pid 8310, user alice (trusted)314container-test-run-iets-classic-e2e> ok   instantiate --eval a non-UTF-8 file name315container-test-run-iets-classic-e2e> ok   iets eval a non-UTF-8 file name316container-test-run-iets-classic-e2e> ok   a non-UTF-8 file name reaches the fallback intact317container-test-run-iets-classic-e2e> ok   the 'nix' name falls back318container-test-run-iets-classic-e2e> ok   nix eval --json .#x319container-test-run-iets-classic-e2e> ok   nix eval --raw .#x320container-test-run-iets-classic-e2e> machine # [1634091.977808] machine nix-daemon[5312]: accepted connection from pid 8442, user alice (trusted)321container-test-run-iets-classic-e2e> machine # [1634092.216438] machine nix-daemon[5312]: accepted connection from pid 8471, user alice (trusted)322container-test-run-iets-classic-e2e> ok   nix eval .#s (attrset, list, float)323container-test-run-iets-classic-e2e> ok   nix eval .#l324container-test-run-iets-classic-e2e> machine # [1634092.376902] machine nix-daemon[5312]: accepted connection from pid 8500, user alice (trusted)325container-test-run-iets-classic-e2e> machine # [1634092.593970] machine nix-daemon[5312]: accepted connection from pid 8529, user alice (trusted)326container-test-run-iets-classic-e2e> machine # [1634092.694882] machine nix-daemon[5312]: accepted connection from pid 8555, user alice (trusted)327container-test-run-iets-classic-e2e> ok   nix flake prefetch-inputs, no inputs328container-test-run-iets-classic-e2e> ok   nix flake prefetch-inputs is iets's own329container-test-run-iets-classic-e2e> ok   nix eval .#x, no flake.lock330container-test-run-iets-classic-e2e> ok   nix eval .#x, no flake.lock is iets's own331container-test-run-iets-classic-e2e> machine # [1634092.871093] machine nix-daemon[5312]: accepted connection from pid 8584, user alice (trusted)332container-test-run-iets-classic-e2e> ok   nix eval .#pkg.drvPath, no flake.lock333container-test-run-iets-classic-e2e> ok   nix eval .#pkg.drvPath, no flake.lock is iets's own334container-test-run-iets-classic-e2e> machine # [1634093.101119] machine nix-daemon[5312]: accepted connection from pid 8613, user alice (trusted)335container-test-run-iets-classic-e2e> machine # [1634093.298079] machine nix-daemon[5312]: accepted connection from pid 8635, user alice (trusted)336container-test-run-iets-classic-e2e> ok   nix build .#pkg, no flake.lock337container-test-run-iets-classic-e2e> ok   nix build .#pkg, no flake.lock is iets's own338container-test-run-iets-classic-e2e> ok   no flake.lock: neither side writes one339container-test-run-iets-classic-e2e> machine # [1634093.475444] machine nix-daemon[5312]: accepted connection from pid 8635, user alice (trusted)340container-test-run-iets-classic-e2e> machine # [1634093.538934] machine nix-daemon[5312]: accepted connection from pid 8672, user alice (trusted)341container-test-run-iets-classic-e2e> ok   nix eval, farm first on PATH, fresh tree342container-test-run-iets-classic-e2e> machine # [1634094.731029] machine nix-daemon[5312]: accepted connection from pid 8701, user alice (trusted)343container-test-run-iets-classic-e2e> ok   fallback through the farm marker, real nix off PATH344container-test-run-iets-classic-e2e> ok   nix eval .#pkg (a derivation)345container-test-run-iets-classic-e2e> machine # [1634096.011500] machine nix-daemon[5312]: accepted connection from pid 8771, user alice (trusted)346container-test-run-iets-classic-e2e> ok   nix eval . (packages.<system>.default)347container-test-run-iets-classic-e2e> machine # [1634096.977146] machine nix-daemon[5312]: accepted connection from pid 8800, user alice (trusted)348container-test-run-iets-classic-e2e> ok   nix eval --expr349container-test-run-iets-classic-e2e> ok   nix eval --expr is pure350container-test-run-iets-classic-e2e> ok   nix eval --impure --expr351container-test-run-iets-classic-e2e> ok   nix --option pure-eval false eval --expr352container-test-run-iets-classic-e2e> ok   nix eval -f is impure353container-test-run-iets-classic-e2e> ok   nix eval .#x is pure354container-test-run-iets-classic-e2e> machine # [1634101.238765] machine nix-daemon[5312]: accepted connection from pid 8962, user alice (trusted)355container-test-run-iets-classic-e2e> ok   nix-instantiate is impure356container-test-run-iets-classic-e2e> ok   nix-instantiate --pure-eval357container-test-run-iets-classic-e2e> ok   nix-instantiate --option pure-eval true358container-test-run-iets-classic-e2e> ok   nix-instantiate --pure-eval refuses a local file359container-test-run-iets-classic-e2e> ok   nix.conf system reaches builtins.currentSystem360container-test-run-iets-classic-e2e> ok   NIX_USER_CONF_FILES empty361container-test-run-iets-classic-e2e> ok   NIX_USER_CONF_FILES unset362container-test-run-iets-classic-e2e> ok   nix eval -f with pure-eval from the system nix.conf363container-test-run-iets-classic-e2e> ok   nix eval -f with pure-eval from a user nix.conf364container-test-run-iets-classic-e2e> ok   nix eval -f with pure-eval from NIX_CONFIG365container-test-run-iets-classic-e2e> ok   nix eval -f with pure-eval from --option366container-test-run-iets-classic-e2e> ok   nix eval -f with pure-eval from --impure367container-test-run-iets-classic-e2e> ok   instantiate -j 4294967296368container-test-run-iets-classic-e2e> ok   instantiate --cores 4294967296369container-test-run-iets-classic-e2e> ok   instantiate -j auto370container-test-run-iets-classic-e2e> ok   instantiate --cores 1K371container-test-run-iets-classic-e2e> ok   instantiate -j 2372container-test-run-iets-classic-e2e> ok   instantiate -Ifoo=/etc373container-test-run-iets-classic-e2e> ok   nix-eval-jobs prints no summary374container-test-run-iets-classic-e2e> ok   iets eval-jobs keeps its summary375container-test-run-iets-classic-e2e> ok   nix.conf 'pure-eval = maybe'376container-test-run-iets-classic-e2e> ok   nix.conf 'show-trace = maybe'377container-test-run-iets-classic-e2e> ok   nix.conf 'sandbox = maybe'378container-test-run-iets-classic-e2e> ok   nix.conf 'eval-cache = 2'379container-test-run-iets-classic-e2e> ok   nix.conf 'connect-timeout = abc'380container-test-run-iets-classic-e2e> ok   nix.conf 'cores = -1'381container-test-run-iets-classic-e2e> ok   nix.conf 'cores = 4294967296'382container-test-run-iets-classic-e2e> ok   nix.conf 'max-jobs = abc'383container-test-run-iets-classic-e2e> ok   nix.conf 'cores = 1K'384container-test-run-iets-classic-e2e> ok   nix.conf 'min-free = 2G'385container-test-run-iets-classic-e2e> ok   nix.conf 'max-jobs = auto'386container-test-run-iets-classic-e2e> ok   nix.conf 'sandbox = relaxed'387container-test-run-iets-classic-e2e> ok   nix eval --expr, a nested error388container-test-run-iets-classic-e2e> ok   nix eval --expr, repeated and empty values389container-test-run-iets-classic-e2e> ok   nix eval --expr, functions390container-test-run-iets-classic-e2e> machine # [1634115.300673] machine nix-daemon[5312]: accepted connection from pid 9803, user alice (trusted)391container-test-run-iets-classic-e2e> ok   symlink: readFile through a copy of the link itself392container-test-run-iets-classic-e2e> machine # [1634116.274173] machine nix-daemon[5312]: accepted connection from pid 9832, user alice (trusted)393container-test-run-iets-classic-e2e> ok   symlink: readFile of a target the filter left out394container-test-run-iets-classic-e2e> machine # [1634117.127834] machine nix-daemon[5312]: accepted connection from pid 9861, user alice (trusted)395container-test-run-iets-classic-e2e> ok   symlink: readDir through a copy of the link itself396container-test-run-iets-classic-e2e> machine # [1634117.967912] machine nix-daemon[5312]: accepted connection from pid 9890, user alice (trusted)397container-test-run-iets-classic-e2e> ok   symlink: hashFile through a copy of the link itself398container-test-run-iets-classic-e2e> machine # [1634118.939207] machine nix-daemon[5312]: accepted connection from pid 9919, user alice (trusted)399container-test-run-iets-classic-e2e> ok   symlink: readFile below a link in a copied tree400container-test-run-iets-classic-e2e> machine # [1634119.545234] machine nix-daemon[5312]: accepted connection from pid 9948, user alice (trusted)401container-test-run-iets-classic-e2e> ok   symlink: readDir of a link in a copied tree402container-test-run-iets-classic-e2e> machine # [1634120.423880] machine nix-daemon[5312]: accepted connection from pid 9977, user alice (trusted)403container-test-run-iets-classic-e2e> ok   symlink: pathExists below a link in a copied tree404container-test-run-iets-classic-e2e> machine # [1634121.881019] machine nix-daemon[5312]: accepted connection from pid 10006, user alice (trusted)405container-test-run-iets-classic-e2e> ok   symlink: path of a link in a copied tree406container-test-run-iets-classic-e2e> machine # [1634122.652975] machine nix-daemon[5312]: accepted connection from pid 10035, user alice (trusted)407container-test-run-iets-classic-e2e> ok   symlink: path of a link, local and copied agree408container-test-run-iets-classic-e2e> machine # [1634123.324038] machine nix-daemon[5312]: accepted connection from pid 10064, user alice (trusted)409container-test-run-iets-classic-e2e> ok   symlink: path of a dangling link410container-test-run-iets-classic-e2e> machine # [1634123.804573] machine nix-daemon[5312]: accepted connection from pid 10093, user alice (trusted)411container-test-run-iets-classic-e2e> machine # [1634123.844783] machine nix-daemon[10113]: unexpected Nix daemon error: error: interrupted by the user412container-test-run-iets-classic-e2e> ok   symlink: path of a dangling link in a copied tree413container-test-run-iets-classic-e2e> machine # [1634124.962302] machine nix-daemon[5312]: accepted connection from pid 10122, user alice (trusted)414container-test-run-iets-classic-e2e> machine # [1634124.970864] machine nix-daemon[10142]: unexpected Nix daemon error: error: interrupted by the user415container-test-run-iets-classic-e2e> ok   symlink: storePath below a link in a copied tree416container-test-run-iets-classic-e2e> machine # [1634126.069071] machine nix-daemon[5312]: accepted connection from pid 10151, user alice (trusted)417container-test-run-iets-classic-e2e> ok   symlink: filterSource sees the store path of an unfiltered copy418container-test-run-iets-classic-e2e> machine # [1634126.779112] machine nix-daemon[5312]: accepted connection from pid 10180, user alice (trusted)419container-test-run-iets-classic-e2e> ok   symlink: path keeps the references of a store path420container-test-run-iets-classic-e2e> machine # [1634127.302113] machine nix-daemon[5312]: accepted connection from pid 10209, user alice (trusted)421container-test-run-iets-classic-e2e> machine # [1634127.504494] machine nix-daemon[5312]: accepted connection from pid 10229, user alice (trusted)422container-test-run-iets-classic-e2e> ok   symlink: path flat refuses a store path with references423container-test-run-iets-classic-e2e> ok   nix eval -f FILE ATTR424container-test-run-iets-classic-e2e> machine # [1634127.833521] machine nix-daemon[5312]: accepted connection from pid 10258, user alice (trusted)425container-test-run-iets-classic-e2e> machine # [1634127.898891] machine nix-daemon[5312]: accepted connection from pid 10278, user alice (trusted)426container-test-run-iets-classic-e2e> ok   nix eval --json -f FILE ATTR427container-test-run-iets-classic-e2e> ok   auto-call a function file, defaults: nix-instantiate428container-test-run-iets-classic-e2e> ok   auto-call a function file, defaults: iets eval429container-test-run-iets-classic-e2e> ok   auto-call a '...' function file, defaults: nix-instantiate430container-test-run-iets-classic-e2e> ok   auto-call a '...' function file, defaults: iets eval431container-test-run-iets-classic-e2e> ok   auto-call a function file, --arg: nix-instantiate432container-test-run-iets-classic-e2e> ok   auto-call a function file, --arg: iets eval433container-test-run-iets-classic-e2e> ok   auto-call a '...' function file, --arg: nix-instantiate434container-test-run-iets-classic-e2e> ok   auto-call a '...' function file, --arg: iets eval435container-test-run-iets-classic-e2e> ok   auto-call a function file, --argstr: nix-instantiate436container-test-run-iets-classic-e2e> ok   auto-call a function file, --argstr: iets eval437container-test-run-iets-classic-e2e> ok   auto-call a '...' function file, --argstr: nix-instantiate438container-test-run-iets-classic-e2e> ok   auto-call a '...' function file, --argstr: iets eval439container-test-run-iets-classic-e2e> ok   a required --arg that is missing: the same first error line everywhere440container-test-run-iets-classic-e2e> ok   nix search, every package441container-test-run-iets-classic-e2e> ok   nix search --json442container-test-run-iets-classic-e2e> ok   nix search --json --pretty443container-test-run-iets-classic-e2e> ok   nix search, two regexes are ANDed444container-test-run-iets-classic-e2e> ok   nix search --exclude445container-test-run-iets-classic-e2e> ok   nix search is case insensitive446container-test-run-iets-classic-e2e> ok   nix search, a bracket expression447container-test-run-iets-classic-e2e> ok   nix search, an alternation448container-test-run-iets-classic-e2e> ok   nix search, no results449container-test-run-iets-classic-e2e> ok   nix search --json, no results450container-test-run-iets-classic-e2e> machine # [1634159.560804] machine nix-daemon[5312]: accepted connection from pid 10970, user alice (trusted)