setup
checks.aarch64-darwin.tests
· build #96
· raw
1these 2 derivations will be built:2 /nix/store/9dcl95dzz8i38kaas0vl7zxw37qd42i7-cargo-vendor-dir.drv3 /nix/store/4af4kn0sg1k2ig45z5a8403a11k8k3wj-horae-tests-0.1.0.drv4error: build of '/nix/store/4af4kn0sg1k2ig45z5a8403a11k8k3wj-horae-tests-0.1.0.drv' on 'grpc://farm.numtide.com:50051?client-cert=/run/secrets/vars/per-machine/bld1/nix-farm-ci/crt&client-key=/run/secrets/vars/per-machine/bld1/nix-farm-ci/key&connect-timeout=20&system=aarch64-darwin' failed: Cannot build '/nix/store/4af4kn0sg1k2ig45z5a8403a11k8k3wj-horae-tests-0.1.0.drv'.5 Reason: builder failed with exit code 101.6 Output paths:7 /nix/store/v858d2cr8gfckhfvc2ngijkwfbq04hxw-horae-tests-0.1.08 Last 25 log lines:9 > test server_fns::users::tests::authority::duplicate_creation_rolls_back_and_leaves_access_changes_usable ... ok10 > test server_fns::users::tests::authority::project_editor_and_user_revocation_commit_in_gate_order ... ok11 > test server_fns::users::tests::authority::access_transaction_holds_actor_authority_until_commit ... ok12 > test server_fns::users::tests::authority::user_mutations_recheck_revocation_after_waiting_for_organization_lock ... ok13 > test server_fns::users::tests::authority::revoked_administrator_cannot_create_change_roles_or_deactivate ... ok14 > test server_fns::users::tests::authority::user_mutations_wait_for_actor_revocation_and_recheck_after_commit ... ok15 >16 > failures:17 >18 > ---- importers::harvest::credentials::tests::completed_credential_changes_allow_immediate_retries stdout ----19 >20 > thread 'importers::harvest::credentials::tests::completed_credential_changes_allow_immediate_retries' (90545161) panicked at crates/horae/src/importers/harvest/credentials.rs:483:51:21 > called `Result::unwrap()` on an `Err` value: error communicating with database: Socket is not connected (os error 57)22 >23 > Caused by:24 > Socket is not connected (os error 57)25 > note: run with `RUST_BACKTRACE=1` environment variable to display a backtrace26 >27 >28 > failures:29 > importers::harvest::credentials::tests::completed_credential_changes_allow_immediate_retries30 >31 > test result: FAILED. 968 passed; 1 failed; 10 ignored; 0 measured; 0 filtered out; finished in 84.86s32 >33 > error: test failed, to rerun pass `-p horae --bin horae`34 For full logs, run:35 nix log /nix/store/4af4kn0sg1k2ig45z5a8403a11k8k3wj-horae-tests-0.1.0.drv36error: Cannot build '/nix/store/4af4kn0sg1k2ig45z5a8403a11k8k3wj-horae-tests-0.1.0.drv'.37 Reason: builder failed with exit code 1.38 Output paths:39 /nix/store/v858d2cr8gfckhfvc2ngijkwfbq04hxw-horae-tests-0.1.0