failed attributes
| status |
attribute |
duration |
| failed |
checks.aarch64-darwin.e2e
|
2m 8s |
setup:
/nix/store/5jk62p20qayr51v1mawak2da3z7v5slm-closure-info.drv
/nix/store/k5iwajc6b2nmjw88mkyxix3a56qlic1a-run-nixos-vm.drv
/nix/store/aqmww9infsh2cy …
setup:
/nix/store/5jk62p20qayr51v1mawak2da3z7v5slm-closure-info.drv
/nix/store/k5iwajc6b2nmjw88mkyxix3a56qlic1a-run-nixos-vm.drv
/nix/store/aqmww9infsh2cyl0f1nfvhkhhxksg02z-nixos-vm.drv
/nix/store/66fv8bax271b67ijpdssq6yif48mgag5-driverConfiguration.json.drv
/nix/store/wmi6pyfc9mmm82nsy31jblw7f16x5kjz-nixos-test-driver-horae-e2e.drv
/nix/store/mk55k104vhjw1b85pqwkvm4ncfpww7vv-vm-test-run-horae-e2e.drv
Failed to find a machine for remote build!
derivation: mk55k104vhjw1b85pqwkvm4ncfpww7vv-vm-test-run-horae-e2e.drv
required (system, features): (aarch64-darwin, [apple-virt, nixos-test])
12 available machines:
(systems, maxjobs, supportedFeatures, mandatoryFeatures)
([aarch64-darwin], 8, [big-parallel, kvm, nixos-test, uid-range], [])
([aarch64-darwin], 8, [big-parallel, kvm, nixos-test, uid-range], [])
([aarch64-darwin], 8, [big-parallel, kvm, nixos-test, uid-range], [])
([aarch64-darwin], 8, [big-parallel, kvm, nixos-test, uid-range], [])
([aarch64-linux], 8, [big-parallel, kvm, nixos-test, uid-range], [])
([aarch64-linux], 8, [big-parallel…
error: Cannot build '/nix/store/mk55k104vhjw1b85pqwkvm4ncfpww7vv-vm-test-run-horae-e2e.drv'.
Reason: platform mismatch
Required system: 'aarch64-darwin'
Current system: 'x86_64-linux'
Reason: missing system features
Required features: {apple-virt, nixos-test}
Available features: {benchmark, big-parallel, ca-derivations, kvm, nixos-test, recursive-nix, uid-range}
|
| failed |
checks.aarch64-darwin.e2e-oidc
|
2m 8s |
setup:
/nix/store/blqm9bfr8n6z1grwf9c2xillw3p2xfbv-closure-info.drv
/nix/store/39mc863bhlsk3ldb0nqs051ydlsrrm2f-run-nixos-vm.drv
/nix/store/7z4wbf7yc9qagg …
setup:
/nix/store/blqm9bfr8n6z1grwf9c2xillw3p2xfbv-closure-info.drv
/nix/store/39mc863bhlsk3ldb0nqs051ydlsrrm2f-run-nixos-vm.drv
/nix/store/7z4wbf7yc9qagg2rr0xh0rkqx2nippb7-nixos-vm.drv
/nix/store/c0i6iiycbkyyypavb7yyfw0nznmi68ya-driverConfiguration.json.drv
/nix/store/0vl507m7724s4pc6ayw6r1ndxv0s4ba1-nixos-test-driver-horae-e2e-oidc.drv
/nix/store/idvncp1g7bqi0qpl9bhjj5ljzdlajzhy-vm-test-run-horae-e2e-oidc.drv
Failed to find a machine for remote build!
derivation: idvncp1g7bqi0qpl9bhjj5ljzdlajzhy-vm-test-run-horae-e2e-oidc.drv
required (system, features): (aarch64-darwin, [apple-virt, nixos-test])
12 available machines:
(systems, maxjobs, supportedFeatures, mandatoryFeatures)
([aarch64-darwin], 8, [big-parallel, kvm, nixos-test, uid-range], [])
([aarch64-darwin], 8, [big-parallel, kvm, nixos-test, uid-range], [])
([aarch64-darwin], 8, [big-parallel, kvm, nixos-test, uid-range], [])
([aarch64-darwin], 8, [big-parallel, kvm, nixos-test, uid-range], [])
([aarch64-linux], 8, [big-parallel, kvm, nixos-test, uid-range], [])
([aarch64-linux], 8, [big-par…
error: Cannot build '/nix/store/idvncp1g7bqi0qpl9bhjj5ljzdlajzhy-vm-test-run-horae-e2e-oidc.drv'.
Reason: platform mismatch
Required system: 'aarch64-darwin'
Current system: 'x86_64-linux'
Reason: missing system features
Required features: {apple-virt, nixos-test}
Available features: {benchmark, big-parallel, ca-derivations, kvm, nixos-test, recursive-nix, uid-range}
|
| failed |
checks.aarch64-darwin.tests
|
13m 26s |
horae-tests-0.1.0:
called `Result::unwrap()` on an `Err` value: error communicating with database: Socket is not connected (os error 57)
Caused by:
Socket i …
horae-tests-0.1.0:
called `Result::unwrap()` on an `Err` value: error communicating with database: Socket is not connected (os error 57)
Caused by:
Socket is not connected (os error 57)
note: run with `RUST_BACKTRACE=1` environment variable to display a backtrace
failures:
importers::harvest::credentials::tests::completed_credential_changes_allow_immediate_retries
test result: FAILED. 968 passed; 1 failed; 10 ignored; 0 measured; 0 filtered out; finished in 84.86s
error: test failed, to rerun pass `-p horae --bin horae`
|
| failed |
checks.aarch64-linux.e2e
|
7m 31s |
vm-test-run-horae-e2e:
)
^
File "/nix/store/yv2q67grjgrymd498bgdfzlhyaj04cqv-nixos-test-driver-1.1/lib/python3.13/site-packages/test_driver/machine/__ …
vm-test-run-horae-e2e:
)
^
File "/nix/store/yv2q67grjgrymd498bgdfzlhyaj04cqv-nixos-test-driver-1.1/lib/python3.13/site-packages/test_driver/machine/__init__.py", line 878, in _execute
self.connect()
~~~~~~~~~~~~^^
File "/nix/store/yv2q67grjgrymd498bgdfzlhyaj04cqv-nixos-test-driver-1.1/lib/python3.13/site-packages/test_driver/machine/__init__.py", line 1057, in connect
raise RuntimeError("Shell did not start in time")
RuntimeError: Shell did not start in time
|
| failed |
checks.aarch64-linux.e2e-oidc
|
7m 46s |
vm-test-run-horae-e2e-oidc:
)
^
File "/nix/store/yv2q67grjgrymd498bgdfzlhyaj04cqv-nixos-test-driver-1.1/lib/python3.13/site-packages/test_driver/machi …
vm-test-run-horae-e2e-oidc:
)
^
File "/nix/store/yv2q67grjgrymd498bgdfzlhyaj04cqv-nixos-test-driver-1.1/lib/python3.13/site-packages/test_driver/machine/__init__.py", line 878, in _execute
self.connect()
~~~~~~~~~~~~^^
File "/nix/store/yv2q67grjgrymd498bgdfzlhyaj04cqv-nixos-test-driver-1.1/lib/python3.13/site-packages/test_driver/machine/__init__.py", line 1057, in connect
raise RuntimeError("Shell did not start in time")
RuntimeError: Shell did not start in time
|