nixbot

builds

failed horae-tests-0.1.0 checks.aarch64-darwin.tests · build #94 · raw

1mac02: building csrks7lhkwz817wdlp952ns99r3bqkpb-horae-tests-0.1.0.drv
unpackPhase
2unpacking source archive /nix/store/da1q6jg2ix7x7piwvxcdcn2an392p1nr-source3source root is source4Executing cargoSetupPostUnpackHook5Finished cargoSetupPostUnpackHook
patchPhase
6Executing cargoSetupPostPatchHook7Validating consistency between /nix/var/nix/builds/nix-57504-3225180469/source/Cargo.lock and /nix/var/nix/builds/nix-57504-3225180469/cargo-vendor-dir/Cargo.lock8Finished cargoSetupPostPatchHook
buildPhase
9 Compiling proc-macro2 v1.0.10610 Compiling unicode-ident v1.0.2411 Compiling quote v1.0.4612 Compiling serde_core v1.0.22813 Compiling autocfg v1.5.114 Compiling serde v1.0.22815 Compiling core-foundation-sys v0.8.716 Compiling thiserror v2.0.1817 Compiling iana-time-zone v0.1.6518 Compiling num-traits v0.2.1919 Compiling syn v2.0.11820 Compiling uuid v1.23.421 Compiling serde_derive v1.0.22822 Compiling thiserror-impl v2.0.1823 Compiling chrono v0.4.4524 Compiling horae-core v0.1.0 (/nix/var/nix/builds/nix-57504-3225180469/source/crates/core)25 Finished `test` profile [unoptimized + debuginfo] target(s) in 16.92s26------------27 Nextest run ID 55ea5f98-458a-4b27-9d4d-5603a79b7352 with nextest profile: default28 Starting 160 tests across 1 binary29 Running [ 00:00:00] 0/160: 10 running, 0 passed, 0 skipped 30 [ 00:00:00] horae-core ert_accepts_zero_percent_but_not_zero_budget31 [ 00:00:00] horae-core jects_invalid_inputs_and_widens_large_values32 [ 00:00:00] horae-core ed_alert_threshold_is_exact_without_rounding33 [ 00:00:00] horae-core percentage_rounds_clamps_and_never_overflows34 [ 00:00:00] horae-core ::a_single_jump_announces_every_crossed_band35 [ 00:00:00] horae-core ::tests::current_band_is_the_highest_reached36 [ 00:00:00] horae-core dget::tests::each_crossing_is_announced_once37 [ 00:00:00] horae-core elow_a_band_does_not_fire_but_current_resets38 Running [ 00:00:00] => 20/160: 10 running, 0 passed, 0 skipped 39 [ 00:00:00] horae-core ert_accepts_zero_percent_but_not_zero_budget40 [ 00:00:00] horae-core jects_invalid_inputs_and_widens_large_values41 [ 00:00:00] horae-core ed_alert_threshold_is_exact_without_rounding42 [ 00:00:00] horae-core percentage_rounds_clamps_and_never_overflows43 [ 00:00:00] horae-core ::a_single_jump_announces_every_crossed_band44 [ 00:00:00] horae-core ::tests::current_band_is_the_highest_reached45 [ 00:00:00] horae-core dget::tests::each_crossing_is_announced_once46 [ 00:00:00] horae-core elow_a_band_does_not_fire_but_current_resets47 PASS [ 0.017s] horae-core budget::tests::configured_alert_threshold_is_exact_without_rounding48 PASS [ 0.017s] horae-core budget::tests::display_percentage_rounds_clamps_and_never_overflows49 PASS [ 0.017s] horae-core budget::tests::each_crossing_is_announced_once50 PASS [ 0.017s] horae-core budget::tests::drop_below_a_band_does_not_fire_but_current_resets51 PASS [ 0.017s] horae-core budget::tests::large_values_do_not_overflow52 PASS [ 0.018s] horae-core budget::tests::configured_alert_rejects_invalid_inputs_and_widens_large_values53 PASS [ 0.018s] horae-core budget::tests::configured_alert_accepts_zero_percent_but_not_zero_budget54 PASS [ 0.018s] horae-core budget::tests::current_band_is_the_highest_reached55 PASS [ 0.018s] horae-core budget::tests::a_single_jump_announces_every_crossed_band56 PASS [ 0.023s] horae-core budget::tests::no_band_for_zero_or_missing_budget57 PASS [ 0.018s] horae-core client::tests::default_rate_preserves_absence_zero_and_exact_large_amounts58 PASS [ 0.018s] horae-core client::tests::default_rate_rejects_negative_fractional_cent_overflow_and_invalid_text59 PASS [ 0.018s] horae-core budget::tests::over_budget_fires_even_without_a_configured_100_band60 PASS [ 0.018s] horae-core duration::tests::format_clamps_negative_to_zero61 PASS [ 0.018s] horae-core client::tests::profile_accepts_supported_currencies_and_unicode_character_limit62 PASS [ 0.018s] horae-core duration::tests::format_hhmm_pads_minutes63 PASS [ 0.019s] horae-core client::tests::profile_rejects_blank_overlong_and_null_names64 PASS [ 0.019s] horae-core client::tests::profile_rejects_unsupported_currency_and_null_billing_fields65 PASS [ 0.020s] horae-core client::tests::optional_text_normalizes_only_blank_fields66 PASS [ 0.017s] horae-core duration::tests::format_round_trip67 PASS [ 0.014s] horae-core duration::tests::parse_preserves_u32_boundary_without_saturating68 Running [ 00:00:00] => 21/160: 10 running, 21 passed, 0 skipped 69 [ 00:00:00] horae-core ::tests::minutes_between_is_exact_no_minimum70 [ 00:00:00] horae-core s::parse_decimal_rounds_half_minutes_exactly71 [ 00:00:00] horae-core duration::tests::parse_decimal72 [ 00:00:00] horae-core duration::tests::parse_colon73 [ 00:00:00] horae-core rse_rejects_colon_overflow_without_panicking74 [ 00:00:00] horae-core ts_excessive_decimal_precision_and_numerator75 [ 00:00:00] horae-core cts_negative_non_finite_and_malformed_values76 [ 00:00:00] horae-core ests::parse_round_trips_each_minute_in_a_day77 Running [ 00:00:00] ==> 48/160: 10 running, 21 passed, 0 skipped 78 [ 00:00:00] horae-core ::tests::minutes_between_is_exact_no_minimum79 [ 00:00:00] horae-core s::parse_decimal_rounds_half_minutes_exactly80 [ 00:00:00] horae-core duration::tests::parse_decimal81 [ 00:00:00] horae-core duration::tests::parse_colon82 [ 00:00:00] horae-core rse_rejects_colon_overflow_without_panicking83 [ 00:00:00] horae-core ts_excessive_decimal_precision_and_numerator84 [ 00:00:00] horae-core cts_negative_non_finite_and_malformed_values85 [ 00:00:00] horae-core ests::parse_round_trips_each_minute_in_a_day86 PASS [ 0.014s] horae-core duration::tests::parse_rejects_excessive_decimal_precision_and_numerator87 PASS [ 0.015s] horae-core duration::tests::minutes_between_is_exact_no_minimum88 PASS [ 0.015s] horae-core duration::tests::parse_decimal_rounds_half_minutes_exactly89 PASS [ 0.015s] horae-core duration::tests::parse_colon90 PASS [ 0.015s] horae-core duration::tests::parse_rejects_negative_non_finite_and_malformed_values91 PASS [ 0.017s] horae-core duration::tests::parse_decimal92 PASS [ 0.017s] horae-core duration::tests::parse_rejects_colon_overflow_without_panicking93 PASS [ 0.019s] horae-core duration::tests::parse_round_trips_each_minute_in_a_day94 PASS [ 0.017s] horae-core importers::harvest::convert::tests::conversion_handles_high_precision_without_intermediate_overflow95 PASS [ 0.015s] horae-core importers::harvest::convert::tests::conversion_preserves_the_i64_boundary_and_rejects_rounding_past_it96 PASS [ 0.016s] horae-core importers::harvest::convert::tests::garbage_is_rejected97 PASS [ 0.016s] horae-core importers::harvest::convert::tests::conversion_rejects_unrepresentable_scaled_values_without_panicking98 PASS [ 0.015s] horae-core importers::harvest::convert::tests::hours_common_values_are_exact99 PASS [ 0.017s] horae-core importers::harvest::convert::tests::conversion_reports_precision_and_numerator_limits100 PASS [ 0.017s] horae-core importers::harvest::convert::tests::high_precision_fraction_straddles_the_half_minute_exactly101 PASS [ 0.017s] horae-core importers::harvest::convert::tests::leading_and_trailing_forms_parse102 PASS [ 0.017s] horae-core importers::harvest::convert::tests::money_common_values_are_exact103 PASS [ 0.024s] horae-core importers::harvest::convert::tests::hours_round_trip_against_exporter_transform104 PASS [ 0.017s] horae-core importers::harvest::convert::tests::money_round_trip_against_exporter_transform105 PASS [ 0.018s] horae-core importers::harvest::convert::tests::money_rounds_third_decimal_half_up106 PASS [ 0.018s] horae-core importers::harvest::convert::tests::round_half_up_at_the_boundary107 PASS [ 0.019s] horae-core importers::harvest::convert::tests::negative_is_rejected108 PASS [ 0.017s] horae-core importers::harvest::keys::tests::client_key_equal_across_case_and_whitespace109 PASS [ 0.018s] horae-core importers::harvest::keys::tests::normalize_matches_sql_harvest_norm_contract110 PASS [ 0.024s] horae-core importers::harvest::keys::tests::composite_components_do_not_collide111 PASS [ 0.018s] horae-core importers::harvest::keys::tests::normalize_trims_and_case_folds112 Running [ 00:00:00] ==> 52/160: 10 running, 52 passed, 0 skipped 113 [ 00:00:00] horae-core s::conversion_matches_exact_scaled_rationals114 [ 00:00:00] horae-core keys::tests::task_key_shared_across_projects115 [ 00:00:00] horae-core quires_binding_and_no_imports_or_active_work116 [ 00:00:00] horae-core d_new_inline_errors_reconcile_across_batches117 [ 00:00:00] horae-core _when_an_errored_count_has_no_reported_error118 [ 00:00:00] horae-core tests::import_modes_display_their_wire_names119 [ 00:00:00] horae-core s_when_errored_counts_match_collected_errors120 [ 00:00:00] horae-core conserves_header_amount_and_bounds_each_line121 PASS [ 0.019s] horae-core importers::harvest::keys::tests::occurrence_counter_keys_are_independent122 PASS [ 0.013s] horae-core importers::harvest::keys::tests::project_key_falls_back_to_client_and_name123 PASS [ 0.014s] horae-core importers::harvest::keys::tests::occurrence_counter_numbers_repeats_from_zero124 PASS [ 0.012s] horae-core importers::harvest::keys::tests::project_key_prefers_code_when_present125 PASS [ 0.014s] horae-core importers::harvest::keys::tests::time_entry_key_distinguishes_and_matches126 Running [ 00:00:00] ==> 52/160: 10 running, 52 passed, 0 skipped 127 [ 00:00:00] horae-core s::conversion_matches_exact_scaled_rationals128 [ 00:00:00] horae-core keys::tests::task_key_shared_across_projects129 [ 00:00:00] horae-core quires_binding_and_no_imports_or_active_work130 [ 00:00:00] horae-core d_new_inline_errors_reconcile_across_batches131 [ 00:00:00] horae-core _when_an_errored_count_has_no_reported_error132 [ 00:00:00] horae-core tests::import_modes_display_their_wire_names133 [ 00:00:00] horae-core s_when_errored_counts_match_collected_errors134 [ 00:00:00] horae-core conserves_header_amount_and_bounds_each_line135 Running [ 00:00:00] ====> 80/160: 10 running, 80 passed, 0 skipped 136 [ 00:00:00] horae-core s::conversion_matches_exact_scaled_rationals137 [ 00:00:00] horae-core currency_checks_and_representable_boundaries138 [ 00:00:00] horae-core format_cents_plain_keeps_sign_below_one_unit139 [ 00:00:00] horae-core format_cents_groups_thousands_and_keeps_sign140 [ 00:00:00] horae-core rse_cents_is_exact_where_a_float_would_drift141 [ 00:00:00] horae-core rse_cents_reads_whole_and_fractional_amounts142 [ 00:00:00] horae-core parse_cents_rejects_what_it_cannot_represent143 [ 00:00:00] horae-core se_cents_tolerates_grouping_spaces_and_signs144 PASS [ 0.015s] horae-core importers::harvest::types::account_switch_tests::account_switch_requires_binding_and_no_imports_or_active_work145 PASS [ 0.021s] horae-core importers::harvest::keys::tests::task_key_shared_across_projects146 PASS [ 0.014s] horae-core importers::harvest::types::tests::does_not_reconcile_when_an_errored_count_has_no_reported_error147 PASS [ 0.017s] horae-core importers::harvest::types::tests::archived_errors_and_new_inline_errors_reconcile_across_batches148 PASS [ 0.017s] horae-core invoice::tests::discount_allocation_handles_empty_zero_and_full_discounts149 PASS [ 0.015s] horae-core invoice::tests::discount_allocation_rejects_negative_lines_and_subtotal_overflow150 PASS [ 0.019s] horae-core importers::harvest::types::tests::import_modes_display_their_wire_names151 PASS [ 0.019s] horae-core importers::harvest::types::tests::reconciles_when_errored_counts_match_collected_errors152 PASS [ 0.016s] horae-core invoice::tests::discount_allocation_uses_largest_remainder_then_stable_source_order153 PASS [ 0.017s] horae-core invoice::tests::discount_allocation_supports_maximum_representable_subtotal154 PASS [ 0.016s] horae-core invoice::tests::discounted_fee_contribution_leaves_discount_available155 PASS [ 0.025s] horae-core invoice::tests::discount_allocation_conserves_header_amount_and_bounds_each_line156 PASS [ 0.015s] horae-core invoice::tests::invoice_adjustments_apply_discount_before_non_compounding_taxes157 PASS [ 0.011s] horae-core invoice::tests::invoice_adjustments_round_components_half_up158 PASS [ 0.012s] horae-core invoice::tests::invoice_adjustments_reject_negative_subtotal_and_overflow159 PASS [ 0.012s] horae-core invoice::tests::line_amount_90_minutes160 PASS [ 0.012s] horae-core invoice::tests::line_amount_accepts_large_representable_amounts161 PASS [ 0.011s] horae-core invoice::tests::line_amount_odd_minutes162 PASS [ 0.013s] horae-core invoice::tests::line_amount_exact_hour163 PASS [ 0.014s] horae-core invoice::tests::line_amount_half_hour164 PASS [ 0.013s] horae-core invoice::tests::line_amount_rejects_unrepresentable_results165 PASS [ 0.009s] horae-core invoice::tests::resolve_rate_cascade166 PASS [ 0.013s] horae-core invoice::tests::line_amount_rounds_half_cents_up_not_to_even167 PASS [ 0.012s] horae-core invoice::tests::line_amount_zero_minutes168 PASS [ 0.012s] horae-core invoice::tests::line_amount_zero_rate169 PASS [ 0.011s] horae-core invoice::tests::selected_rate_keeps_zero_and_explicit_missing_project_rate170 Running [ 00:00:00] ====> 80/160: 10 running, 80 passed, 0 skipped 171 [ 00:00:00] horae-core s::conversion_matches_exact_scaled_rationals172 [ 00:00:00] horae-core currency_checks_and_representable_boundaries173 [ 00:00:00] horae-core format_cents_plain_keeps_sign_below_one_unit174 [ 00:00:00] horae-core format_cents_groups_thousands_and_keeps_sign175 [ 00:00:00] horae-core rse_cents_is_exact_where_a_float_would_drift176 [ 00:00:00] horae-core rse_cents_reads_whole_and_fractional_amounts177 [ 00:00:00] horae-core parse_cents_rejects_what_it_cannot_represent178 [ 00:00:00] horae-core se_cents_tolerates_grouping_spaces_and_signs179 PASS [ 0.013s] horae-core invoice::tests::selected_rate_mode_ignores_unselected_rate_sources180 PASS [ 0.012s] horae-core money::tests::addition_rejects_overflow_in_both_directions181 Running [ 00:00:00] ====> 80/160: 10 running, 80 passed, 0 skipped 182 [ 00:00:00] horae-core s::conversion_matches_exact_scaled_rationals183 [ 00:00:00] horae-core currency_checks_and_representable_boundaries184 [ 00:00:00] horae-core format_cents_plain_keeps_sign_below_one_unit185 [ 00:00:00] horae-core format_cents_groups_thousands_and_keeps_sign186 [ 00:00:00] horae-core rse_cents_is_exact_where_a_float_would_drift187 [ 00:00:00] horae-core rse_cents_reads_whole_and_fractional_amounts188 [ 00:00:00] horae-core parse_cents_rejects_what_it_cannot_represent189 [ 00:00:00] horae-core se_cents_tolerates_grouping_spaces_and_signs190 Running [ 00:00:00] ====> 107/160: 10 running, 107 passed, 0 skipped 191 [ 00:00:00] horae-core h_valid_grant_pair_and_its_revoked_selection192 [ 00:00:00] horae-core _name_decodes_without_legacy_role_conversion193 [ 00:00:00] horae-core :member_has_only_own_time_and_expense_access194 [ 00:00:00] horae-core mpotent_order_independent_and_duplicate_free195 [ 00:00:00] horae-core _reject_legacy_rank_names_and_unknown_values196 [ 00:00:00] horae-core ing_absent_permission_is_an_idempotent_no_op197 [ 00:00:00] horae-core r_grant_keeps_the_remaining_selection_closed198 [ 00:00:00] horae-core keeps_read_but_removes_managed_and_all_write199 PASS [ 0.016s] horae-core money::tests::addition_retains_currency_checks_and_representable_boundaries200 PASS [ 0.017s] horae-core money::tests::parse_cents_reads_whole_and_fractional_amounts201 PASS [ 0.017s] horae-core money::tests::parse_cents_tolerates_grouping_spaces_and_signs202 PASS [ 0.019s] horae-core money::tests::format_cents_plain_keeps_sign_below_one_unit203 PASS [ 0.019s] horae-core money::tests::parse_cents_is_exact_where_a_float_would_drift204 PASS [ 0.020s] horae-core money::tests::format_cents_groups_thousands_and_keeps_sign205 PASS [ 0.019s] horae-core money::tests::parse_cents_rejects_what_it_cannot_represent206 PASS [ 0.016s] horae-core permissions::catalog::stored_tests::rejects_each_missing_floor_grant207 PASS [ 0.017s] horae-core permissions::catalog::stored_tests::rejects_duplicate_grants_instead_of_silently_deduplicating208 PASS [ 0.014s] horae-core permissions::catalog::stored_tests::rejects_unsupported_versions_even_for_valid_grants209 PASS [ 0.019s] horae-core permissions::catalog::stored_tests::rejects_empty_saved_selection_instead_of_adding_member_floor210 PASS [ 0.013s] horae-core permissions::catalog::stored_tests::stored_order_does_not_change_the_selected_set211 PASS [ 0.018s] horae-core permissions::catalog::stored_tests::rejects_every_missing_prerequisite_without_repairing_input212 PASS [ 0.016s] horae-core permissions::catalog::stored_tests::restores_custom_selection_without_reapplying_profile_defaults213 PASS [ 0.018s] horae-core permissions::catalog::stored_tests::restores_each_builtin_selection_without_changing_grants214 PASS [ 0.012s] horae-core permissions::catalog::tests::administrator_selection_covers_known_catalog_without_unknown_ids215 PASS [ 0.014s] horae-core permissions::catalog::tests::adding_all_catalog_grants_produces_exactly_the_catalog216 PASS [ 0.011s] horae-core permissions::catalog::tests::approve_all_includes_read_scopes_but_not_write_or_expense_management217 PASS [ 0.014s] horae-core permissions::catalog::tests::dependency_graph_matches_the_reference_edges_without_extra_cross_resource_grants218 PASS [ 0.015s] horae-core permissions::catalog::tests::catalog_has_fifty_distinct_known_grants219 PASS [ 0.013s] horae-core permissions::catalog::tests::direct_profile_defaults_match_the_known_reference_catalog220 PASS [ 0.014s] horae-core permissions::catalog::tests::empty_selection_includes_member_floor221 PASS [ 0.015s] horae-core permissions::catalog::tests::every_profile_includes_floor_and_is_closed_under_dependencies222 PASS [ 0.018s] horae-core permissions::catalog::tests::every_declared_dependency_is_added_and_removing_it_removes_the_dependent223 Running [ 00:00:00] ====> 107/160: 10 running, 107 passed, 0 skipped 224 [ 00:00:00] horae-core h_valid_grant_pair_and_its_revoked_selection225 [ 00:00:00] horae-core _name_decodes_without_legacy_role_conversion226 [ 00:00:00] horae-core :member_has_only_own_time_and_expense_access227 [ 00:00:00] horae-core mpotent_order_independent_and_duplicate_free228 [ 00:00:00] horae-core _reject_legacy_rank_names_and_unknown_values229 [ 00:00:00] horae-core ing_absent_permission_is_an_idempotent_no_op230 [ 00:00:00] horae-core r_grant_keeps_the_remaining_selection_closed231 [ 00:00:00] horae-core keeps_read_but_removes_managed_and_all_write232 PASS [ 0.016s] horae-core permissions::catalog::tests::finance_profiles_cannot_edit_rates_and_project_manager_has_no_financial_grants233 PASS [ 0.012s] horae-core permissions::catalog::tests::floor_cannot_be_removed_or_partially_modified234 PASS [ 0.144s] horae-core importers::harvest::convert::tests::conversion_matches_exact_scaled_rationals235 Running [ 00:00:00] ====> 107/160: 10 running, 107 passed, 0 skipped 236 [ 00:00:00] horae-core h_valid_grant_pair_and_its_revoked_selection237 [ 00:00:00] horae-core _name_decodes_without_legacy_role_conversion238 [ 00:00:00] horae-core :member_has_only_own_time_and_expense_access239 [ 00:00:00] horae-core mpotent_order_independent_and_duplicate_free240 [ 00:00:00] horae-core _reject_legacy_rank_names_and_unknown_values241 [ 00:00:00] horae-core ing_absent_permission_is_an_idempotent_no_op242 [ 00:00:00] horae-core r_grant_keeps_the_remaining_selection_closed243 [ 00:00:00] horae-core keeps_read_but_removes_managed_and_all_write244 Running [ 00:00:00] =====> 123/160: 10 running, 123 passed, 0 skipped 245 [ 00:00:00] horae-core h_valid_grant_pair_and_its_revoked_selection246 [ 00:00:00] horae-core mpotent_order_independent_and_duplicate_free247 [ 00:00:00] horae-core ignment_removes_only_that_matching_dimension248 [ 00:00:00] horae-core rmissions::tests::scope_union_obeys_set_laws249 [ 00:00:00] horae-core cs_accept_same_day_but_reject_reversed_dates250 [ 00:00:00] horae-core cept_supported_currencies_and_optional_dates251 [ 00:00:00] horae-core ests::basics_reject_blank_and_overlong_names252 [ 00:00:00] horae-core eject_overlong_code_and_unsupported_currency253 PASS [ 0.012s] horae-core permissions::catalog::tests::profiles_reject_legacy_rank_names_and_unknown_values254 PASS [ 0.016s] horae-core permissions::catalog::tests::member_has_only_own_time_and_expense_access255 PASS [ 0.018s] horae-core permissions::catalog::tests::known_permission_name_decodes_without_legacy_role_conversion256 PASS [ 0.017s] horae-core permissions::catalog::tests::removing_absent_permission_is_an_idempotent_no_op257 PASS [ 0.019s] horae-core permissions::catalog::tests::removing_invoice_draft_write_keeps_read_but_removes_managed_and_all_write258 PASS [ 0.022s] horae-core permissions::catalog::tests::removing_one_financial_permission_preserves_unrelated_families259 PASS [ 0.022s] horae-core permissions::catalog::tests::removing_managed_time_read_also_removes_all_reads_writes_and_approvals260 PASS [ 0.023s] horae-core permissions::catalog::tests::removing_any_non_floor_grant_keeps_the_remaining_selection_closed261 PASS [ 0.022s] horae-core permissions::catalog::tests::template_names_reject_empty_and_overlong_unicode_names262 PASS [ 0.023s] horae-core permissions::catalog::tests::report_and_withdrawal_grants_do_not_add_unrelated_authority263 PASS [ 0.027s] horae-core permissions::catalog::tests::template_names_trim_without_changing_display_or_internal_spaces264 PASS [ 0.024s] horae-core permissions::catalog::tests::unknown_permission_names_are_rejected265 PASS [ 0.027s] horae-core permissions::tests::assignment_matching_searches_all_members_and_is_insensitive_to_duplicates266 PASS [ 0.026s] horae-core permissions::tests::assignments_do_not_grant_scope_and_missing_assignments_do_not_match267 PASS [ 0.026s] horae-core permissions::tests::every_scope_combination_matches_only_explicitly_granted_dimensions268 PASS [ 0.029s] horae-core permissions::tests::inactive_or_foreign_context_is_denied_for_every_scope_combination269 Running [ 00:00:00] =====> 123/160: 10 running, 123 passed, 0 skipped 270 [ 00:00:00] horae-core h_valid_grant_pair_and_its_revoked_selection271 [ 00:00:00] horae-core mpotent_order_independent_and_duplicate_free272 [ 00:00:00] horae-core ignment_removes_only_that_matching_dimension273 [ 00:00:00] horae-core rmissions::tests::scope_union_obeys_set_laws274 [ 00:00:00] horae-core cs_accept_same_day_but_reject_reversed_dates275 [ 00:00:00] horae-core cept_supported_currencies_and_optional_dates276 [ 00:00:00] horae-core ests::basics_reject_blank_and_overlong_names277 [ 00:00:00] horae-core eject_overlong_code_and_unsupported_currency278 Running [ 00:00:00] ======> 148/160: 10 running, 148 passed, 0 skipped 279 [ 00:00:00] horae-core mpotent_order_independent_and_duplicate_free280 [ 00:00:00] horae-core day::tests::format_12h_matches_harvest_style281 [ 00:00:00] horae-core time_of_day::tests::format_round_trips282 [ 00:00:00] horae-core _day::tests::parse_reads_12h_including_edges283 [ 00:00:00] horae-core time_of_day::tests::parse_reads_24h284 [ 00:00:00] horae-core ests::parse_rejects_out_of_range_and_garbage285 [ 00:00:00] horae-core ests::budget_kind_wire_strings_match_db_enum286 [ 00:00:00] horae-core e_of_day::tests::snap_rounds_to_nearest_step287 PASS [ 0.028s] horae-core permissions::tests::removing_an_assignment_removes_only_that_matching_dimension288 PASS [ 0.026s] horae-core project::tests::basics_accept_same_day_but_reject_reversed_dates289 PASS [ 0.024s] horae-core project::tests::basics_accept_supported_currencies_and_optional_dates290 PASS [ 0.030s] horae-core permissions::tests::scope_union_obeys_set_laws291 PASS [ 0.023s] horae-core project::tests::basics_reject_overlong_code_and_unsupported_currency292 PASS [ 0.025s] horae-core project::tests::basics_reject_blank_and_overlong_names293 PASS [ 0.021s] horae-core project::tests::fee_schedules_reject_missing_overlong_and_excessive_milestones294 PASS [ 0.024s] horae-core project::tests::fee_schedules_validate_amounts_and_milestone_total295 PASS [ 0.018s] horae-core project::tests::monetary_budgets_are_only_available_for_time_and_materials296 PASS [ 0.018s] horae-core project::tests::payment_terms_support_receipt_and_checked_days297 PASS [ 0.018s] horae-core project::tests::monthly_fee_dates_follow_calendar_months298 PASS [ 0.018s] horae-core project::tests::monthly_fee_dates_reject_invalid_calendar_inputs299 PASS [ 0.014s] horae-core rounding::tests::effective_minutes_respect_frozen_history_including_zero300 PASS [ 0.122s] horae-core permissions::catalog::stored_tests::restores_each_valid_grant_pair_and_its_revoked_selection301 PASS [ 0.015s] horae-core project::tests::percentage_rejects_invalid_precision_range_and_syntax302 PASS [ 0.015s] horae-core project::tests::percentage_preserves_exact_hundredths303 PASS [ 0.012s] horae-core rounding::tests::identity_when_inc_zero304 PASS [ 0.013s] horae-core rounding::tests::result_is_multiple_of_inc305 PASS [ 0.018s] horae-core rounding::tests::nearest_ties_round_up306 PASS [ 0.015s] horae-core rounding::tests::up_and_down307 PASS [ 0.016s] horae-core state::tests::only_manager_can_approve308 PASS [ 0.020s] horae-core state::tests::invoiced_is_final309 PASS [ 0.016s] horae-core state::tests::managers_invoice_open_and_approved_time310 PASS [ 0.017s] horae-core time_of_day::tests::clamp_to_day_prevents_crossing_midnight311 PASS [ 0.017s] horae-core state::tests::member_submit_and_reopen312 Running [ 00:00:00] ======> 148/160: 10 running, 148 passed, 0 skipped 313 [ 00:00:00] horae-core mpotent_order_independent_and_duplicate_free314 [ 00:00:00] horae-core day::tests::format_12h_matches_harvest_style315 [ 00:00:00] horae-core time_of_day::tests::format_round_trips316 [ 00:00:00] horae-core _day::tests::parse_reads_12h_including_edges317 [ 00:00:00] horae-core time_of_day::tests::parse_reads_24h318 [ 00:00:00] horae-core ests::parse_rejects_out_of_range_and_garbage319 [ 00:00:00] horae-core ests::budget_kind_wire_strings_match_db_enum320 [ 00:00:00] horae-core e_of_day::tests::snap_rounds_to_nearest_step321 PASS [ 0.012s] horae-core time_of_day::tests::format_round_trips322 PASS [ 0.019s] horae-core time_of_day::tests::format_12h_matches_harvest_style323 PASS [ 0.114s] horae-core permissions::catalog::tests::normalization_is_idempotent_order_independent_and_duplicate_free324 PASS [ 0.016s] horae-core time_of_day::tests::parse_reads_24h325 PASS [ 0.017s] horae-core time_of_day::tests::parse_reads_12h_including_edges326 PASS [ 0.012s] horae-core types::tests::budget_kind_wire_strings_match_db_enum327 PASS [ 0.014s] horae-core week::tests::configured_week_contains_each_day_for_all_seven_start_days328 PASS [ 0.015s] horae-core time_of_day::tests::snap_rounds_to_nearest_step329 PASS [ 0.015s] horae-core time_of_day::tests::parse_rejects_out_of_range_and_garbage330 PASS [ 0.015s] horae-core week::tests::configured_week_can_start_in_the_previous_year331 PASS [ 0.012s] horae-core week::tests::configured_week_reports_an_unrepresentable_start332 PASS [ 0.012s] horae-core week::tests::maps_any_weekday_to_its_monday333------------334 Summary [ 0.316s] 160 tests run: 160 passed, 0 skipped335 Running [ 00:00:00] ======= 160/160: 10 running, 148 passed, 0 skipped 336 [ 00:00:00] horae-core mpotent_order_independent_and_duplicate_free337 [ 00:00:00] horae-core day::tests::format_12h_matches_harvest_style338 [ 00:00:00] horae-core time_of_day::tests::format_round_trips339 [ 00:00:00] horae-core _day::tests::parse_reads_12h_including_edges340 [ 00:00:00] horae-core time_of_day::tests::parse_reads_24h341 [ 00:00:00] horae-core ests::parse_rejects_out_of_range_and_garbage342 [ 00:00:00] horae-core ests::budget_kind_wire_strings_match_db_enum343 [ 00:00:00] horae-core e_of_day::tests::snap_rounds_to_nearest_step344The files belonging to this database system will be owned by user "_nixbld11".345This user must also own the server process.346347The database cluster will be initialized with locale "C".348The default text search configuration will be set to "english".349350Data page checksums are disabled.351352fixing permissions on existing directory /nix/var/nix/builds/nix-57504-3225180469/tmp.JXMGDEmRY6 ... ok353creating subdirectories ... ok354selecting dynamic shared memory implementation ... posix355selecting default "max_connections" ... 100356selecting default "shared_buffers" ... 128MB357selecting default time zone ... UTC358creating configuration files ... ok359running bootstrap script ... ok360performing post-bootstrap initialization ... ok361syncing data to disk ... ok362363initdb: warning: enabling "trust" authentication for local connections364initdb: hint: You can change this by editing pg_hba.conf or using the option -A, or --auth-local and --auth-host, the next time you run initdb.365366Success. You can now start the database server using:367368 pg_ctl -D /nix/var/nix/builds/nix-57504-3225180469/tmp.JXMGDEmRY6 -l logfile start369370waiting for server to start.... done371server started372 Compiling proc-macro2 v1.0.106373 Compiling unicode-ident v1.0.24374 Compiling serde v1.0.228375 Compiling serde_core v1.0.228376 Compiling cfg-if v1.0.4377 Compiling libc v0.2.186378 Compiling memchr v2.8.3379 Compiling version_check v0.9.5380 Compiling log v0.4.33381 Compiling libm v0.2.16382 Compiling itoa v1.0.18383 Compiling equivalent v1.0.2384 Compiling foldhash v0.2.0385 Compiling once_cell v1.21.4386 Compiling pin-project-lite v0.2.17387 Compiling typenum v1.20.1388 Compiling slab v0.4.12389 Compiling parking_lot_core v0.9.12390 Compiling scopeguard v1.2.0391 Compiling crossbeam-utils v0.8.22392 Compiling futures-core v0.3.32393 Compiling zeroize v1.9.0394 Compiling crossbeam-epoch v0.9.20395 Compiling crossbeam-deque v0.8.7396 Compiling hashbrown v0.17.1397 Compiling rayon-core v1.13.0398 Compiling quote v1.0.46399 Compiling syn v2.0.118400 Compiling futures-task v0.3.32401 Compiling futures-io v0.3.32402 Compiling num-traits v0.2.19403 Compiling futures-sink v0.3.32404 Compiling futures-channel v0.3.32405 Compiling generic-array v0.14.7406 Compiling subtle v2.6.1407 Compiling zmij v1.0.21408 Compiling allocator-api2 v0.2.21409 Compiling fnv v1.0.7410 Compiling stable_deref_trait v1.2.1411 Compiling crc32fast v1.5.0412 Compiling getrandom v0.2.17413 Compiling rand_core v0.6.4414 Compiling errno v0.3.14415 Compiling jobserver v0.1.35416 Compiling find-msvc-tools v0.1.9417 Compiling base64 v0.22.1418 Compiling shlex v2.0.1419 Compiling const-oid v0.9.6420 Compiling cc v1.2.66421 Compiling tracing-core v0.1.36422 Compiling zerocopy v0.8.53423 Compiling anyhow v1.0.103424 Compiling utf8_iter v1.0.4425 Compiling rustc-hash v2.1.3426 Compiling percent-encoding v2.3.2427 Compiling serde_json v1.0.150428 Compiling simd-adler32 v0.3.9429 Compiling icu_properties_data v2.2.0430 Compiling icu_normalizer_data v2.2.0431 Compiling crypto-common v0.1.7432 Compiling block-buffer v0.10.4433 Compiling adler2 v2.0.1434 Compiling digest v0.10.7435 Compiling heck v0.5.0436 Compiling writeable v0.6.3437 Compiling miniz_oxide v0.8.9438 Compiling zlib-rs v0.6.6439 Compiling signal-hook-registry v1.4.8440 Compiling socket2 v0.6.4441 Compiling mio v1.2.1442 Compiling cpufeatures v0.2.17443 Compiling write16 v1.0.0444 Compiling time-core v0.1.9445 Compiling utf16_iter v1.0.5446 Compiling num-conv v0.2.2447 Compiling powerfmt v0.2.0448 Compiling time-macros v0.2.31449 Compiling form_urlencoded v1.2.2450 Compiling ryu v1.0.23451 Compiling slotmap v1.1.1452 Compiling memmap2 v0.9.11453 Compiling bitflags v2.13.0454 Compiling litemap v0.8.2455 Compiling rustversion v1.0.23456 Compiling deranged v0.5.8457 Compiling bumpalo v3.20.3458 Compiling winnow v0.7.15459 Compiling unicode-segmentation v1.13.3460 Compiling httparse v1.10.1461 Compiling arrayvec v0.7.8462 Compiling unicode-xid v0.2.6463 Compiling getrandom v0.4.3464 Compiling tinyvec_macros v0.1.1465 Compiling siphasher v1.0.3466 Compiling tinyvec v1.11.0467 Compiling semver v1.0.28468 Compiling hashbrown v0.16.1469 Compiling spin v0.9.8470 Compiling fastrand v2.4.1471 Compiling polycool v0.4.0472 Compiling time v0.3.53473 Compiling tower-service v0.3.3474 Compiling unicode-properties v0.1.4475 Compiling ring v0.17.14476 Compiling aho-corasick v1.1.4477 Compiling mime v0.3.17478 Compiling indexmap v2.14.0479 Compiling unicode-bidi v0.3.18480 Compiling fearless_simd v0.4.1481 Compiling regex-syntax v0.8.11482 Compiling synstructure v0.13.2483 Compiling wasmtime-internal-core v43.0.2484 Compiling unicode-normalization v0.1.25485 Compiling fdeflate v0.3.7486 Compiling zune-core v0.5.1487 Compiling zune-jpeg v0.5.15488 Compiling serde_path_to_error v0.1.20489 Compiling sha2 v0.10.9490 Compiling untrusted v0.9.0491 Compiling core_maths v0.1.1492 Compiling ident_case v1.0.1493 Compiling konst_macro_rules v0.2.19494 Compiling ipnet v2.12.0495 Compiling hayro-ccitt v0.3.0496 Compiling tower-layer v0.3.3497 Compiling serde_derive v1.0.228498 Compiling thiserror-impl v2.0.18499 Compiling zerofrom-derive v0.1.7500 Compiling yoke-derive v0.8.2501 Compiling zerovec-derive v0.11.3502 Compiling displaydoc v0.2.6503 Compiling futures-macro v0.3.32504 Compiling zerofrom v0.1.8505 Compiling yoke v0.8.3506 Compiling thiserror v2.0.18507 Compiling tracing-attributes v0.1.31508 Compiling cobs v0.3.0509 Compiling zerocopy-derive v0.8.53510 Compiling tokio-macros v2.7.0511 Compiling bytemuck_derive v1.11.0512 Compiling futures-util v0.3.32513 Compiling zerovec v0.11.6514 Compiling regex-automata v0.4.14515 Compiling tracing v0.1.44516 Compiling flate2 v1.1.9517 Compiling bytemuck v1.25.1518 Compiling ciborium-io v0.2.2519 Compiling hayro-jpeg2000 v0.3.5520 Compiling hayro-jbig2 v0.3.0521 Compiling png v0.18.1522 Compiling konst v0.2.20523 Compiling tinystr v0.8.3524 Compiling smallvec v1.15.2525 Compiling lock_api v0.4.14526 Compiling either v1.16.0527 Compiling bytes v1.12.0528 Compiling postcard v1.1.3529 Compiling rayon v1.12.0530 Compiling parking_lot v0.12.5531 Compiling kurbo v0.13.1532 Compiling tokio v1.52.3533 Compiling http v1.4.2534 Compiling cranelift-bitset v0.130.2535 Compiling uuid v1.23.4536 Compiling const_format_proc_macros v0.2.34537 Compiling float-cmp v0.9.0538 Compiling num-integer v0.1.46539 Compiling target-lexicon v0.13.5540 Compiling color_quant v1.1.0541 Compiling weezl v0.1.12542 Compiling quick-error v2.0.1543 Compiling proc-macro-hack v0.5.20+deprecated544 Compiling zerotrie v0.2.4545 Compiling potential_utf v0.1.5546 Compiling icu_collections v2.2.0547 Compiling http-body v1.0.1548 Compiling byteorder-lite v0.1.0549 Compiling unsafe-libyaml v0.2.11550 Compiling icu_locale_core v2.2.0551 Compiling dioxus-core-types v0.7.9552 Compiling getrandom v0.3.4553 Compiling image-webp v0.2.4554 Compiling const_format v0.2.36555 Compiling gif v0.14.2556 Compiling strict-num v0.1.1557 Compiling hayro-syntax v0.7.2558 Compiling euclid v0.22.14559 Compiling subsecond-types v0.7.9560 Compiling ttf-parser v0.25.1561 Compiling phf_shared v0.13.1562 Compiling sync_wrapper v1.0.2563 Compiling libloading v0.8.9564 Compiling httpdate v1.0.3565 Compiling unicode-script v0.5.8566 Compiling icu_provider v2.2.0567 Compiling cranelift-srcgen v0.130.2568 Compiling ppv-lite86 v0.2.21569 Compiling half v2.7.1570 Compiling icu_locale_data v2.2.0571 Compiling pxfm v0.1.30572 Compiling rand_chacha v0.3.1573 Compiling arrayref v0.3.9574 Compiling tiny-skia-path v0.12.0575 Compiling serde_yaml v0.9.34+deprecated576 Compiling rand v0.8.6577 Compiling icu_normalizer v2.2.0578 Compiling icu_properties v2.2.0579 Compiling ciborium-ll v0.2.2580 Compiling ciborium v0.2.2581 Compiling cranelift-assembler-x64-meta v0.130.2582 Compiling subsecond v0.7.9583 Compiling phf_generator v0.13.1584 Compiling http-body-util v0.1.3585 Compiling generational-box v0.7.9586 Compiling unic-langid-impl v0.9.6587 Compiling font-types v0.11.3588 Compiling pin-project-internal v1.1.13589 Compiling async-trait v0.1.89590 Compiling encoding_rs v0.8.35591 Compiling thiserror v1.0.69592 Compiling unicode-ccc v0.4.0593 Compiling rustix v1.1.4594 Compiling longest-increasing-subsequence v0.1.0595 Compiling unicode-bidi-mirroring v0.4.0596 Compiling base64ct v1.8.3597 Compiling same-file v1.0.6598 Compiling try-lock v0.2.5599 Compiling want v0.3.1600 Compiling walkdir v2.5.0601 Compiling pem-rfc7468 v0.7.0602 Compiling idna_adapter v1.2.2603 Compiling idna v1.1.0604 Compiling rustybuzz v0.20.1605 Compiling dioxus-core v0.7.9606 Compiling pin-project v1.1.13607 Compiling read-fonts v0.39.2608 Compiling url v2.5.8609 Compiling unic-langid-macros-impl v0.9.6610 Compiling rand_core v0.9.5611 Compiling tokio-util v0.7.18612 Compiling moxcms v0.8.1613 Compiling phf_macros v0.13.1614 Compiling pulley-macros v43.0.2615 Compiling thiserror-impl v1.0.69616 Compiling rustls-pki-types v1.15.0617 Compiling xmlwriter v0.1.0618 Compiling icu_collator_data v2.2.0619 Compiling paste v1.0.15620 Compiling imagesize v0.14.0621 Compiling wasm-bindgen-shared v0.2.126622 Compiling portable-atomic v1.13.1623 Compiling leb128fmt v0.1.0624 Compiling bit-vec v0.8.0625 Compiling bit-set v0.8.0626 Compiling phf v0.13.1627 Compiling unic-langid-macros v0.9.6628 Compiling icu_locale v2.2.0629 Compiling rand_chacha v0.9.0630 Compiling der v0.7.10631 Compiling cranelift-entity v0.130.2632 Compiling fontdb v0.23.0633 Compiling gimli v0.33.0634 Compiling svgtypes v0.16.1635 Compiling futures-executor v0.3.32636 Compiling serde_spanned v0.6.9637 Compiling toml_datetime v0.6.11638 Compiling enum-ordinalize-derive v4.4.1639 Compiling comemo-macros v0.5.1640 Compiling strum_macros v0.27.2641 Compiling wasmtime-internal-versioned-export-macros v43.0.2642 Compiling core-foundation v0.9.4643 Compiling sha1 v0.10.6644 Compiling quick-xml v0.41.0645 Compiling roxmltree v0.21.1646 Compiling simplecss v0.2.2647 Compiling data-url v0.3.2648 Compiling unicode-vo v0.1.0649 Compiling toml_write v0.1.2650 Compiling unscanny v0.1.0651 Compiling cranelift-isle v0.130.2652 Compiling wasmparser v0.239.0653 Compiling typst-utils v0.15.0654 Compiling linked-hash-map v0.5.6655 Compiling pico-args v0.5.0656 Compiling usvg v0.47.0657 Compiling yaml-rust v0.4.5658 Compiling toml_edit v0.22.27659 Compiling plist v1.10.0660 Compiling comemo v0.5.1661 Compiling enum-ordinalize v4.4.1662 Compiling spki v0.7.3663 Compiling strum v0.27.2664 Compiling cranelift-bforest v0.130.2665 Compiling rand v0.9.4666 Compiling unic-langid v0.9.6667 Compiling fancy-regex v0.16.2668 Compiling pulley-interpreter v43.0.2669 Compiling image v0.25.10670 Compiling axum-core v0.5.6671 Compiling num-bigint v0.4.8672 Compiling bincode v1.3.3673 Compiling wasmparser v0.245.1674 Compiling quick-xml v0.38.4675 Compiling warnings-macro v0.2.0676 Compiling convert_case v0.8.0677 Compiling hmac v0.12.1678 Compiling wasmi_core v1.1.0679 Compiling object v0.38.1680 Compiling thin-vec v0.2.18681 Compiling palette v0.7.6682 Compiling cranelift-codegen-shared v0.130.2683 Compiling chinese-variant v1.1.6684 Compiling roman-numerals-rs v3.1.0685 Compiling codex v0.3.0686 Compiling data-encoding v2.11.0687 Compiling unicode-math-class v0.1.0688 Compiling skrifa v0.42.1689 Compiling by_address v1.2.1690 Compiling rust_decimal v1.42.1691 Compiling rustls v0.23.41692 Compiling palette_derive v0.7.6693 Compiling biblatex v0.12.0694 Compiling wasmi_ir v1.1.0695 Compiling chinese-number v0.7.8696 Compiling citationberg v0.7.0697 Compiling cranelift-codegen-meta v0.130.2698 Compiling warnings v0.2.1699 Compiling syntect v5.3.0700 Compiling toml v0.8.23701 Compiling icu_collator v2.2.1702 Compiling pkcs8 v0.10.2703 Compiling futures v0.3.32704 Compiling rustls-webpki v0.103.13705 Compiling cranelift-assembler-x64 v0.130.2706 Compiling typst-timing v0.15.0707 Compiling ecow v0.2.6708 Compiling darling_core v0.21.3709 Compiling approx v0.5.1710 Compiling csv-core v0.1.13711 Compiling proc-macro2-diagnostics v0.10.1712 Compiling parking v2.2.1713 Compiling foldhash v0.1.5714 Compiling fast-srgb8 v1.0.0715 Compiling pkg-config v0.3.33716 Compiling atomic-waker v1.1.2717 Compiling cpp_demangle v0.4.5718 Compiling system-configuration-sys v0.6.0719 Compiling wasmi_collections v1.1.0720 Compiling lazy-js-bundle v0.7.9721 Compiling io-lifetimes v2.0.4722 Compiling mutate_once v0.1.2723 Compiling kamadak-exif v0.6.1724 Compiling wasm-bindgen-macro-support v0.2.126725 Compiling zstd-sys v2.0.16+zstd.1.5.7726 Compiling hashbrown v0.15.5727 Compiling hayagriva v0.10.1728 Compiling csv v1.4.0729 Compiling cranelift-codegen v0.130.2730 Compiling darling_macro v0.21.3731 Compiling typst-syntax v0.15.0732 Compiling wasm-encoder v0.245.1733 Compiling two-face v0.4.5734 Compiling dioxus-signals v0.7.9735 Compiling wasmi v1.1.0736 Compiling hkdf v0.12.4737 Compiling webpki-roots v1.0.8738 Compiling lipsum v0.9.1739 Compiling regex v1.13.0740 Compiling chrono v0.4.45741 Compiling typst-macros v0.15.0742 Compiling wasm-bindgen v0.2.126743 Compiling typst-assets v0.15.0744 Compiling wasmtime-internal-component-util v43.0.2745 Compiling winnow v1.0.3746 Compiling icu_segmenter_data v2.2.0747 Compiling typed-arena v2.0.2748 Compiling crc-catalog v2.5.0749 Compiling glidesort v0.1.2750 Compiling object v0.37.3751 Compiling arbitrary v1.4.2752 Compiling byteorder v1.5.0753 Compiling az v1.3.0754 Compiling termcolor v1.4.1755 Compiling wasmprinter v0.245.1756 Compiling crc v3.4.0757 Compiling toml_parser v1.1.2+spec-1.1.0758 Compiling cranelift-control v0.130.2759 Compiling wasm-bindgen-macro v0.2.126760 Compiling darling v0.21.3761 Compiling hashlink v0.10.0762 Compiling h2 v0.4.15763 Compiling typst-library v0.15.0764 Compiling regalloc2 v0.15.1765 Compiling serde_urlencoded v0.7.1766 Compiling color v0.3.3767 Compiling lazy_static v1.5.0768 Compiling hayro-postscript v0.1.0769 Compiling linebender_resource_handle v0.1.1770 Compiling io-extras v0.18.4771 Compiling dioxus-cli-config v0.7.9772 Compiling rustc-demangle v0.1.28773 Compiling wasmtime-environ v43.0.2774 Compiling hyper v1.10.1775 Compiling hayro-cmap v0.1.0776 Compiling peniko v0.6.1777 Compiling system-configuration v0.7.0778 Compiling dioxus-rsx v0.7.9779 Compiling enumset_derive v0.15.0780 Compiling concurrent-queue v2.5.0781 Compiling guillotiere v0.7.0782 Compiling const-serialize-macro v0.7.2783 Compiling cookie v0.18.1784 Compiling cap-primitives v3.4.5785 Compiling unicase v2.9.0786 Compiling strsim v0.11.1787 Compiling zstd-safe v7.2.4788 Compiling leb128 v0.2.7789 Compiling utf-8 v0.7.6790 Compiling ambient-authority v0.0.2791 Compiling wast v35.0.2792 Compiling mime_guess v2.0.5793 Compiling tokio-stream v0.1.18794 Compiling const-serialize v0.7.2795 Compiling js-sys v0.3.103796 Compiling vello_common v0.0.8797 Compiling event-listener v5.4.1798 Compiling icu_segmenter v2.2.0799 Compiling dioxus-core-macro v0.7.9800 Compiling enumset v1.1.13801 Compiling hyper-util v0.1.20802 Compiling futures-intrusive v0.5.0803 Compiling ar_archive_writer v0.5.2804 Compiling hayro-interpret v0.7.0805 Compiling fs-set-times v0.20.3806 Compiling crossbeam-queue v0.3.13807 Compiling dioxus-hooks v0.7.9808 Compiling dioxus-document v0.7.9809 Compiling dioxus-html-internal-macro v0.7.9810 Compiling wasm-encoder v0.253.0811 Compiling tower v0.5.3812 Compiling icu_provider_blob v2.2.0813 Compiling http v0.2.12814 Compiling keyboard-types v0.7.0815 Compiling serde_repr v0.1.20816 Compiling const-serialize-macro v0.8.0-alpha.0817 Compiling stringprep v0.1.5818 Compiling signature v2.2.0819 Compiling ff v0.13.1820 Compiling bitmaps v2.1.0821 Compiling im-rc v15.1.0822 Compiling multer v3.1.0823 Compiling home v0.5.12824 Compiling wasmtime-internal-unwinder v43.0.2825 Compiling compression-core v0.4.32826 Compiling hypher v0.1.7827 Compiling whoami v1.6.1828 Compiling maybe-owned v0.3.4829 Compiling hex v0.4.3830 Compiling dotenvy v0.15.7831 Compiling unicode-width v0.2.2832 Compiling rustls v0.21.12833 Compiling id-arena v2.3.0834 Compiling base16ct v0.2.0835 Compiling wit-parser v0.245.1836 Compiling sec1 v0.7.3837 Compiling sqlx-core v0.8.6838 Compiling wast v253.0.0839 Compiling sized-chunks v0.6.5840 Compiling dioxus-html v0.7.9841 Compiling compression-codecs v0.4.38842 Compiling group v0.13.0843 Compiling psm v0.1.31844 Compiling vello_cpu v0.0.8845 Compiling atoi v2.0.0846 Compiling tungstenite v0.29.0847 Compiling wasmtime-internal-jit-debug v43.0.2848 Compiling wasmtime-internal-fiber v43.0.2849 Compiling pic-scale v0.7.10850 Compiling rustls-webpki v0.101.7851 Compiling sct v0.7.1852 Compiling md-5 v0.10.6853 Compiling toml_datetime v0.7.5+spec-1.1.0854 Compiling serde_spanned v1.1.1855 Compiling crypto-bigint v0.5.5856 Compiling rand_xoshiro v0.6.0857 Compiling dirs-sys-next v0.1.2858 Compiling system-configuration-sys v0.5.0859 Compiling wasmtime-internal-cache v43.0.2860 Compiling fixedbitset v0.4.2861 Compiling cap-std v3.4.5862 Compiling toml_writer v1.1.1+spec-1.1.0863 Compiling wasmtime-internal-component-macro v43.0.2864 Compiling sqlx-postgres v0.8.6865 Compiling toml v0.9.12+spec-1.1.0866 Compiling petgraph v0.6.5867 Compiling elliptic-curve v0.13.8868 Compiling hayro v0.7.1869 Compiling wat v1.253.0870 Compiling directories-next v2.0.0871 Compiling tokio-tungstenite v0.29.0872 Compiling wasmtime-internal-wit-bindgen v43.0.2873 Compiling web-sys v0.3.103874 Compiling zstd v0.13.3875 Compiling async-compression v0.4.42876 Compiling hayro-svg v0.7.0877 Compiling h2 v0.3.27878 Compiling http-body v0.4.6879 Compiling witx v0.9.1880 Compiling tungstenite v0.28.0881 Compiling darling_core v0.23.0882 Compiling sharded-slab v0.1.7883 Compiling cfb v0.7.3884 Compiling wasmtime v43.0.2885 Compiling dioxus-history v0.7.9886 Compiling rustc_version v0.4.1887 Compiling matchers v0.2.0888 Compiling debugid v0.8.0889 Compiling proc-macro-utils v0.10.0890 Compiling itertools v0.14.0891 Compiling axum-macros v0.5.1892 Compiling stacker v0.1.24893 Compiling tracing-log v0.2.0894 Compiling socket2 v0.5.10895 Compiling thread_local v1.1.9896 Compiling inventory v0.3.24897 Compiling cbindgen v0.29.4898 Compiling matchit v0.8.4899 Compiling psl-types v2.0.11900 Compiling litrs v1.0.0901 Compiling wiggle-macro v43.0.2902 Compiling http-range-header v0.4.2903 Compiling rustix v0.38.44904 Compiling toml_datetime v1.1.1+spec-1.1.0905 Compiling nu-ansi-term v0.50.3906 Compiling toml_edit v0.25.12+spec-1.1.0907 Compiling tracing-subscriber v0.3.23908 Compiling document-features v0.2.12909 Compiling axum v0.8.9910 Compiling darling_macro v0.23.0911 Compiling tower-http v0.6.11912 Compiling publicsuffix v2.3.0913 Compiling dioxus-fullstack-core v0.7.9914 Compiling hyper v0.14.32915 Compiling wiggle-generate v43.0.2916 Compiling tempfile v3.27.0917 Compiling manyhow-macros v0.11.4918 Compiling infer v0.19.0919 Compiling fxprof-processed-profile v0.8.1920 Compiling curve25519-dalek v4.1.3921 Compiling sqlx-macros-core v0.8.6922 Compiling tokio-rustls v0.24.1923 Compiling wasm-compose v0.245.1924 Compiling wasm-bindgen-futures v0.4.76925 Compiling const-serialize v0.8.0-alpha.0926 Compiling tokio-rustls v0.26.4927 Compiling dioxus-interpreter-js v0.7.9928 Compiling write-fonts v0.48.1929 Compiling rfc6979 v0.4.0930 Compiling addr2line v0.26.1931 Compiling typst-layout v0.15.0932 Compiling headers-core v0.3.0933 Compiling wasmtime-internal-jit-icache-coherence v43.0.2934 Compiling convert_case v0.10.0935 Compiling pdf-writer v0.15.0936 Compiling rmp v0.8.15937 Compiling mach2 v0.4.3938 Compiling base64 v0.21.7939 Compiling base16 v0.2.1940 Compiling cap-fs-ext v3.4.5941 Compiling option-ext v0.2.0942 Compiling bitflags v1.3.2943 Compiling objc2 v0.6.4944 Compiling num-bigint-dig v0.8.6945 Compiling system-interface v0.27.3946 Compiling utf8parse v0.2.2947 Compiling anstyle-parse v1.0.0948 Compiling system-configuration v0.5.1949 Compiling dirs-sys v0.5.0950 Compiling cranelift-native v0.130.2951 Compiling cranelift-frontend v0.130.2952 Compiling prost-derive v0.14.4953 Compiling dioxus-router-macro v0.7.9954 Compiling hyper-rustls v0.24.2955 Compiling rustls-pemfile v1.0.4956 Compiling rmp-serde v1.3.1957 Compiling wasmtime-internal-cranelift v43.0.2958 Compiling hayro-write v0.7.0959 Compiling derive_more-impl v2.1.1960 Compiling headers v0.4.1961 Compiling ecdsa v0.16.9962 Compiling manganis-core v0.7.9963 Compiling sqlx-macros v0.8.6964 Compiling hyper-rustls v0.27.9965 Compiling gloo-utils v0.2.0966 Compiling manyhow v0.11.4967 Compiling cookie_store v0.22.1968 Compiling darling v0.23.0969 Compiling proc-macro-crate v3.5.0970 Compiling tokio-tungstenite v0.28.0971 Compiling primeorder v0.13.6972 Compiling tungstenite v0.27.0973 Compiling typst-svg v0.15.0974 Compiling typst-html v0.15.0975 Compiling webpki-roots v0.26.11976 Compiling tower-sessions-core v0.14.0977 Compiling subsetter v0.2.6978 Compiling dioxus-devtools-types v0.7.9979 Compiling charset v0.1.5980 Compiling tiny-skia v0.12.0981 Compiling num-iter v0.1.46982 Compiling serde_qs v0.15.0983 Compiling rgb v0.8.53984 Compiling async-stream-impl v0.3.6985 Compiling macro-string v0.1.4986 Compiling inout v0.1.4987 Compiling xxhash-rust v0.8.16988 Compiling anstyle-query v1.1.5989 Compiling sync_wrapper v0.1.2990 Compiling colorchoice v1.0.5991 Compiling xmp-writer v0.3.3992 Compiling webpki-roots v0.25.4993 Compiling dunce v1.0.5994 Compiling anstyle v1.0.14995 Compiling zip v2.4.2996 Compiling hashbrown v0.14.5997 Compiling askama_escape v0.13.0998 Compiling objc2-encode v4.1.0999 Compiling is_terminal_polyfill v1.70.21000 Compiling anstream v1.0.01001 Compiling dioxus-ssr v0.7.91002 Compiling krilla v0.8.21003 Compiling manganis-macro v0.7.91004 Compiling reqwest v0.11.271005 Compiling dioxus-fullstack-macro v0.7.91006 Compiling dashmap v6.2.11007 Compiling cipher v0.4.41008 Compiling async-stream v0.3.61009 Compiling resvg v0.47.01010 Compiling typst-realize v0.15.01011 Compiling content_disposition v0.4.01012 Compiling dioxus-devtools v0.7.91013 Compiling extism v1.30.01014 Compiling sqlx v0.8.61015 Compiling ureq v2.12.11016 Compiling async-tungstenite v0.31.01017 Compiling extism-convert-macros v1.30.01018 Compiling reqwest v0.12.281019 Compiling serde_with_macros v3.21.01020 Compiling derive_more v2.1.11021 Compiling typst-eval v0.15.01022 Compiling gloo-net v0.6.01023 Compiling axum-extra v0.10.31024 Compiling prost v0.14.41025 Compiling dioxus-router v0.7.91026 Compiling dirs v6.0.01027 Compiling wasm-streams v0.4.21028 Compiling dioxus-asset-resolver v0.7.91029 Compiling dioxus-logger v0.7.91030 Compiling cap-time-ext v3.4.51031 Compiling ed25519 v2.2.31032 Compiling cap-rand v3.4.51033 Compiling pkcs1 v0.7.51034 Compiling dioxus-stores-macro v0.7.91035 Compiling tracing-futures v0.2.51036 Compiling ureq-proto v0.6.01037 Compiling lru v0.16.41038 Compiling zopfli v0.8.31039 Compiling universal-hash v0.5.11040 Compiling ordered-float v2.10.11041 Compiling send_wrapper v0.6.01042 Compiling const-str v0.7.11043 Compiling opaque-debug v0.3.11044 Compiling utf8-zero v0.8.11045 Compiling base64 v0.13.11046 Compiling clap_lex v1.1.01047 Compiling dioxus-fullstack v0.7.9 (/nix/var/nix/builds/nix-57504-3225180469/source/vendor/dioxus-fullstack-0.7.9)1048 Compiling oauth2 v4.4.21049 Compiling clap_builder v4.6.01050 Compiling ureq v3.3.01051 Compiling poly1305 v0.8.01052 Compiling serde-value v0.7.01053 Compiling dioxus-server v0.7.91054 Compiling dioxus-stores v0.7.91055 Compiling rsa v0.9.101056 Compiling ed25519-dalek v2.2.01057 Compiling typst v0.15.01058 Compiling typst-kit v0.15.01059 Compiling extism-convert v1.30.01060 Compiling krilla-svg v0.8.11061 Compiling serde_with v3.21.01062 Compiling manganis v0.7.91063 Compiling chacha20 v0.9.11064 Compiling tower-sessions-memory-store v0.14.01065 Compiling p384 v0.13.11066 Compiling p256 v0.13.21067 Compiling tower-cookies v0.11.01068 Compiling itertools v0.10.51069 Compiling extism-manifest v1.30.01070 Compiling serde_plain v1.0.21071 Compiling clap_derive v4.6.11072 Compiling aead v0.5.21073 Compiling dioxus-config-macro v0.7.91074 Compiling glob v0.3.31075 Compiling dioxus-config-macros v0.7.91076 Compiling horae v0.1.0 (/nix/var/nix/builds/nix-57504-3225180469/source/crates/horae)1077 Compiling dyn-clone v1.0.201078 Compiling dioxus v0.7.91079 Compiling chacha20poly1305 v0.10.11080 Compiling tower-sessions v0.14.01081 Compiling typst-pdf v0.15.01082 Compiling typst-as-lib v0.16.01083 Compiling rust_xlsxwriter v0.80.01084 Compiling horae-core v0.1.0 (/nix/var/nix/builds/nix-57504-3225180469/source/crates/core)1085 Compiling tower-sessions-sqlx-store v0.15.01086 Compiling clap v4.6.11087 Compiling serial_test_derive v3.5.01088 Compiling openidconnect v3.5.01089 Compiling serial_test v3.5.01090 Compiling wiggle v43.0.21091 Compiling wasi-common v43.0.21092 Finished `test` profile [unoptimized + debuginfo] target(s) in 7m 42s1093 Running unittests src/main.rs (target/debug/deps/horae-d25262ae1fc74356)10941095running 899 tests1096test auth::oidc::tests::deactivated_email_match_is_denied ... ok1097test auth::oidc::tests::deactivated_subject_match_is_denied ... ok1098test auth::oidc::tests::no_account_is_denied_not_provisioned ... ok1099test auth::oidc::tests::first_login_links_subject_via_verified_email ... ok1100test auth::oidc::tests::subject_match_logs_in_without_relinking ... ok1101test auth::oidc::tests::extra_audiences_are_trusted_only_when_listed ... ok1102test auth::oidc::tests::subject_match_takes_precedence_over_email ... ok1103test auth::oidc::tests::unverified_email_is_not_matched ... ok1104test auth::page::tests::oidc_variant_uses_the_configured_label_and_hands_off_to_start ... ok1105test auth::page::tests::dev_variant_offers_the_admin_bypass_and_no_fake_controls ... ok1106test auth::page::tests::configured_label_is_html_escaped ... ok1107test cli::imports::tests::csv_named_pipe_is_rejected_without_waiting_for_a_writer ... ok1108test cli::imports::tests::invalid_csv_files_fail_before_contacting_the_server ... ok1109test cli::imports::tests::cancellation_racing_completion_does_not_claim_cancellation_was_requested ... ok1110test cli::imports::tests::api_submission_captures_generation_without_retrying_uncertain_acceptance ... ok1111test cli::imports::tests::missing_session_is_a_structured_configuration_failure ... ok1112test cli::imports::tests::malformed_submission_acknowledgement_retains_its_request_identity ... ok1113test cli::imports::tests::private_session_accepts_https_and_loopback_only ... ok1114test cli::imports::tests::redirects_are_not_followed_or_exposed_as_server_error_text ... ok1115test cli::imports::tests::retry_snapshot_is_compatible_with_missing_and_future_values ... ok1116test cli::imports::tests::missing_and_mismatched_jobs_fail_without_substitution ... ok1117test cli::imports::tests::session_rejects_cookie_header_injection_without_echoing_the_value ... ok1118test cli::imports::tests::report_marks_confirmed_failed_outcomes_as_incomplete ... ok1119test cli::imports::tests::archived_errors_publish_without_clobbering_and_preserve_the_prior_file_on_failure ... ok1120test cli::imports::tests::ordinary_json_is_bounded_and_invalid_replies_are_not_echoed ... ok1121test cli::imports::tests::session_rejects_public_permissions_and_symlinks ... ok1122test cli::imports::tests::session_rejects_plaintext_remote_and_credential_bearing_urls ... ok1123test cli::tests::environment_probe ... ok1124test cli::tests::remote_commands_reject_conflicting_or_unbounded_options ... ok1125test cli::tests::remote_import_and_job_commands_accept_the_documented_arguments ... ok1126test config::tests::dev_login_is_allowed_on_loopback ... ok1127test config::tests::dev_login_is_refused_off_loopback ... ok1128test cli::imports::tests::status_and_wait_distinguish_failed_jobs_from_failed_reads ... ok1129test config::tests::environment::environment_probe ... ok1130test config::tests::environment::empty_environment_has_no_authentication_or_plugin_credentials ... ok1131test cli::tests::default_command_uses_the_same_defaults_and_environment_as_serve ... ok1132test config::tests::environment::example_environment_can_configure_all_required_oidc_and_harvest_fields ... ok1133test cli::tests::default_command_rejects_invalid_environment_ports ... ok1134test config::tests::environment::obsolete_authentication_variables_do_not_configure_the_server ... ok1135test config::tests::environment::job_attempt_limit_uses_the_documented_environment_variable ... ok1136test config::tests::environment::partial_oidc_configuration_remains_disabled_without_a_callback ... ok1137test config::tests::without_dev_login_any_bind_is_fine ... ok1138test db::tests::pool_connections_force_custom_plans ... ok1139test config::tests::environment::mail_environment_requires_a_complete_valid_configuration ... ok1140test config::tests::environment::invalid_job_attempt_limits_reject_startup ... ok1141test config::tests::environment::secure_cookies_use_the_documented_prefixed_variable ... ok1142test auth::oidc::tests::linking::unverified_email_cannot_link_an_account ... ok1143test harvest::pagination_tests::harvest_own_time_omits_private_project_budget_metadata ... ok1144test auth::oidc::tests::linking::deactivation_during_first_link_denies_login ... ok1145test auth::oidc::tests::linking::existing_subject_wins_over_another_accounts_email ... ok1146test auth::oidc::tests::linking::simultaneous_logins_with_the_same_subject_are_allowed ... ok1147test auth::oidc::tests::linking::different_subjects_cannot_both_claim_an_unlinked_account ... ok1148test harvest::pagination_tests::harvest_pagination_total_pages_does_not_overflow ... ok1149test db::tests::reset_empties_the_database_and_reapplies_migrations ... ok1150test cli::imports::tests::wait_deadline_caps_a_pending_request_without_cancelling_the_job ... ok1151test harvest::pagination_tests::harvest_pagination_catalog_links_preserve_filters_and_break_name_ties ... ok1152test harvest::tests::a_manager_sees_the_whole_org ... ok1153test harvest::tests::a_manager_lists_users_with_their_rates ... ok1154test harvest::pagination_tests::harvest_pagination_empty_and_out_of_range_pages_keep_the_contract ... ok1155test harvest::tests::a_member_cannot_filter_to_a_colleague ... ok1156test harvest::tests::a_member_cannot_fetch_a_colleagues_entry ... ok1157test harvest::tests::a_member_cannot_list_users ... ok1158test harvest::pagination_tests::harvest_pagination_malformed_filters_are_client_errors ... ok1159test harvest::tests::a_member_sees_only_their_own_time_entries ... ok1160test harvest::pagination_tests::harvest_project_progress_permissions_cover_counts_pages_and_details ... ok1161test harvest::tests::harvest_effective_minutes_match_sql_for_open_and_frozen_time ... ok1162test harvest::tests::harvest_entry_rates_respect_selected_project_mode ... ok1163test harvest::tests::page_window_defaults_and_checked_offsets ... ok1164test harvest::tests::harvest_entry_rates_follow_the_cascade_and_frozen_invoice_line ... ok1165test harvest::tests::members_cannot_read_own_project_rates_or_cost_overrides ... ok1166test importers::harvest::account_switch::tests::a_b_a_keeps_old_callbacks_requests_and_retries_fenced ... ok1167test harvest::pagination_tests::harvest_pagination_time_entries_keep_the_filtered_set_and_date_ties ... ok1168test harvest::tests::harvest_marks_unbilled_non_billable_contexts_consistently ... ok1169test importers::harvest::account_switch::tests::change_preserves_terminal_history_and_rejects_stale_confirmation ... ok1170test importers::harvest::account_switch::tests::competing_change_and_submission_cannot_both_succeed ... ok1171test importers::harvest::account_switch::tests::disconnect_and_reconnect_fence_callbacks_but_not_same_account_work ... ok1172test harvest::tests::imported_legacy_rates_survive_retry_in_harvest_list_and_detail ... ok1173test importers::harvest::account_switch::tests::queue_acceptance_does_not_wait_for_the_import_session_lock ... ok1174test importers::harvest::api_source::http::tests::cancelled_backoff_does_not_wait_or_retry ... ok1175test importers::harvest::api_source::http::tests::cursor_links_are_authoritative_even_with_null_or_stale_page_numbers ... ok1176test importers::harvest::account_switch::tests::competing_callbacks_and_confirmations_have_one_winner ... ok1177test importers::harvest::api_source::http::tests::http_pages_follow_cursor_and_preserve_headers_and_encoded_filter ... ok1178test importers::harvest::account_switch::tests::queued_work_and_provenance_block_without_changing_binding ... ok1179test importers::harvest::api_source::http::tests::missing_next_cursor_is_not_silently_treated_as_completed ... ok1180test importers::harvest::api_source::http::tests::pagination_cycle_detection_survives_restarting_after_every_page ... ok1181test importers::harvest::api_source::http::tests::persisted_cursor_resumes_with_a_new_client_and_stays_complete_at_eof ... ok1182test importers::harvest::api_source::http::tests::rejected_page_does_not_advance_the_cursor ... ok1183test importers::harvest::api_source::http::tests::rejects_pagination_outside_the_authenticated_endpoint ... ok1184test importers::harvest::api_source::http::tests::resumed_cursor_rejects_untrusted_destinations_and_invalid_state_before_http ... ok1185test importers::harvest::account_switch::tests::running_jobs_block_change_and_old_execution_never_reaches_http ... ok1186test importers::harvest::api_source::tests::assembled_rows_convert_to_exact_minutes ... ok1187test importers::harvest::api_source::tests::assembles_rows_joining_parents_by_id ... ok1188test importers::harvest::api_source::tests::hours_render_as_exact_decimals ... ok1189test importers::harvest::api_source::tests::http_page_preserves_decimal_values_before_integer_conversion ... ok1190test importers::harvest::api_source::tests::json_exponents_expand_exactly_with_bounded_output ... ok1191test importers::harvest::api_source::http::tests::http_retries_429_but_never_follows_redirects_or_shortens_long_backoff ... ok1192test importers::harvest::credentials::tests::bad_key_length_is_rejected ... ok1193test importers::harvest::api_source::http::tests::http_rejects_oversized_malformed_and_cyclic_pages ... ok1194test importers::harvest::account_switch::tests::retry_and_change_are_serialized ... ok1195test importers::harvest::account_switch::tests::successful_change_preserves_business_rows_and_failure_rolls_back_secrets ... ok1196test harvest::pagination_tests::harvest_project_cost_overrides_require_admin_without_fabricated_fallback ... ok1197test importers::harvest::credentials::tests::decode_hex_rejects_bad_input ... ok1198test importers::harvest::credentials::tests::another_account_cannot_replace_credentials_or_watermarks ... ok1199test importers::harvest::credentials::tests::encrypt_then_decrypt_round_trips ... ok1200test importers::harvest::api_source::http::tests::slow_consumer_backpressures_http_and_cancellation_stops_further_pages ... ok1201test importers::harvest::credentials::tests::connection_changes_work_with_a_single_connection_pool ... ok1202test importers::harvest::credentials::tests::nonce_makes_ciphertext_nondeterministic ... ok1203test importers::harvest::credentials::tests::concurrent_first_connections_cannot_bind_different_accounts ... ok1204test harvest::pagination_tests::harvest_pagination_rejects_invalid_windows_on_every_collection ... ok1205test importers::harvest::credentials::tests::connect_and_disconnect_share_import_exclusion_without_blocking_other_orgs ... ok1206test importers::harvest::credentials::tests::wrong_key_fails_to_decrypt ... ok1207test importers::harvest::csv_source::tests::bad_date_becomes_a_row_error_not_a_rejection ... ok1208test importers::harvest::csv_source::tests::conflicting_email_aliases_error_only_the_affected_row ... ok1209test importers::harvest::csv_source::tests::cursor_beyond_upload_is_rejected_without_parsing_rows ... ok1210test importers::harvest::csv_source::tests::csv_records_preserve_multiline_unicode_across_single_byte_reads ... ok1211test importers::harvest::csv_source::tests::delivers_a_row_before_reading_the_rest_of_the_file ... ok1212test importers::harvest::csv_source::tests::empty_file_is_rejected ... ok1213test importers::harvest::csv_source::tests::cursor_resumes_after_multiline_unicode_and_preserves_error_locations ... ok1214test importers::harvest::csv_source::tests::invalid_utf8_errors_one_record_and_continues ... ok1215test importers::harvest::csv_source::tests::identity_columns_are_required_and_cannot_repeat ... ok1216test importers::harvest::csv_source::tests::missing_required_columns_is_rejected ... ok1217test importers::harvest::csv_source::tests::parse_bool_accepts_yes_variants ... ok1218test importers::harvest::csv_source::tests::names_stay_separate_from_optional_email ... ok1219test importers::harvest::csv_source::tests::parses_rows_case_insensitively ... ok1220test importers::harvest::credentials::tests::disconnect_preserves_identity_and_provenance_for_the_original_account ... ok1221test importers::harvest::credentials::tests::migration_binds_existing_connections_without_changing_secrets_or_markers ... ok1222test importers::harvest::credentials::tests::same_account_reconnect_rotates_encryption_without_resetting_watermarks ... ok1223test importers::harvest::credentials::tests::unidentified_legacy_provenance_requires_operator_review ... ok1224test importers::harvest::credentials::tests::failed_credential_write_does_not_leave_an_account_binding ... ok1225test importers::harvest::engine_tests::api_and_csv_share_the_lock_but_other_organizations_can_import ... ok1226test importers::harvest::engine_tests::api_connection_checks_work_with_a_single_connection_pool ... ok1227test importers::harvest::engine_tests::api_sync_adopts_entries_from_a_prior_csv_import ... ok1228test harvest::pagination_tests::harvest_pagination_router_preserves_session_and_tenant_guards ... ok1229test importers::harvest::credentials::tests::completed_credential_changes_allow_immediate_retries ... FAILED1230test importers::harvest::engine_tests::bad_records_are_reported_and_run_continues ... ok1231test importers::harvest::engine_tests::csv_malformed_file_is_rejected_with_no_writes ... ok1232test importers::harvest::engine_tests::concurrent_imports_reject_overlap_without_collapsing_repeated_entries ... ok1233test importers::harvest::engine_tests::cancelled_http_waiter_keeps_the_lock_until_its_worker_exits ... ok1234test importers::harvest::engine_tests::csv_import_populates_and_is_idempotent ... ok1235test importers::harvest::engine_tests::cancellation_rolls_back_rows_and_releases_the_import_session ... ok1236test importers::harvest::engine_tests::csv_name_fallback_requires_a_full_unique_name_and_never_overrides_email ... ok1237test importers::harvest::engine_tests::csv_ambiguous_names_include_inactive_users_but_unique_email_disambiguates ... ok1238test harvest::pagination_tests::harvest_task_access_filters_counts_and_preserves_rate_free_history ... ok1239test importers::harvest::engine_tests::completed_imports_allow_immediate_retries ... FAILED1240test importers::harvest::engine_tests::csv_streaming::csv_applies_before_eof_but_transport_failure_rolls_back_everything ... ok1241test importers::harvest::engine_tests::csv_name_only_matches_one_org_user_and_reimports_without_duplicates ... ok1242test importers::harvest::engine_tests::csv_name_only_dry_run_and_duplicate_occurrences_preserve_history ... ok1243test importers::harvest::engine_tests::csv_streaming::csv_preview_errors_and_repeated_rows_match_commit_and_reimport ... ok1244test importers::harvest::engine_tests::csv_streaming::cancelling_a_csv_waiting_for_more_bytes_releases_its_session ... ok1245test importers::harvest::engine_tests::csv_streaming::csv_sql_backpressure_stops_reading_later_input_rows ... ok1246test importers::harvest::engine_tests::csv_streaming::durable_csv_preview_crosses_batch_boundaries_without_committing_domain_data ... ok1247test importers::harvest::engine_tests::csv_streaming::durable_csv_preview_resumes_after_a_crash_without_recounting_rows ... ok1248test importers::harvest::engine_tests::csv_streaming::durable_csv_report_metadata_is_bounded_after_recovery ... ok1249test importers::harvest::engine_tests::csv_streaming::measure_csv_durable_100k ... ignored, 100,000-row durable CSV measurement; run explicitly with --release --nocapture1250test importers::harvest::engine_tests::csv_streaming::measure_csv_durable_large_catalog_100k ... ignored, 100,000-row durable CSV with 5,000 parent sets; run explicitly with --release --nocapture1251test importers::harvest::engine_tests::csv_streaming::measure_csv_streaming_100k ... ignored, 100,000-row CSV measurement; run explicitly with --release --nocapture1252test importers::harvest::engine_tests::csv_streaming::measure_csv_streaming_large_catalog_100k ... ignored, 100,000-row CSV with 5,000 parent sets; run explicitly with --release --nocapture1253test importers::harvest::engine_tests::csv_streaming::durable_csv_cancel_joins_parser_and_preserves_committed_rows ... ok1254test importers::harvest::engine_tests::csv_streaming::durable_csv_preview_cancel_preserves_simulation_for_manual_retry ... ok1255test importers::harvest::engine_tests::distinct_harvest_ids_with_identical_fields_import_as_two ... ok1256test importers::harvest::engine_tests::csv_streaming::durable_csv_preview_rejects_a_stale_next_batch ... ok1257test importers::harvest::engine_tests::csv_streaming::durable_csv_cancel_preserves_its_completed_batches_for_manual_retry ... ok1258test importers::harvest::engine_tests::csv_streaming::durable_csv_stale_commit_is_fenced_without_a_heartbeat ... ok1259test importers::harvest::engine_tests::csv_streaming::durable_csv_reclaimed_lease_cannot_commit_the_next_batch ... ok1260test importers::harvest::engine_tests::dry_run_writes_nothing_and_matches_commit ... ok1261test importers::harvest::engine_tests::csv_streaming::durable_csv_resumes_committed_batches_without_recounting_duplicate_rows ... ok1262test importers::harvest::engine_tests::lookup_cache::cold_query_callsite_on_untraced_thread_is_still_captured ... ok1263test importers::harvest::engine_tests::edited_entry_still_matched_by_provenance ... ok1264test importers::harvest::engine_tests::full_import_creates_all_levels_with_exact_minutes ... ok1265test importers::harvest::engine_tests::failed_source_releases_the_session_and_rolls_back_partial_rows ... ok1266test importers::harvest::engine_tests::lookup_cache::cached_project_task_still_validates_each_rows_rate ... ok1267test importers::harvest::engine_tests::import_rejects_ambiguous_normalized_email_without_partial_writes ... ok1268test importers::harvest::engine_tests::lookup_cache::cached_email_and_full_name_do_not_share_a_namespace ... ok1269test importers::harvest::engine_tests::lookup_cache::lookup_index_migration_preserves_existing_ambiguous_identities ... ok1270test importers::harvest::engine_tests::lookup_cache::rolled_back_row_does_not_cache_user_or_project_task ... ok1271test importers::harvest::engine_tests::natural_key_reimport_normalizes_whitespace_and_ascii_case ... ok1272test importers::harvest::engine_tests::overflowing_decimals_fail_only_their_rows ... ok1273test importers::harvest::engine_tests::lookup_cache::project_task_cache_distinguishes_both_sides_of_the_link ... ok1274test importers::harvest::engine_tests::lookup_cache::new_run_rechecks_previously_cached_user_for_ambiguity ... ok1275test importers::harvest::oauth::tests::authorize_url_carries_state_and_encoded_redirect ... ok1276test importers::harvest::oauth::tests::authorize_url_preserves_query_values_without_injecting_parameters ... ok1277test importers::harvest::oauth_callback_tests::account_policy_failures_return_safe_actionable_conflicts ... ok1278test importers::harvest::oauth_callback_tests::mismatched_state_is_rejected_without_a_code ... ok1279test importers::harvest::oauth_callback_tests::missing_returned_state_is_rejected ... ok1280test importers::harvest::oauth_callback_tests::missing_stored_state_is_rejected ... ok1281test importers::harvest::oauth_callback_tests::provider_error_is_rejected_before_exchange ... ok1282test importers::harvest::oauth_callback_tests::valid_matching_state_yields_the_code ... ok1283test importers::harvest::oauth_callback_tests::valid_state_but_missing_code_is_rejected ... ok1284test importers::harvest::report::tests::archive_metadata_cannot_masquerade_as_a_legacy_or_inconsistent_report ... ok1285test importers::harvest::report::tests::archived_report_round_trips_without_losing_error_accounting ... ok1286test importers::harvest::report::tests::legacy_report_preserves_its_counts_and_error_details ... ok1287test importers::harvest::report::tests::report_rejects_unsupported_and_invalid_versions ... ok1288test importers::harvest::report::tests::serialized_report_has_a_supported_schema_version ... ok1289test importers::harvest::resolve::checkpoint_tests::run_cache_round_trip_preserves_identity_namespaces_and_occurrences ... ok1290test importers::harvest::engine_tests::reimporting_identical_csv_rows_is_idempotent ... ok1291test importers::harvest::engine_tests::submission_barrier_blocks_imported_time_entries ... ok1292test importers::harvest::engine_tests::second_identical_run_creates_nothing ... ok1293test importers::harvest::resolve::preview::tests::checkpoint_restores_known_task_currency_and_keeps_old_currency_unknown ... ok1294test importers::harvest::engine_tests::watermark_advances_only_on_commit ... ok1295test importers::harvest::engine_tests::two_identical_csv_rows_import_as_two_entries ... ok1296test importers::harvest::streaming::durable::preview::tests::restoration_omits_unneeded_virtual_entries ... ok1297test importers::harvest::resolve::preview::tests::rejects_foreign_parent_snapshots_before_restoring_any_rows ... ok1298test importers::harvest::streaming::tests::api_planning_policy_ends_with_the_transaction ... ok1299test importers::harvest::engine_tests::lookup_cache::repeated_rows_resolve_each_user_and_project_task_once ... ok1300test importers::harvest::engine_tests::csv_streaming::csv_measurement_recovers_a_complete_batch_without_recounting ... ok1301test importers::harvest::sync_tests::api_requires_email_even_when_full_name_matches ... ok1302test importers::harvest::sync_tests::api_rejects_ambiguous_email_without_advancing_watermark ... ok1303test importers::harvest::engine_tests::large_run_reuses_parents_and_reconciles_totals ... ok1304test importers::harvest::sync_tests::checkpoints::durable_api_cancellation_preserves_confirmed_pages_for_manual_retry ... ok1305test importers::harvest::sync_tests::checkpoints::durable_api_preview_cancellation_preserves_confirmed_pages_for_manual_retry ... ok1306test importers::harvest::sync_tests::checkpoints::durable_api_finalization_retry_does_not_repeat_completed_downloads ... ok1307test importers::harvest::sync_tests::checkpoints::durable_api_preview_finalization_retry_does_not_repeat_completed_downloads ... ok1308test importers::harvest::sync_tests::checkpoints::durable_api_preview_reclaimed_worker_cannot_checkpoint_its_next_page ... ok1309test importers::harvest::engine_tests::csv_streaming::durable_csv_preview_matches_existing_and_new_rows_with_one_connection ... ok1310test importers::harvest::sync_tests::checkpoints::durable_api_preview_resume_preserves_row_errors ... ok1311test importers::harvest::sync_tests::checkpoints::durable_api_preview_resumes_catalog_download ... ok1312test importers::harvest::sync_tests::checkpoints::durable_api_preview_resumes_pages_without_publishing_domain_data ... ok1313test importers::harvest::sync_tests::checkpoints::durable_api_preview_resumes_after_a_confirmed_parent_batch ... ok1314test importers::harvest::sync_tests::checkpoints::durable_api_resume_keeps_earlier_errors_and_does_not_advance_watermark ... ok1315test importers::harvest::sync_tests::checkpoints::durable_api_resumes_a_partially_downloaded_catalog ... ok1316test importers::harvest::sync_tests::checkpoints::durable_api_resume_remembers_an_earlier_missing_timestamp ... ok1317test importers::harvest::sync_tests::checkpoints::durable_api_reclaimed_worker_cannot_commit_its_next_page ... ok1318test importers::harvest::sync_tests::disconnect_and_reconnect_preserves_imported_records_and_exact_identity ... ok1319test importers::harvest::sync_tests::dry_run_leaves_data_provenance_and_watermark_unchanged ... ok1320test importers::harvest::sync_tests::failed_client_propagates_to_project_and_entry_without_placeholder_records ... ok1321test importers::harvest::sync_tests::empty_sync_does_not_invent_a_watermark ... ok1322test importers::harvest::sync_tests::checkpoints::durable_api_resumes_committed_pages_and_preserves_the_high_watermark ... ok1323test importers::harvest::sync_tests::exact_api_decimals_survive_preview_commit_and_reimport ... ok1324test importers::harvest::sync_tests::failed_rows_are_available_to_the_next_incremental_retry ... ok1325test importers::harvest::sync_tests::invalid_parent_blocks_dependent_time_but_other_catalog_records_survive ... ok1326test importers::harvest::sync_tests::paging::cancelled_page_consumer_retains_lock_until_worker_exits_and_rolls_back ... ok1327test importers::harvest::sync_tests::missing_client_fallback_and_failed_project_savepoints_do_not_poison_cache ... ok1328test importers::harvest::sync_tests::missing_source_timestamp_keeps_the_previous_watermark ... ok1329test importers::harvest::sync_tests::out_of_range_api_decimals_error_per_row_and_leave_retry_watermark ... ok1330test importers::harvest::sync_tests::checkpoints::durable_api_preview_preserves_adoptions_and_repeated_ids_across_recovery ... ok1331test importers::harvest::sync_tests::checkpoints::failed_api_commit_publishes_its_last_confirmed_page_report ... ok1332test importers::harvest::sync_tests::paging::durable_api_stale_commit_cannot_advance_data_or_watermark ... ok1333test importers::harvest::sync_tests::scale::api_100k_commit_and_reimport ... ignored, 100,000-entry scale measurement; run explicitly with --release --nocapture1334test importers::harvest::sync_tests::scale::api_100k_dry_run ... ignored, 100,000-entry scale measurement; run explicitly with --release --nocapture1335test importers::harvest::sync_tests::scale::api_durable_100k_commit_and_reimport ... ignored, 100,000-entry durable API measurement; run explicitly with --release --nocapture1336test importers::harvest::sync_tests::scale::api_durable_100k_dry_run ... ignored, 100,000-entry durable API measurement; run explicitly with --release --nocapture1337test importers::harvest::sync_tests::checkpoints::failed_api_preview_publishes_its_last_confirmed_page_report ... ok1338test importers::harvest::sync_tests::paging::later_download_failure_rolls_back_parents_rows_and_watermark ... ok1339test importers::harvest::sync_tests::refreshed_tokens_survive_a_dry_run_rollback_in_the_same_import_session ... ok1340test importers::harvest::sync_tests::checkpoints::durable_api_resumes_after_a_confirmed_parent_batch ... ok1341test importers::harvest::sync_tests::parent_catalog_preserves_metadata_and_counts_each_entity_once ... ok1342test importers::harvest::sync_tests::parent_only_dry_run_previews_without_persisting_catalog ... ok1343test importers::harvest::sync_tests::parent_only_api_import_creates_catalog_and_reimport_skips_it ... ok1344test importers::harvest::sync_tests::successful_sync_only_marks_the_incrementally_fetched_entity ... ok1345test importers::harvest::sync_tests::watermark_never_passes_the_start_of_capture ... ok1346test init::tests::init_refuses_when_an_organization_exists ... ok1347test init::tests::init_creates_one_org_and_one_admin_and_nothing_else ... ok1348test importers::harvest::sync_tests::watermark_write_failure_rolls_back_imported_data ... ok1349test importers::harvest::sync_tests::paging::invalid_and_missing_timestamp_rows_cross_page_boundaries_without_advancing ... ok1350test jobs::outbox::tests::acknowledges_confirmed_delivery_without_reclaiming_it ... ok1351test jobs::outbox::tests::invalid_payload_is_not_delivered_and_does_not_leak_into_errors ... ok1352test importers::harvest::sync_tests::paging::durable_api_cancel_waits_for_the_producer_before_acknowledging ... ok1353test jobs::outbox::tests::plugin_failure_retries_with_the_same_event_identity ... ok1354test jobs::report::stream_tests::download_reports_missing_fragments_after_its_buffered_page ... ok1355test jobs::report::tests::upgrading_legacy_reports_preserves_errors_and_fences_old_attempts ... ok1356test importers::harvest::sync_tests::scale::durable_measurement_finishes_from_its_eof_checkpoint ... ok1357test importers::harvest::sync_tests::scale::http_pages_preview_commit_and_reimport ... ok1358test jobs::tests::cancellation_and_retry_are_scoped_and_idempotent ... ok1359test jobs::tests::claims_are_atomic_and_expired_leases_recover ... ok1360test jobs::report::tests::legacy_upgrade_preserves_job_states_and_existing_archives ... ok1361test jobs::report::stream_tests::download_keeps_its_snapshot_when_later_progress_archives_the_inline_tail ... ok1362test jobs::outbox::tests::worker_delivers_available_events_and_stops_cleanly ... ok1363test jobs::tests::cancellation_survives_a_crash_before_the_worker_acknowledges ... ok1364test jobs::tests::cleanup_retains_retryable_uploads_and_deletes_expired_jobs ... ok1365test jobs::tests::cancellation_waits_for_the_claimed_execution_before_allowing_retry ... ok1366test jobs::tests::expired_final_attempt_fails_without_claiming_again ... ok1367test jobs::report::stream_tests::download_reads_only_when_consumed_and_releases_its_connection ... ok1368test jobs::tests::history_paginates_tied_timestamps_and_rejects_foreign_cursors ... ok1369test jobs::tests::failed_csv_commit_retains_confirmed_report_through_history_and_retry ... ok1370test jobs::tests::concurrent_csv_resubmission_preserves_identity_after_upload_cleanup ... ok1371test jobs::tests::failed_csv_preview_retains_confirmed_report_through_history_and_retry ... ok1372test jobs::report::tests::report_fragments_survive_until_the_owning_job_expires ... ok1373test jobs::tests::import_adapters_reject_a_lease_from_another_organization ... ok1374test jobs::tests::final_failure_is_retained_and_manual_retry_gets_a_new_budget ... ok1375test jobs::tests::api_job_keeps_its_policy_across_duplicate_enqueue_and_manual_retry ... ok1376test jobs::tests::outbox_delivery_is_idempotent ... ok1377test importers::harvest::sync_tests::scale::durable_api_report_preserves_overflow_errors_after_recovery ... ok1378test jobs::tests::csv_job_persists_its_policy_with_the_upload ... ok1379test jobs::tests::payload_kind_is_stable_and_round_trips ... ok1380test jobs::tests::payload_versions_preserve_legacy_jobs_and_reject_unknown_versions ... ok1381test jobs::tests::outbox_claims_only_the_requested_event_kind ... ok1382test jobs::tests::retry_snapshot_does_not_guess_unknown_payloads_or_sources ... ok1383test jobs::tests::invalid_policy_cannot_enqueue_a_job_or_upload ... ok1384test jobs::tests::shutdown_deadline_drops_and_joins_in_flight_work ... ok1385test jobs::tests::shutdown_waits_for_in_flight_work ... ok1386test jobs::tests::retry_snapshot_matches_status_and_list_without_exposing_payload ... ok1387test jobs::tests::invalid_stored_payloads_reach_a_terminal_error ... ok1388test jobs::tests::outbox_stale_claims_cannot_acknowledge_or_reschedule_delivery ... ok1389test jobs::tests::missing_configuration_records_error_and_requeues ... ok1390test jobs::tests::synthetic_job_uses_the_same_registered_envelope ... ok1391test jobs::tests::upload_organization_must_match_its_job ... ok1392test models::project_creation::tests::draft_roundtrip_preserves_incomplete_input_without_demo_data ... ok1393test models::project_creation::tests::unauthorized_catalog_cost_is_absent_from_serialized_options ... ok1394test models::project_creation::tests::unknown_draft_fields_are_rejected ... ok1395test jobs::tests::stopped_worker_leaves_queued_jobs_unclaimed ... ok1396test notifications::tests::cancelling_delivery_kills_the_active_sender ... ok1397test jobs::tests::submission_key_cannot_change_csv_bytes_or_mode ... ok1398test notifications::tests::acknowledged_email_is_never_claimed_again ... ok1399test notifications::tests::disabled_mail_worker_does_not_claim_pending_notifications ... ok1400test notifications::tests::mail_configuration_is_disabled_by_default_and_rejects_partial_values ... ok1401test notifications::tests::mail_configuration_requires_an_executable_file_and_safe_sender ... ok1402test jobs::tests::expired_lease_cannot_renew_or_commit_using_an_old_transaction_timestamp ... ok1403test notifications::tests::recipient_injection_is_rejected_before_starting_a_process ... ok1404test notifications::tests::rendered_mail_bounds_body_lines_for_long_unicode_and_control_names ... ok1405test notifications::tests::foreign_notification_payload_is_terminal_and_never_sent ... ok1406test jobs::tests::outbox_same_kind_consumers_cannot_claim_the_same_lease ... ok1407test notifications::tests::failed_email_retries_same_identity_and_eventually_stops ... ok1408test notifications::tests::mail_worker_delivers_only_its_kind_and_drains_cleanly ... ok1409test notifications::tests::sendmail_receives_fixed_arguments_and_stable_message_identity ... ok1410test jobs::tests::synthetic_job_executes_through_claim_and_completion ... ok1411test notifications::tests::revoked_recipient_does_not_receive_a_pending_email ... ok1412test pages::clients::filters::tests::clearing_query_preserves_selected_currency_and_lifecycle ... ok1413test pages::clients::filters::tests::lifecycle_counts_share_query_and_currency_filters ... ok1414test pages::clients::filters::tests::name_search_ignores_case_and_surrounding_whitespace ... ok1415test pages::clients::filters::tests::preferred_or_visible_project_currency_matches_but_query_still_applies ... ok1416test pages::clients::form::tests::absent_billing_authority_never_produces_an_edit_payload ... ok1417test pages::clients::form::tests::ambiguous_creation_errors_require_explicit_recovery ... ok1418test pages::clients::form::tests::clearing_a_rate_is_explicit_and_needs_no_currency_confirmation ... ok1419test pages::clients::form::tests::invalid_fields_are_not_rewritten_by_validation ... ok1420test pages::clients::form::tests::rate_replacement_requires_confirmation_in_the_current_currency ... ok1421test pages::clients::form::tests::untouched_fields_keep_zero_rate_and_original_snapshot ... ok1422test pages::importers::presentation::tests::interrupted_report_is_partial_regardless_of_retry_prerequisites ... ok1423test pages::importers::presentation::tests::no_selection_does_not_claim_no_import_history ... ok1424test pages::importers::presentation::tests::source_labels_do_not_guess_unknown_importers ... ok1425test pages::importers::presentation::tests::states_and_phases_have_readable_unknown_fallbacks ... ok1426test pages::importers::presentation::tests::summaries_distinguish_zero_skipped_and_mixed_outcomes ... ok1427test pages::invoices::defaults_form::tests::invoice_fields_bound_metadata_by_characters_and_reject_nul ... ok1428test pages::invoices::defaults_form::tests::invoice_fields_preserve_exact_percentages_and_custom_terms ... ok1429test pages::invoices::defaults_form::tests::invoice_fields_preserve_receipt_terms_and_empty_optional_percentages ... ok1430test pages::invoices::defaults_form::tests::invoice_fields_reject_invalid_percentages_terms_and_second_tax ... ok1431test pages::invoices::preparation::fees::tests::fee_inputs_require_exact_amounts_and_an_explicit_positive_charge ... ok1432test pages::invoices::preparation::fees::tests::refresh_keeps_raw_edits_and_does_not_select_new_sources ... ok1433test pages::invoices::preparation::fees::tests::refresh_preserves_missing_or_relabelled_edits_until_explicit_removal ... ok1434test pages::invoices::preparation::tests::invoice_context_selects_only_the_exact_available_client ... ok1435test pages::invoices::preparation::tests::invoice_review_requires_matching_sources_and_valid_values ... ok1436test pages::invoices::preparation::tests::unavailable_or_malformed_invoice_context_never_uses_the_first_client ... ok1437test pages::new_project::basics::tests::a_batch_that_would_exceed_the_tag_limit_is_rejected ... ok1438test pages::new_project::basics::tests::a_full_tag_list_still_accepts_a_duplicate ... ok1439test pages::new_project::basics::tests::overlong_tags_are_rejected_without_truncation ... ok1440test pages::new_project::basics::tests::tag_length_counts_characters_instead_of_bytes ... ok1441test pages::new_project::basics::tests::tags_trim_and_deduplicate_without_changing_existing_spelling ... ok1442test pages::new_project::billing::tests::budget_errors_target_a_control_that_can_be_corrected ... ok1443test pages::new_project::draft::tests::a_mismatched_acknowledgement_does_not_lose_pending_input ... ok1444test pages::new_project::draft::tests::a_retry_keeps_the_unacknowledged_payload_and_revision ... ok1445test pages::new_project::draft::tests::a_validation_rejection_allows_corrected_input_at_the_same_revision ... ok1446test pages::new_project::draft::tests::an_empty_form_is_not_reported_as_saved ... ok1447test pages::new_project::draft::tests::any_saved_draft_wins_over_context_including_empty_or_matching_client ... ok1448test pages::new_project::draft::tests::context_prefills_only_a_new_form_without_fixing_its_currency ... ok1449test pages::new_project::draft::tests::resuming_preserves_the_server_identity_and_incomplete_fields ... ok1450test pages::new_project::team::tests::adding_everyone_deduplicates_without_replacing_project_overrides ... ok1451test pages::new_project::team::tests::exceeding_the_team_limit_does_not_partially_add_people ... ok1452test pages::new_project::team::tests::removing_a_member_keeps_an_empty_restricted_task_restricted ... ok1453test pages::new_project::tests::a_rejected_creation_can_be_edited_but_an_uncertain_commit_must_be_retried ... ok1454test pages::new_project::tests::only_known_validation_fields_can_target_a_control ... ok1455test pages::projects::budget_display_tests::configured_scopes_sum_without_hiding_an_individual_overrun ... ok1456test pages::projects::budget_display_tests::display_preserves_units_sign_and_large_integer_values ... ok1457test pages::projects::budget_display_tests::tag_filter_matches_identity_without_duplicates_or_name_collisions ... ok1458test pages::projects::budget_display_tests::unallocated_zero_and_overflow_budgets_are_not_conflated ... ok1459test pages::reports::tests::cost_total_uses_organization_currency_across_billing_currencies ... ok1460test pages::reports::tests::mixed_currencies_are_not_added_even_when_the_numbers_would_overflow ... ok1461test pages::reports::tests::monetary_total_overflow_is_visible_instead_of_panicking ... ok1462test pages::reports::tests::redacted_costs_do_not_become_zero_or_partial_totals ... ok1463test pages::reports::tests::single_currency_totals_are_formatted_and_empty_reports_have_no_amount ... ok1464test pages::timesheet::tests::cal_span_day_shows_only_the_anchor_column ... ok1465test pages::timesheet::tests::cal_span_defaults_to_week ... ok1466test pages::timesheet::tests::cal_span_unknown_falls_back_to_week ... ok1467test pages::timesheet::tests::cal_span_url_roundtrips ... ok1468test pages::timesheet::tests::cal_span_week_shows_all_seven_days ... ok1469test pages::timesheet::tests::cal_span_work_week_preserves_date_order_across_weekends ... ok1470test pages::timesheet::tests::cal_span_work_week_shows_monday_to_friday ... ok1471test pages::timesheet::tests::cal_span_work_week_skips_sunday_when_it_is_the_first_column ... ok1472test pages::timesheet::tests::day_col_class_marks_today ... ok1473test pages::timesheet::tests::day_col_class_marks_weekend ... ok1474test pages::timesheet::tests::day_col_class_plain_weekday ... ok1475test pages::timesheet::tests::day_col_class_today_wins_over_weekend ... ok1476test pages::timesheet::tests::invalid_duration_cannot_start_a_timer_save_or_clear_a_cell ... ok1477test pages::timesheet::tests::only_a_blank_duration_can_start_an_eligible_timer ... ok1478test pages::timesheet::tests::timed_lanes_still_widens_overlapping_entries ... ok1479test pages::timesheet::tests::timed_lanes_terminates_on_a_zero_length_entry ... ok1480test pages::timesheet::tests::today_offset_is_none_after_the_week ... ok1481test pages::timesheet::tests::today_offset_is_none_before_the_week ... ok1482test pages::timesheet::tests::today_offset_is_six_on_the_sunday ... ok1483test pages::timesheet::tests::today_offset_is_zero_on_the_monday ... ok1484test pages::timesheet::tests::value_cell_class_empty_wins_over_today ... ok1485test pages::timesheet::tests::value_cell_class_marks_today_when_nonzero ... ok1486test pages::timesheet::tests::weekend_style_follows_the_date_not_the_column_offset ... ok1487test pages::timesheet::tests::weekly_duration_edit_preserves_nine_am_start_notes_and_billability ... ok1488test pages::timesheet::tests::weekly_new_entries_are_untimed_and_explicit_clears_still_work ... ok1489test notifications::tests::sendmail_failure_does_not_expose_program_output ... ok1490test notifications::tests::stale_email_lease_cannot_start_delivery ... ok1491test notifications::tests::retry_can_recover_without_changing_message_identity ... ok1492test plugin::database::tests::application_database_owner_is_not_a_plugin_identity ... ok1493test jobs::tests::submission_key_cannot_change_api_mode_or_scope ... ok1494test notifications::tests::sendmail_timeout_kills_and_reaps_the_child ... ok1495test plugin::database::tests::dedicated_reader_is_accepted_but_new_write_grants_are_rejected ... ok1496test plugin::database::tests::reader_cannot_have_access_to_credentials ... ok1497test plugin::database::tests::reader_accepts_optional_first_party_rounding_helper ... ok1498test plugin::event::tests::active_transition_fires_only_on_a_real_flip ... ok1499test plugin::event::tests::budget_and_timer_events_serialize ... ok1500test plugin::event::tests::new_events_have_stable_hook_names ... ok1501test plugin::event::tests::project_membership_payload_excludes_private_configuration ... ok1502test plugin::event::tests::role_change_event_carries_previous_role ... ok1503test plugin::event::tests::submission_event_serializes_payload ... ok1504test plugin::event::tests::us2_events_have_stable_hook_names ... ok1505test plugin::host::tests::config_lookup::a_set_key_is_returned ... ok1506test plugin::host::tests::config_lookup::an_unset_key_is_none ... ok1507test plugin::database::tests::project_configuration_is_private_even_when_plugin_grants_are_misconfigured ... ok1508test notifications::tests::verbose_sender_output_is_discarded_without_blocking_delivery ... ok1509test plugin::database::tests::reader_cannot_switch_into_another_role ... ok1510test jobs::tests::missing_csv_upload_records_error_and_requeues ... ok1511test plugin::host::tests::database_tests::unconfigured_sql_never_falls_back_to_application_state ... ok1512test plugin::database::tests::reader_cannot_execute_security_definer_functions ... ok1513test plugin::host::tests::response_shaping::error_json_wraps_the_message ... ok1514test plugin::host::tests::response_shaping::http_body_accepts_the_size_limit_and_rejects_larger_responses ... ok1515test plugin::host::tests::response_shaping::http_response_carries_status_and_body ... ok1516test plugin::host::tests::response_shaping::invalid_http_utf8_is_an_error_not_an_empty_success ... ok1517test plugin::host::tests::statement_is_read_only::a_cte_select_is_allowed ... ok1518test plugin::host::tests::statement_is_read_only::a_second_statement_is_rejected ... ok1519test plugin::host::tests::statement_is_read_only::a_single_trailing_semicolon_is_allowed ... ok1520test plugin::host::tests::statement_is_read_only::a_write_hidden_behind_a_comment_is_rejected ... ok1521test plugin::host::tests::statement_is_read_only::plain_select_is_allowed ... ok1522test plugin::host::tests::statement_is_read_only::writes_are_rejected ... ok1523test plugin::host::tests::wrap_select::strips_a_trailing_semicolon_before_wrapping ... ok1524test plugin::host::tests::wrap_select::wraps_as_a_bounded_row_query ... ok1525test plugin::manifest::tests::accepts_all_published_business_events ... ok1526test plugin::manifest::tests::config_defaults_to_empty_when_absent ... ok1527test plugin::manifest::tests::parse_valid_manifest ... ok1528test plugin::manifest::tests::parses_optional_config_table ... ok1529test plugin::manifest::tests::reject_empty_hooks ... ok1530test plugin::manifest::tests::reject_unknown_hook ... ok1531test jobs::tests::outbox_rollback_does_not_publish_an_event ... ok1532test plugin::host::tests::database_queries_preserve_parameters_and_rollback_session_settings ... ok1533test plugin::database::tests::reader_rejects_unapproved_invoker_functions ... ok1534test plugin::host::tests::database_tests::query_discards_session_advisory_locks ... ok1535test plugin::host::tests::database_tests::query_results_are_bounded_without_silent_truncation ... ok15361537running 1 test1538test plugin::host::tests::database_tests::select_cannot_write_or_gain_application_privileges ... ok1539test plugin::registry::tests::initialization::guest_initializers_have_an_engine_instruction_budget ... ok15401541test result: ok. 1 passed; 0 failed; 0 ignored; 0 measured; 898 filtered out; finished in 0.18s154215431544running 1 test1545test plugin::registry::tests::initialization::guest_initializers_have_an_engine_instruction_budget ... ok15461547test result: ok. 1 passed; 0 failed; 0 ignored; 0 measured; 898 filtered out; finished in 0.17s154815491550running 1 test1551test jobs::tests::reclaimed_attempt_rejects_stale_results_even_with_the_same_worker_name ... ok1552test plugin::registry::tests::initialization::guest_initializers_have_an_engine_instruction_budget ... ok15531554test result: ok. 1 passed; 0 failed; 0 ignored; 0 measured; 898 filtered out; finished in 0.13s155515561557running 1 test1558test plugin::registry::tests::initialization::guest_initializers_have_an_engine_instruction_budget ... ok15591560test result: ok. 1 passed; 0 failed; 0 ignored; 0 measured; 898 filtered out; finished in 0.15s15611562test plugin::registry::tests::initialization::guest_initializers_have_an_engine_instruction_budget ... ok1563test plugin::registry::tests::initialization::instruction_budget_is_replenished_for_each_call ... ok1564test plugin::registry::tests::isolation::cancelling_a_waiter_keeps_capacity_reserved_until_the_host_call_exits ... ok1565test plugin::registry::tests::isolation::confirmed_dispatch_returns_overload_for_retry ... ok1566test plugin::registry::tests::isolation::confirmed_dispatch_returns_plugin_failure_for_retry ... ok1567test plugin::registry::tests::isolation::confirmed_dispatch_attempts_other_plugins_after_one_fails ... ok1568test plugin::registry::tests::isolation::confirmed_dispatch_waits_for_the_plugin_to_finish ... ok1569test plugin::registry::tests::isolation::different_plugins_share_the_running_call_limit ... ok1570test plugin::registry::tests::isolation::events_execute_outside_the_async_worker ... ok1571test plugin::registry::tests::isolation::loaded_plugins_cannot_grow_memory_past_the_limit ... ok1572test plugin::registry::tests::isolation::loaded_plugins_cannot_start_with_excessive_memory ... ok1573test plugin::registry::tests::isolation::oversized_wasm_output_is_rejected_before_copying_it ... ok1574test plugin::registry::tests::isolation::pending_capacity_rejects_new_work_without_spawning_tasks ... ok1575test plugin::registry::tests::isolation::widgets_execute_outside_the_async_worker ... ok1576test plugin::registry::tests::load_empty_directory ... ok1577test plugin::registry::tests::load_nonexistent_directory ... ok1578test plugin::registry::tests::isolation::oversized_event_payloads_are_not_queued ... ok1579test render::tests::invoice_template_formats_large_minor_units_exactly ... ok1580test reports::bounded::tests::cancelled_export_keeps_its_slot_until_the_renderer_exits ... ok1581test reports::bounded::tests::export_admission_stays_reserved_until_the_body_is_dropped ... ok1582test reports::bounded::tests::export_rendering_runs_off_the_async_worker ... ok1583test reports::bounded::tests::output_budget_checks_writes_and_seeks_without_truncation ... ok1584test reports::bounded::tests::rendered_output_limit_rejects_oversized_files_and_releases_admission ... ok1585test reports::bounded::tests::renderer_errors_and_panics_release_admission ... ok1586test plugin::host::tests::a_query_cannot_disable_its_own_deadline ... ok1587test reports::limits::tests::authorization::materialized_exports_deny_revoked_managers ... ok1588test reports::bounded::tests::timed_out_export_keeps_its_slot_until_the_renderer_exits ... ok1589test reports::limits::tests::authorization::materialized_exports_deny_winning_legacy_revocations ... ok1590test plugin::registry::tests::isolation::a_wasm_timeout_releases_the_worker_and_instance ... ok1591test plugin::registry::tests::load_test_plugins ... ok1592test plugin::registry::tests::dispatch_event_with_no_subscribers ... ok1593test plugin::registry::tests::collect_widgets_from_echo_plugin ... ok1594test plugin::host::tests::database_tests::wasm_host_uses_the_restricted_connection_on_a_current_thread_runtime ... ok1595test plugin::registry::tests::failing_plugin_does_not_block_caller ... ok1596test reports::limits::tests::authorization::materialized_exports_keep_deadlines_and_restore_pool_defaults ... ok1597test plugin::registry::tests::dispatch_invoice_sent_to_echo_plugin ... ok1598test plugin::registry::tests::dispatch_to_echo_plugin_succeeds ... ok1599test reports::limits::tests::authorization::materialized_exports_refresh_after_access_revision_change ... ok1600test reports::limits::tests::authorization::materialized_exports_recheck_after_render_without_retaining_authority ... ok1601test reports::limits::tests::bounded_entries_enforce_the_row_limit_after_all_filters ... ok1602test reports::limits::tests::authorization::materialized_exports_preserve_checked_snapshots ... ok1603test reports::limits::tests::bounded_invoice_limits_include_branding_and_preserve_tenant_scope ... ok1604test reports::limits::tests::export_queries_are_read_only_and_have_a_database_deadline ... ok1605test reports::limits::tests::measure_bounded_export_limits ... ignored, manual release export measurement; set HORAE_EXPORT_PROBE_DIR for artifacts1606test reports::limits::tests::export_size_checks_and_reads_share_a_repeatable_read_snapshot ... ok1607test reports::limits::tests::bounded_entries_reject_large_fields_and_combined_text ... ok1608test reports::limits::tests::invoice_exports_show_saved_adjustments_and_exact_large_amounts ... ok1609test reports::limits::tests::project_authorization::project_exports_cancel_loading_without_retaining_authority ... ok1610test reports::limits::tests::authorization::materialized_exports_retain_authority_and_release_cancelled_reads ... ok1611test reports::limits::tests::bounded_exports_preserve_real_workbooks_and_deterministic_pdf ... ok1612test reports::limits::tests::project_authorization::project_exports_deny_actor_revoked_during_either_authority_wait ... ok1613test reports::limits::tests::fee_exports_preserve_absent_quantities_and_render_a_real_pdf ... ok1614test reports::limits::tests::project_authorization::project_exports_refresh_scope_after_winning_relationship_changes ... ok1615test reports::limits::tests::authorization::materialized_exports_release_rendered_body_when_final_check_is_interrupted ... ok1616test reports::limits::tests::project_authorization::project_exports_preserve_membership_visibility_and_history_rules ... ok1617test reports::limits::tests::project_authorization::project_exports_require_current_tenant_bound_actor ... ok1618test reports::limits::tests::authorization::materialized_exports_require_same_tenant_active_actor ... ok1619test reports::limits::tests::project_authorization::project_exports_retain_parent_authority_until_release_check_finishes ... ok1620test reports::limits::tests::project_authorization::project_exports_share_one_size_and_payload_snapshot ... ok1621test reports::limits::tests::project_authorization::project_exports_release_every_captured_project_without_render_locks ... ok1622test reports::privacy_tests::unauthorized_project_text_does_not_affect_export_size_limits ... ok1623test reports::streaming::database_tests::measure_streaming_csv_export ... ignored, Manual release measurement of a 100,000-row CSV download1624test reports::limits::tests::project_authorization::project_exports_refresh_release_scope_after_parent_wait ... ok1625test reports::limits::tests::project_authorization::project_exports_reject_missing_foreign_and_unreadable_captured_ids ... ok1626test reports::limits::tests::project_authorization::project_exports_bound_rows_and_text_after_scope_filtering ... ok1627test reports::limits::tests::project_authorization::project_exports_release_cancelled_and_timed_out_checks ... ok1628test reports::streaming::database_tests::streamed_invoice_uses_stored_exact_cents_and_tenant_scoped_metadata ... ok1629test reports::streaming::database_tests::streamed_projects_preserve_scope_budget_and_tenant_isolation ... ok1630test reports::limits::tests::tag_filter_applies_before_xlsx_size_checks_and_rendering ... ok1631test reports::streaming::tests::completed_csv_keeps_admission_until_body_drop ... ok1632test reports::streaming::tests::csv_backpressure_and_body_drop_bound_and_cancel_source_reads ... ok1633test reports::streaming::tests::csv_does_not_truncate_a_quoted_unicode_record_larger_than_a_chunk ... ok1634test reports::streaming::tests::csv_emits_a_chunk_before_the_source_finishes ... ok1635test reports::streaming::tests::csv_failure_or_panic_after_a_chunk_is_not_successful_eof ... ok1636test reports::streaming::tests::csv_startup_errors_are_http_errors_and_release_admission ... ok1637test reports::streaming::database_tests::streamed_tag_filter_excludes_other_projects_without_duplicating_rows ... ok1638test reports::streaming::tests::dropping_csv_during_startup_cancels_the_producer ... ok1639test route::tests::client_detail_preserves_identity_and_highlights_only_clients ... ok1640test route::tests::client_workflow_paths_preserve_context_and_navigation_section ... ok1641test route::tests::edit_project_preserves_identity_and_highlights_only_projects ... ok1642test route::tests::malformed_context_reaches_the_workflow_for_validation_after_recovery ... ok1643test route::tests::new_project_is_static_and_highlights_only_projects ... ok1644test reports::streaming::database_tests::dropping_streamed_timesheet_closes_its_database_connection ... ok1645test reports::streaming::tests::csv_timeout_interrupts_an_already_started_body ... ok1646test seed::tests::concurrent_init_and_seed_cannot_mix_organizations ... ok1647test reports::streaming::database_tests::streamed_timesheet_exceeds_xlsx_row_limit_without_one_large_body_chunk ... ok1648test reports::streaming::database_tests::streamed_invoice_metadata_and_lines_share_one_snapshot ... ok1649test seed::tests::late_seed_failure_rolls_back_all_demo_data ... ok1650test reports::streaming::database_tests::streamed_timesheet_preserves_csv_escaping_frozen_zero_and_all_filters ... ok1651test reports::limits::tests::bounded_projects_filter_archives_before_size_checks ... ok1652test server_fns::approvals::submission_tests::cancelling_a_submission_releases_its_write_barrier ... ok1653test reports::privacy_tests::project_downloads_follow_progress_visibility ... ok1654test server_fns::approvals::submission_tests::submission_accepts_the_organizations_sunday_start ... ok1655test server_fns::approvals::submission_tests::submission_barrier_allows_shared_writers_for_the_same_user ... ok1656test seed::tests::concurrent_initializers_cannot_create_two_organizations ... ok1657test server_fns::approvals::submission_tests::submission_freezes_the_minutes_after_a_competing_edit ... ok1658test server_fns::approvals::submission_tests::submission_rejects_a_start_that_is_not_the_organizations_week_start ... ok1659test server_fns::approvals::submission_tests::submission_does_not_wait_for_another_users_writer ... ok1660test seed::tests::seed_refuses_a_second_organization_even_when_the_demo_exists ... ok1661test server_fns::approvals::tests::ignores_stopped_and_out_of_week_timers ... ok1662test server_fns::approvals::submission_tests::submission_uses_one_pool_connection ... ok1663test server_fns::approvals::submission_tests::submission_waits_for_a_new_timer_before_checking_the_week ... ok1664test server_fns::budget_tests::budget_notification_schema_enforces_tenants_and_no_public_access ... ok1665test server_fns::approvals::tests::sees_a_running_timer_inside_the_week ... ok1666test seed::tests::repeated_seed_preserves_every_row_and_user_edits ... ok1667test server_fns::budget_tests::concurrent_budget_checks_have_one_band_claimant ... ok1668test server_fns::budget_tests::configured_alert_and_outbox_roll_back_together ... ok1669test server_fns::budget_tests::configured_amount_budget_uses_resolved_rates_and_explicit_zero ... ok1670test server_fns::budget_tests::configured_alerts_deduplicate_concurrent_checks_and_recrossing ... ok1671test server_fns::budget_tests::configured_alerts_require_enabled_active_project_and_authorized_recipient ... ok1672test server_fns::budget_tests::configured_budget_does_not_read_foreign_or_legacy_projects ... ok1673test seed::tests::seed_refuses_an_initialized_organization_without_writes ... ok1674test server_fns::budget_tests::configured_alert_recipients_are_active_same_org_managers_and_project_leads ... ok1675test seed::tests::seed_leaves_an_older_or_partial_demo_unchanged ... ok1676test server_fns::budget_tests::configured_nonbillable_projects_count_time_without_hidden_checkbox ... ok1677test server_fns::budget_tests::configured_monthly_budget_excludes_other_months_and_nonbillable_time ... ok1678test server_fns::budget_tests::configured_monthly_budget_includes_leap_day_and_preserves_locked_rounding ... ok1679test server_fns::budget_tests::configured_task_and_person_budgets_do_not_share_consumption ... ok1680test server_fns::budget_tests::configured_person_budget_excludes_other_people_and_has_its_own_alert ... ok1681test server_fns::budget_tests::configured_budget_sweep_recovers_missed_checks_without_duplicates ... ok1682test server_fns::budget_tests::configured_task_fee_budget_respects_billability_and_alert_scope ... ok1683test server_fns::clients::tests::both_activation_transitions_change_once_and_preserve_details ... ok1684test server_fns::clients::tests::client_default_rate_prevents_currency_relabelling ... ok1685test server_fns::budget_tests::overview_budget_progress_includes_people_without_an_allowance ... ok1686test server_fns::clients::tests::client_default_rate_allows_detail_edits_and_equivalent_currency ... ok1687test server_fns::budget_tests::overview_budget_progress_batches_projects_without_mixing_scopes ... ok1688test server_fns::budget_tests::overview_budget_progress_is_current_period_scoped_and_authorized ... ok1689test seed::tests::concurrent_seed_runs_create_only_one_demo ... ok1690test server_fns::clients::tests::client_details_keep_catalog_identity_but_omit_member_billing ... ok1691test server_fns::clients::tests::client_details_distinguish_unset_zero_and_positive_manager_rates ... ok1692test server_fns::clients::tests::client_summaries_exclude_foreign_clients_and_unreadable_project_currencies ... ok1693test server_fns::clients::tests::client_details_hide_foreign_missing_and_inactive_actor_records ... ok1694test server_fns::clients::tests::client_invoices_keep_exact_client_scope_statuses_and_currencies ... ok1695test reports::streaming::database_tests::streamed_fee_invoice_has_no_fabricated_hours_or_hourly_rate ... ok1696test server_fns::clients::tests::client_invoices_require_manager_authority_even_without_invoices ... ok1697test server_fns::clients::tests::client_invoices_reject_a_winning_concurrent_revocation ... ok1698test server_fns::clients::tests::client_invoices_hold_authority_until_the_read_finishes ... ok1699test server_fns::clients::tests::concurrent_deletion_is_not_an_unchanged_mutation ... ok1700test server_fns::clients::tests::client_summaries_keep_catalog_without_projects_and_count_archived_projects ... ok1701test reports::streaming::database_tests::a_real_database_error_interrupts_the_csv_body ... ok1702test server_fns::clients::tests::each_field_changes_once_and_preserves_inactive_status ... ok1703test server_fns::clients::tests::client_summaries_follow_existing_progress_visibility_and_revoke_inactive_users ... ok1704test server_fns::clients::tests::currency_edit_rechecks_a_concurrently_added_client_default_rate ... ok1705test server_fns::clients::tests::client_summaries_reject_a_foreign_actor_even_when_client_org_is_known ... ok1706test server_fns::clients::tests::missing_and_foreign_clients_are_not_noops ... ok1707test server_fns::clients::tests::profile_create_persists_normalized_identity_and_exact_optional_rate ... ok1708test server_fns::clients::tests::profile_saves_reject_invalid_input_without_partial_writes ... ok1709test server_fns::clients::tests::profile_saves_recheck_manager_org_and_active_actor ... ok1710test server_fns::clients::tests::profile_noop_preserves_row_and_returns_no_update_event_signal ... ok1711test server_fns::clients::tests::profile_currency_change_without_a_rate_keeps_it_unset ... ok1712test server_fns::clients::tests::profile_update_rechecks_financial_snapshot_after_waiting_for_a_concurrent_edit ... ok1713test server_fns::clients::tests::profile_update_rejects_stale_currency_even_when_the_rate_is_still_unset ... ok1714test server_fns::clients::tests::profile_update_preserves_historical_rows_and_inactive_status ... ok1715test server_fns::importers::authorization_tests::cli_job_endpoints_have_stable_registered_paths ... ok1716test server_fns::clients::tests::profile_update_rechecks_authority_after_waiting_for_a_concurrent_demotion ... ok1717test server_fns::importers::authorization_tests::request_bound_import_endpoints_are_not_registered ... ok1718test server_fns::importers::csv_upload::tests::csv_upload_extractor_preserves_raw_bytes ... ok1719test server_fns::importers::csv_upload::tests::csv_upload_requires_its_header_without_reading_the_body ... ok1720test server_fns::importers::tests::concurrent_api_import_returns_a_retryable_conflict ... ok1721test server_fns::importers::tests::csv_route_rejects_invalid_modes_and_headers_without_reading_uploads ... ok1722test server_fns::importers::tests::submission_identity_rejects_expired_future_and_non_v7_keys ... ok1723test server_fns::clients::tests::profile_update_rejects_stale_rate_even_when_the_target_currency_is_unchanged ... ok1724test server_fns::clients::tests::profile_update_requires_explicit_rate_intent_for_currency_changes ... ok1725test server_fns::clients::tests::restoring_values_after_a_competing_edit_reports_a_change ... ok1726test server_fns::clients::tests::restoring_a_competing_deactivation_reports_reactivation ... ok1727test server_fns::clients::tests::unchanged_activation_preserves_the_row ... ok1728test server_fns::clients::tests::repeating_a_competing_edit_does_not_report_a_change ... ok1729test server_fns::clients::tests::unchanged_edit_preserves_the_row ... ok1730test server_fns::clients::tests::repeating_a_competing_deactivation_does_not_report_a_transition ... ok1731test server_fns::invoices::fee_tests::concurrent_invoices_claim_a_single_fee_once ... ok1732test server_fns::invoices::fee_tests::fee_invoice_does_not_claim_hours_or_another_clients_fee ... ok1733test server_fns::invoices::fee_tests::fee_occurrence_rejects_cross_organization_project ... ok1734test server_fns::importers::authorization_tests::job_endpoints_enforce_session_role_and_organization ... ok1735test server_fns::invoices::fee_tests::fee_total_overflow_rolls_back_occurrences_and_invoice ... ok1736test server_fns::invoices::fee_tests::fee_preview_keeps_source_identity_and_reports_discounted_draft_balances ... ok1737test server_fns::invoices::fee_tests::invoice_line_sources_reject_mixed_sources_and_invented_fee_quantities ... ok1738test server_fns::invoices::fee_tests::draft_fee_edit_replaces_amount_and_preserves_source_and_retry_identity ... ok1739test server_fns::invoices::fee_tests::draft_fee_edit_rejects_invalid_lines_and_current_unauthorized_actors ... ok1740test server_fns::invoices::fee_tests::milestones_include_unbilled_overdue_fees_but_not_future_fees ... ok1741test server_fns::invoices::fee_tests::invoice_defaults_apply_to_selected_fees_without_claiming_other_projects ... ok1742test server_fns::invoices::fee_tests::monthly_fees_use_calendar_dates_and_skip_already_claimed_months ... ok1743test server_fns::invoices::fee_tests::discounted_fee_leaves_a_balance_and_void_releases_only_its_contribution ... ok1744test server_fns::invoices::fee_tests::monthly_first_and_fifteenth_respect_partial_period_and_project_end ... ok1745test server_fns::invoices::fee_tests::draft_fee_edit_serializes_retries_and_rejects_stale_revisions ... ok1746test server_fns::invoices::fee_tests::mixed_time_and_fee_discount_conserves_cents_without_reopening_time ... ok1747test server_fns::invoices::fee_tests::draft_fee_edit_requires_current_balance_and_exact_excess_confirmation ... ok1748test server_fns::invoices::fee_tests::fee_preview_discount_ties_follow_source_keys_not_display_dates ... ok1749test server_fns::invoices::fee_tests::project_fee_context_keeps_monthly_balances_separate ... ok1750test server_fns::invoices::fee_tests::removing_discount_and_billing_the_remainder_cannot_both_succeed ... ok1751test server_fns::invoices::fee_tests::invoice_preview_does_not_materialize_fees_and_preserves_released_snapshots ... ok1752test server_fns::invoices::fee_tests::reviewed_generation_bills_partial_fees_and_rejects_stale_balances ... ok1753test server_fns::invoices::fee_tests::single_fee_can_be_invoiced_without_time ... ok1754test server_fns::invoices::fee_tests::reviewed_generation_rejects_changed_time_before_claiming_it ... ok1755test server_fns::invoices::fee_tests::void_releases_fee_identity_without_rewriting_the_original_line ... ok1756test server_fns::invoices::preview::tests::excess_rejects_an_unrepresentable_total_even_when_the_remainder_fits ... ok1757test server_fns::invoices::preview::tests::unselected_fee_currencies_do_not_relabel_or_block_selected_charges ... ok1758test server_fns::invoices::fee_tests::invoice_status_rechecks_authority_after_waiting_for_the_invoice_lock ... ok1759test server_fns::invoices::fee_tests::settled_fee_sources_remain_reviewable_without_automatic_charges ... ok1760test server_fns::invoices::fee_tests::reviewed_generation_does_not_materialize_unselected_months ... ok1761test server_fns::invoices::fee_tests::zero_fee_is_invoiced_once_until_voided ... ok1762test server_fns::invoices::fee_tests::concurrent_discounted_invoice_retries_return_one_invoice ... ok1763test server_fns::invoices::fee_tests::project_fee_context_matches_invoice_balances_and_current_authority ... ok1764test server_fns::invoices::snapshot_tests::editor::editor_snapshots_refresh_after_organization_row_change_without_rebasing_edits ... ok1765test server_fns::invoices::snapshot_tests::financial_snapshots_require_current_same_tenant_manager ... ok1766test server_fns::invoices::snapshot_tests::editor::editor_snapshots_preserve_rows_and_override_inherited_read_only ... ok1767test server_fns::invoices::snapshot_tests::races::financial_snapshots_deny_winning_actor_revocation_without_organization_change ... ok1768test server_fns::invoices::snapshot_tests::editor::editor_snapshots_deny_winning_legacy_revocation ... ok1769test server_fns::invoices::snapshot_tests::races::financial_snapshots_release_cancelled_reads_for_one_connection ... ok1770test server_fns::invoices::fee_tests::prepared_fee_selection_rejects_invalid_values_and_empty_generation ... ok1771test server_fns::invoices::snapshot_tests::races::financial_snapshots_hold_authority_until_materialization ... ok1772test server_fns::invoices::snapshot_tests::settings::financial_snapshots_honor_stricter_lock_timeout_during_authorization ... ok1773test server_fns::invoices::tests::assignment_gate_allows_inflight_invoice_organization_fks_to_finish ... ok1774test server_fns::invoices::tests::billing_cascade_agrees_across_all_four_levels_including_zero ... ok1775test server_fns::invoices::tests::configured_fixed_fee_hours_are_not_invoiced_but_legacy_fees_are_unchanged ... ok1776test server_fns::invoices::snapshot_tests::settings::financial_snapshots_override_isolation_but_restore_connection_settings ... ok1777test server_fns::invoices::tests::configured_project_currency_and_cost_override_keep_their_denominations ... ok1778test server_fns::invoices::tests::effective_minutes_migration_preserves_historical_invoice_quantities ... ok1779test server_fns::invoices::snapshot_tests::settings::financial_snapshots_retry_only_serialization_failures_and_stop_after_three ... ok1780test server_fns::invoices::fee_tests::reviewed_generation_requires_exact_excess_and_current_authority ... ok1781test server_fns::invoices::fee_tests::fee_balance_migration_allocates_discount_without_rewriting_invoice_snapshots ... ok1782test server_fns::invoices::tests::effective_minutes_sql_matches_domain_rounding ... ok1783test server_fns::invoices::snapshot_tests::editor::editor_snapshots_retain_authority_and_release_cancelled_reads ... ok1784test server_fns::invoices::tests::imported_rates::imported_legacy_project_keeps_exact_rates_and_totals_on_retry ... ok1785test server_fns::invoices::tests::invoice_defaults_apply_exact_adjustments_and_payment_terms ... ok1786test server_fns::invoices::tests::invoice_defaults_are_invoice_owned_and_only_drafts_are_editable ... ok1787test server_fns::invoices::tests::invoice_defaults_validate_all_override_fields ... ok1788test server_fns::invoices::tests::invoice_line_overflow_leaves_time_unbilled ... ok1789test server_fns::invoices::snapshot_tests::races::financial_snapshots_retry_organization_row_change_and_refresh_amounts ... ok1790test server_fns::invoices::tests::imported_rates::rejected_import_rate_does_not_poison_the_next_row_or_its_catalog_rate ... ok1791test server_fns::invoices::tests::invoice_defaults_selection_rejects_unavailable_projects_before_claiming ... ok1792test server_fns::invoices::snapshot_tests::editor::editor_snapshots_keep_invoice_metadata_revision_and_lines_together ... ok1793test server_fns::invoices::tests::invoice_total_overflow_leaves_all_time_unbilled ... ok1794test server_fns::invoices::snapshot_tests::races::financial_snapshots_keep_fee_values_from_their_initial_snapshot ... ok1795test server_fns::invoices::tests::invoice_transitions_reject_invalid_states_and_foreign_organizations ... ok1796test server_fns::invoices::tests::invoiced_amounts_survive_rate_changes_and_void_uses_current_rates ... ok1797test server_fns::invoices::tests::invoiced_billability_survives_later_project_changes ... ok1798test server_fns::invoices::tests::invoicing_leaves_running_time_open ... ok1799test server_fns::invoices::tests::invoice_preview_rejects_large_results_instead_of_truncating_them ... ok1800test server_fns::invoices::tests::invoicing_uses_and_freezes_effective_minutes ... ok1801test server_fns::invoices::tests::large_invoice_and_reports_agree_without_intermediate_overflow ... ok1802test server_fns::invoices::tests::mixed_project_currencies_cannot_partially_create_an_invoice ... ok1803test server_fns::invoices::tests::invoice_preview_matches_generation_without_claiming_time ... ok1804test server_fns::invoices::tests::only_running_time_does_not_create_an_invoice ... ok1805test server_fns::invoices::tests::non_billable_context_produces_no_unbilled_amount_on_any_report ... ok1806test server_fns::invoices::tests::project_rate_is_used_by_invoices_reports_and_spend ... ok1807test server_fns::invoices::tests::invoice_defaults_conflict_rolls_back_all_claims ... ok1808test server_fns::invoices::tests::selected_project_rate_modes_agree_across_billing_consumers ... ok1809test server_fns::invoices::tests::void_reopens_time_without_stale_rounding ... ok1810test server_fns::organization::tests::each_branding_field_changes_once_including_null_and_empty ... ok1811test server_fns::invoices::tests::void_waits_for_a_concurrent_payment_and_then_refuses ... ok1812test server_fns::organization::tests::missing_organization_is_not_an_unchanged_update ... ok1813test server_fns::organization::tests::repeating_a_competing_branding_edit_does_not_report_a_change ... ok1814test server_fns::organization::tests::unchanged_branding_preserves_the_row ... ok1815test server_fns::organization::tests::restoring_branding_after_a_competing_edit_reports_a_change ... ok1816test server_fns::permissions::storage_tests::additive_migration_preserves_populated_legacy_records ... ok1817test server_fns::invoices::tests::invoice_preview_requires_explicit_resolution_and_scopes_selected_projects ... ok1818test server_fns::invoices::tests::imported_rates::imported_task_rates_require_matching_currency_only_for_new_configured_links ... ok1819test server_fns::invoices::tests::invoice_defaults_legacy_insert_preserves_dates_and_exact_total ... ok1820test server_fns::permissions::storage_tests::malformed_stored_grants_fail_without_repair ... ok1821test server_fns::permissions::storage_tests::source_shape_and_revision_constraints_reject_invalid_rows ... ok1822test server_fns::invoices::tests::invoice_preview_keeps_time_rates_and_defaults_in_one_snapshot ... ok1823test server_fns::permissions::storage_tests::storage_does_not_activate_or_infer_legacy_roles ... ok1824test server_fns::project_creation::assignment_tests::finalization_reuses_catalog_and_keeps_lead_overrides_local_on_retry ... ok1825test server_fns::permissions::storage_tests::template_names_are_case_insensitive_and_tenant_local ... ok1826test server_fns::project_creation::assignment_tests::invalid_assignment_graphs_leave_no_partial_creation_or_draft_change ... ok1827test server_fns::project_creation::editing::tests::concurrent_edits_have_one_winner_and_association_writes_invalidate_open_forms ... ok1828test server_fns::invoices::tests::invoice_defaults_edit_rechecks_status_after_waiting_for_a_concurrent_send ... ok1829test server_fns::project_creation::editing::tests::editing_milestones_keeps_invoice_snapshots_and_fee_identities_immutable ... ok1830test server_fns::project_creation::editing::tests::editor_keeps_archived_selected_identities_and_nullable_overrides ... ok1831test server_fns::permissions::storage_tests::concurrent_equivalent_names_create_only_one_template ... ok1832test server_fns::project_creation::editing::tests::editor_preserves_fee_schedule_and_operational_milestone_ids ... ok1833test server_fns::project_creation::editing::tests::editor_loads_legacy_values_without_fabricating_a_billing_mode_or_draft ... ok1834test server_fns::project_creation::editing::tests::editor_rechecks_tenant_role_and_active_status ... ok1835test server_fns::permissions::storage_tests::person_state_rejects_duplicates_and_foreign_users_and_templates ... ok1836test server_fns::project_creation::editing::tests::editor_recovers_each_budget_scope_without_turning_absence_into_zero ... ok1837test server_fns::project_creation::editing::tests::editor_recovers_full_configuration_and_redacts_private_values_after_role_change ... ok1838test server_fns::project_creation::editing::tests::manager_edit_preserves_private_settings_and_cannot_remove_them_indirectly ... ok1839test server_fns::project_creation::editing::tests::foreign_actor_cannot_save_or_retry_another_organizations_edit ... ok1840test server_fns::project_creation::editing::tests::editor_load_uses_current_role_across_all_billing_configurations ... ok1841test server_fns::project_creation::editing::tests::save_updates_configured_sections_atomically_and_rejects_stale_or_invalid_edits ... ok1842test server_fns::project_creation::editing::tests::save_preserves_recorded_time_and_rejects_removing_its_task_or_person ... ok1843test server_fns::project_creation::editing::tests::saves_recheck_current_authority_and_do_not_repeat_noops ... ok1844test server_fns::project_creation::editing::tests::task_catalog_and_graph_changes_roll_back_together_on_duplicate_resolution ... ok1845test server_fns::project_creation::editing::tests::save_edits_the_same_legacy_project_and_never_creates_a_draft_or_configuration ... ok1846test server_fns::permissions::storage_tests::person_grants_and_identity_round_trip_independently_of_source ... ok1847test server_fns::project_creation::tests::creation_actor_is_revalidated_inside_the_transaction ... ok1848test server_fns::project_creation::tests::client_dialog_validates_details_and_persists_an_explicit_zero_rate ... ok1849test server_fns::project_creation::tests::billing_schema_rejects_partial_fee_schedules ... ok1850test server_fns::project_creation::tests::creation_client_must_be_active_and_in_the_same_organization ... ok1851test server_fns::project_creation::tests::draft_ownership_discard_and_role_changes_are_enforced ... ok1852test server_fns::project_creation::tests::draft_save_retries_do_not_overwrite_a_newer_revision ... ok1853test server_fns::permissions::storage_tests::referenced_template_deletion_requires_detaching_without_grant_or_identity_loss ... ok1854test server_fns::project_creation::tests::creation_options_are_scoped_bounded_and_redact_manager_costs ... ok1855test server_fns::project_creation::tests::draft_validation_preserves_incomplete_input_but_bounds_its_size ... ok1856test server_fns::project_creation::tests::final_validation_checks_invoice_defaults_and_scoped_budget_totals ... ok1857test server_fns::project_creation::tests::final_validation_preserves_exact_budgets_and_rejects_unavailable_email ... ok1858test server_fns::project_creation::tests::final_validation_requires_complete_fee_schedules_and_distinct_entities ... ok1859test server_fns::project_creation::tests::final_validation_requires_real_details_and_ignores_hidden_type_settings ... ok1860test server_fns::project_creation::tests::existing_projects_have_no_implicit_new_billing_configuration ... ok1861test server_fns::project_creation::tests::draft_schema_enforces_one_current_draft_per_creator ... ok1862test server_fns::project_creation::tests::finalization_persists_task_access_and_project_only_financial_overrides ... ok1863test server_fns::project_creation::tests::draft_schema_rejects_foreign_creator_and_completed_project ... ok1864test server_fns::project_creation::tests::managers_cannot_store_administrator_notes_or_costs_in_a_draft ... ok1865test server_fns::project_creation::import_tests::imported_catalog_rate_cannot_be_relabelled_as_workspace_currency ... ok1866test server_fns::project_creation::tests::draft_schema_rejects_oversize_payload_and_invalid_revision ... ok1867test server_fns::project_creation::tests::invalid_task_rolls_back_project_and_keeps_the_draft ... ok1868test server_fns::project_creation::tests::selected_catalog_bounds_requests_and_excludes_inactive_people ... ok1869test server_fns::project_creation::tests::selected_catalog_is_scoped_deduplicated_and_redacts_manager_costs ... ok1870test server_fns::project_creation::validation::tests::assignment_rejections_identify_the_invalid_row ... ok1871test server_fns::project_creation::tests::finalization_rechecks_client_role_revision_and_rate_currency ... ok1872test server_fns::project_creation::validation::tests::basic_rejections_identify_the_field_without_echoing_input ... ok1873test server_fns::project_creation::validation::tests::billing_rejections_identify_the_active_control ... ok1874test server_fns::project_creation::validation::tests::inactive_billing_inputs_remain_in_the_draft_without_blocking_creation ... ok1875test server_fns::project_creation::validation::tests::invoice_rejections_identify_the_field_without_echoing_input ... ok1876test server_fns::project_creation::validation::tests::non_billable_projects_ignore_hidden_invoice_inputs ... ok1877test server_fns::project_creation::tests::missing_draft_responses_do_not_disclose_foreign_ownership ... ok1878test server_fns::project_creation::validation::tests::milestone_rejections_target_the_invalid_row_by_identity ... ok1879test server_fns::project_creation::validation::tests::task_name_and_access_rejections_identify_the_invalid_row ... ok1880test server_fns::permissions::storage_tests::unicode_name_collision_rolls_back_migration_without_changing_profiles ... ok1881test server_fns::project_creation::tests::finalize_is_atomic_and_repeated_submission_returns_one_project ... ok1882test server_fns::project_creation::tests::selected_client_lookup_is_scoped_and_keeps_archived_identity ... ok1883test server_fns::project_creation::tests::simultaneous_draft_updates_have_one_winner ... ok1884test server_fns::projects::assignment_tests::creation_rejects_foreign_and_unknown_project_or_person ... ok1885test server_fns::projects::bulk_tests::bulk_database_failure_rolls_back_earlier_changes ... ok1886test server_fns::projects::bulk_tests::bulk_ids_validate_before_writes_and_normalize_duplicates ... ok1887test server_fns::projects::bulk_tests::bulk_accepts_one_hundred_projects_and_mixed_status_noops ... ok1888test server_fns::project_creation::locking_tests::every_project_entry_gates_before_actor_and_rechecks_revocation ... ok1889test server_fns::projects::bulk_tests::bulk_missing_or_foreign_project_rolls_back_earlier_changes ... ok1890test server_fns::permissions::storage_tests::unicode_name_migration_preserves_existing_templates ... ok1891test server_fns::projects::bulk_tests::bulk_reversed_overlapping_batches_finish_without_deadlock ... ok1892test server_fns::projects::bulk_tests::bulk_preserves_invoiced_history_assignments_and_spend ... ok1893test server_fns::projects::bulk_tests::bulk_status_preserves_details_history_and_noop_versions ... ok1894test server_fns::projects::assignment_tests::assignment_mutations_wait_for_revocation_and_recheck_authority ... ok1895test server_fns::projects::mutation_tests::project::both_activation_transitions_preserve_details_and_change_once ... ok1896test server_fns::projects::assignment_tests::stale_administrator_cannot_create_or_remove_after_revocation ... ok1897test server_fns::projects::mutation_tests::project::budgets_and_rates_distinguish_null_zero_and_normalized_values ... ok1898test server_fns::projects::mutation_tests::project::concurrent_deletion_is_rejected_by_both_mutations ... ok1899test server_fns::projects::details_tests::project_details_and_tags_follow_current_progress_and_private_permissions ... ok1900test server_fns::projects::mutation_tests::project::configured_edits_preserve_compatible_changes_and_idempotence ... ok1901test server_fns::projects::mutation_tests::project::configured_edits_recheck_settings_after_waiting_for_the_project ... ok1902test server_fns::projects::mutation_tests::project::configured_edits_preserve_non_hourly_billing ... ok1903test server_fns::projects::details_tests::project_details_only_offer_task_rate_currency_to_current_managers ... ok1904test server_fns::projects::mutation_tests::project::configured_edits_reject_incompatible_financial_changes_atomically ... ok1905test server_fns::projects::mutation_tests::project::missing_and_foreign_rows_are_not_noops ... ok1906test server_fns::projects::mutation_tests::project::repeating_a_competing_deactivation_reports_no_transition ... ok1907test server_fns::projects::mutation_tests::project::inactive_project_edits_preserve_identity_and_reject_implicit_migrations ... ok1908test server_fns::projects::mutation_tests::project::invalid_project_fields_leave_the_row_unchanged ... ok1909test server_fns::projects::details_tests::unlinked_and_private_project_tags_do_not_leak_into_filters ... ok1910test server_fns::projects::mutation_tests::project::repeating_a_competing_edit_requires_a_fresh_revision ... ok1911test server_fns::projects::mutation_tests::project::unchanged_activation_preserves_the_row ... ok1912test server_fns::projects::mutation_tests::project::restoring_a_competing_edit_does_not_overwrite_the_other_session ... ok1913test server_fns::projects::mutation_tests::project::restoring_a_competing_deactivation_reports_reactivation ... ok1914test server_fns::projects::mutation_tests::project::unchanged_edit_preserves_the_row ... ok1915test server_fns::projects::mutation_tests::task::both_activation_transitions_preserve_details_and_change_once ... ok1916test server_fns::projects::mutation_tests::task::repeating_a_competing_deactivation_reports_no_transition ... ok1917test server_fns::projects::mutation_tests::task::repeating_a_competing_edit_does_not_report_a_change ... ok1918test server_fns::projects::mutation_tests::task::rate_edits_set_currency_without_relabelling_renames_or_noops ... ok1919test server_fns::projects::mutation_tests::task::missing_and_foreign_rows_are_not_noops ... ok1920test server_fns::projects::mutation_tests::task::concurrent_deletion_returns_not_found_for_both_mutations ... ok1921test server_fns::projects::mutation_tests::task::each_detail_field_changes_once_and_preserves_inactive_status ... ok1922test server_fns::projects::mutation_tests::task::unchanged_edit_preserves_the_row ... ok1923test server_fns::projects::privacy_tests::legacy_members_retain_progress_without_new_settings ... ok1924test server_fns::projects::mutation_tests::task::restoring_a_competing_deactivation_reports_reactivation ... ok1925test server_fns::projects::mutation_tests::task::unchanged_activation_preserves_the_row ... ok1926test server_fns::projects::mutation_tests::task::restoring_a_competing_edit_reports_a_change ... ok1927test server_fns::projects::privacy_tests::client_project_filter_preserves_progress_access_and_rate_redaction ... ok1928test server_fns::project_creation::import_tests::imports_preserve_finalized_project_configuration_and_restricted_access ... ok1929test server_fns::projects::tests::assignments_are_scoped_to_the_viewers_organization ... ok1930test server_fns::projects::tests::creating_a_project_task_enables_it_with_its_defaults ... ok1931test server_fns::projects::privacy_tests::revoked_membership_preserves_only_own_historical_tracking_identity ... ok1932test server_fns::projects::privacy_tests::private_progress_does_not_prevent_tracking_or_reveal_financial_fields ... ok1933test server_fns::projects::assignment_tests::project_membership_and_task_callers_wait_before_authorizing ... ok1934test server_fns::projects::privacy_tests::project_reads_use_current_authority_and_reject_foreign_scope ... ok1935test server_fns::projects::privacy_tests::outsiders_and_inactive_viewers_have_no_project_reads ... ok1936test server_fns::projects::privacy_tests::project_members_and_leads_receive_progress_without_rates ... ok1937test server_fns::projects::tests::enabling_tasks_rejects_invalid_or_wrong_currency_explicit_rates_without_linking ... ok1938test server_fns::projects::tests::enabling_tasks_rejects_incompatible_catalog_currency ... ok1939test server_fns::projects::tests::project_rate_distinguishes_inheritance_zero_and_exact_amounts ... ok1940test server_fns::projects::assignment_tests::own_assignment_lifecycle_preserves_role_and_duplicate_behavior ... ok1941test server_fns::projects::tests::failed_project_task_creation_leaves_no_orphan_task ... ok1942test server_fns::projects::tests::enabling_tasks_rejects_explicit_rates_unused_by_the_project ... ok1943test server_fns::projects::tests::managers_and_admins_can_read_assignment_rates ... ok1944test server_fns::projects::tests::enabling_tasks_accepts_exact_project_currency_rates_and_preserves_existing_links ... ok1945test server_fns::projects::tests::enabling_is_tenant_scoped_even_for_existing_links_and_preserves_overrides ... ok1946test server_fns::projects::tests::enabling_tasks_only_inherits_rates_used_by_configured_projects ... ok1947test server_fns::projects::tests::project_rate_sql_matches_rust_for_missing_zero_and_present_sources ... ok1948test server_fns::projects::tests::project_rate_helper_has_no_public_execute_grant ... ok1949test server_fns::projects::tests::members_can_list_identities_but_not_assignment_rates ... ok1950test server_fns::projects::tests::unknown_catalog_currency_requires_explicit_configured_rates_but_preserves_legacy ... ok1951test server_fns::projects::assignment_tests::removal_preserves_foreign_and_malformed_assignments ... ok1952test server_fns::reports::tests::filters_and_renames_keep_report_identity_and_totals ... ok1953test server_fns::reports::tests::manager_report_omits_groups_containing_private_project_costs ... ok1954test server_fns::reports::tests::report_uses_current_active_actor_and_tenant_for_every_filter ... ok1955test server_fns::reports::tests::same_names_keep_separate_groups_for_every_dimension ... ok1956test server_fns::time_entries::tests::a_limit_bounds_a_listing_on_its_own ... ok1957test server_fns::time_entries::tests::a_reorder_rejects_foreign_missing_timed_and_duplicate_ids ... ok1958test server_fns::reports::tests::tag_filters_keep_report_dimensions_and_details_in_sync ... ok1959test server_fns::time_entries::tests::a_running_timer_cannot_be_moved_to_another_day ... ok1960test server_fns::time_entries::tests::admin_may_log_time_without_assignment ... ok1961test server_fns::time_entries::tests::an_unlimited_listing_needs_both_ends_of_the_range ... ok1962test server_fns::snapshot::reader_tests::legacy_readers_preserve_inherited_connection_settings ... ok1963test server_fns::time_entries::tests::clamps_duration_against_the_snapped_start ... ok1964test server_fns::time_entries::tests::an_open_entry_can_move_into_a_day_with_locked_time ... ok1965test server_fns::time_entries::tests::concurrent_timer_starts_insert_exactly_one_entry ... ok1966test server_fns::time_entries::tests::assigned_member_may_log_time ... ok1967test server_fns::snapshot::reader_tests::legacy_readers_reject_revoked_session_identity ... ok1968test server_fns::time_entries::tests::edits_preserve_archived_time_but_cannot_override_non_billability ... ok1969test server_fns::time_entries::tests::moving_locked_time_rejects_the_entire_reorder ... ok1970test server_fns::time_entries::tests::inactive_project_cannot_accept_new_time_even_for_admin ... ok1971test server_fns::time_entries::tests::rejects_out_of_range_start ... ok1972test server_fns::time_entries::tests::snaps_unaligned_start_to_the_grid ... ok1973test server_fns::time_entries::tests::new_time_and_picker_reject_inactive_or_foreign_contexts ... ok1974test server_fns::snapshot::reader_tests::legacy_readers_deny_writer_first_revocation ... ok1975test server_fns::time_entries::tests::unassigned_member_is_forbidden ... ok1976test server_fns::time_entries::tests::untimed_start_is_left_untouched ... ok1977test server_fns::time_entries::tests::submission_barrier_blocks_manual_entries_and_timer_starts ... ok1978test server_fns::time_entries::tests::new_time_uses_effective_billability_for_manual_entries_and_timers ... ok1979test server_fns::time_entries::tests::new_time_and_picker_require_a_project_task_link ... ok1980test server_fns::time_entries::tests::submission_barrier_blocks_edits_and_cross_week_reorders ... ok1981test server_fns::reports::tests::shared_person_and_task_are_partitioned_by_currency ... ok1982test server_fns::time_entries::update_tests::effective_billability_noop_preserves_the_row ... ok1983test server_fns::time_entries::update_tests::competing_edit_that_restores_old_values_still_reports_a_change ... ok1984test server_fns::time_entries::update_tests::competing_identical_edit_is_a_noop_after_the_first_commit ... ok1985test server_fns::time_entries::update_tests::each_editable_field_changes_once_including_nulls ... ok1986test server_fns::time_entries::update_tests::concurrent_lock_or_delete_is_rechecked_before_editing ... ok1987test server_fns::snapshot::reader_tests::legacy_readers_cancel_without_retaining_authority_or_pool_connection ... ok1988test server_fns::time_entries::update_tests::missing_foreign_and_locked_entries_are_not_noops ... ok1989test server_fns::time_entries::update_tests::restricted_reordering_rejects_the_whole_batch ... ok1990test server_fns::time_entries::update_tests::restricted_task_rejects_reschedule_and_delete ... ok1991test server_fns::time_entries::update_tests::restricted_empty_task_rejects_changes_and_noop_edits ... ok1992test server_fns::time_entries::update_tests::normalized_noop_preserves_the_row_and_updated_at ... ok1993test server_fns::time_entries::update_tests::restricted_empty_task_rejects_picker_manual_and_timer_starts ... ok1994test server_fns::time_entries::update_tests::revoked_timer_stop_preserves_the_open_state_guard ... ok1995test server_fns::time_entries::update_tests::revoked_grant_does_not_trap_an_own_running_timer ... ok1996test server_fns::time_entries::update_tests::task_grant_revocation_committed_during_an_edit_is_rechecked ... ok1997test server_fns::users::tests::authority::access_transaction_holds_actor_authority_until_commit ... ok1998test server_fns::time_entries::update_tests::restriction_changes_are_rechecked_before_manual_or_timer_insertion ... ok1999test server_fns::time_entries::update_tests::task_grants_allow_tracking_and_archived_history_for_every_role ... ok2000test server_fns::snapshot::reader_tests::legacy_readers_hold_reader_first_authority_until_materialized ... ok2001test server_fns::time_entries::update_tests::assignment_cascade_allows_an_inflight_entry_project_fk_to_finish ... ok2002test server_fns::users::tests::authority::active_administrator_can_create_change_roles_and_deactivate ... ok2003test server_fns::users::tests::concurrency::access_changes_cannot_target_another_organization ... ok2004test server_fns::users::tests::concurrency::concurrent_deactivations_keep_an_active_admin ... ok2005test server_fns::users::tests::concurrency::concurrent_demotions_keep_an_active_admin ... ok2006test server_fns::users::tests::authority::duplicate_creation_rolls_back_and_leaves_access_changes_usable ... ok2007test server_fns::users::tests::concurrency::deactivation_and_demotion_keep_an_active_admin ... ok2008test server_fns::users::tests::concurrency::demotion_and_deactivation_keep_an_active_admin ... ok2009test server_fns::users::tests::authority::foreign_and_unknown_actors_cannot_change_local_user_access ... ok2010test server_fns::users::tests::hide_rates_clears_both_rate_fields ... ok2011test server_fns::users::tests::concurrency::the_last_admin_cannot_be_demoted_or_deactivated ... ok2012test server_fns::users::tests::authority::revoked_administrator_cannot_create_change_roles_or_deactivate ... ok2013test server_fns::users::tests::concurrency::unchanged_admin_access_is_allowed ... ok2014test server_fns::snapshot::reader_tests::legacy_invoice_detail_keeps_metadata_and_lines_in_one_snapshot ... ok2015test server_fns::users::tests::authority::user_mutations_recheck_revocation_after_waiting_for_organization_lock ... ok2016test server_fns::users::tests::authority::project_editor_and_user_revocation_commit_in_gate_order ... ok2017test server_fns::snapshot::reader_tests::legacy_readers_preserve_actor_tenant_filters_and_missing_resources ... ok2018test server_fns::users::tests::authority::user_mutations_wait_for_actor_revocation_and_recheck_after_commit ... ok20192020failures:20212022---- importers::harvest::credentials::tests::completed_credential_changes_allow_immediate_retries stdout ----20232024thread 'importers::harvest::credentials::tests::completed_credential_changes_allow_immediate_retries' (90472990) panicked at crates/horae/src/importers/harvest/credentials.rs:484:42:2025called `Result::unwrap()` on an `Err` value: Other(error communicating with database: Socket is not connected (os error 57)20262027Caused by:2028 Socket is not connected (os error 57))2029note: run with `RUST_BACKTRACE=1` environment variable to display a backtrace20302031---- importers::harvest::engine_tests::completed_imports_allow_immediate_retries stdout ----20322033thread 'importers::harvest::engine_tests::completed_imports_allow_immediate_retries' (90473313) panicked at crates/horae/src/importers/harvest/engine_tests.rs:133:14:2034called `Result::unwrap()` on an `Err` value: error communicating with database: Socket is not connected (os error 57)20352036Caused by:2037 Socket is not connected (os error 57)203820392040failures:2041 importers::harvest::credentials::tests::completed_credential_changes_allow_immediate_retries2042 importers::harvest::engine_tests::completed_imports_allow_immediate_retries20432044test result: FAILED. 887 passed; 2 failed; 10 ignored; 0 measured; 0 filtered out; finished in 128.64s20452046error: test failed, to rerun pass `-p horae --bin horae`