nixbot

builds

numtide/horae build #94 failed

branch integration/materialized-export-prerequisites · PR #247 · commit d9717e7ed9 · · took 37m 37s · eval 26s

eval warnings 1 kind · 6 occurrences
  • warn Nixpkgs 26.05 will be the last release to support x86_64-darwin; see https://nixos.org/… ×6

5 failed
failed attributes
status attribute duration
failed checks.aarch64-darwin.e2e 2m 33s
setup: /nix/store/dkba46bvi1fv10ym72j9q0l101dllcrb-closure-info.drv /nix/store/hywga5fd61w21shhwk5faplvzj32vbhr-run-nixos-vm.drv /nix/store/h4a012gplb88qk …
setup:
  /nix/store/dkba46bvi1fv10ym72j9q0l101dllcrb-closure-info.drv
  /nix/store/hywga5fd61w21shhwk5faplvzj32vbhr-run-nixos-vm.drv
  /nix/store/h4a012gplb88qkx2rfa762lrcxk1rq9s-nixos-vm.drv
  /nix/store/h7sscjhjdgymy9ydsdv4ziimshcqp3iv-driverConfiguration.json.drv
  /nix/store/0xv7z92slw23f5zxfll2vfzrhh42795n-nixos-test-driver-horae-e2e.drv
  /nix/store/n3712fan94gmqvaipmarni4lm0cx68pk-vm-test-run-horae-e2e.drv
Failed to find a machine for remote build!
derivation: n3712fan94gmqvaipmarni4lm0cx68pk-vm-test-run-horae-e2e.drv
required (system, features): (aarch64-darwin, [apple-virt, nixos-test])
12 available machines:
(systems, maxjobs, supportedFeatures, mandatoryFeatures)
([aarch64-darwin], 8, [big-parallel, kvm, nixos-test, uid-range], [])
([aarch64-darwin], 8, [big-parallel, kvm, nixos-test, uid-range], [])
([aarch64-darwin], 8, [big-parallel, kvm, nixos-test, uid-range], [])
([aarch64-darwin], 8, [big-parallel, kvm, nixos-test, uid-range], [])
([aarch64-linux], 8, [big-parallel, kvm, nixos-test, uid-range], [])
([aarch64-linux], 8, [big-parallel…
error: Cannot build '/nix/store/n3712fan94gmqvaipmarni4lm0cx68pk-vm-test-run-horae-e2e.drv'.
       Reason: platform mismatch
       Required system: 'aarch64-darwin'
       Current system: 'x86_64-linux'
       Reason: missing system features
       Required features: {apple-virt, nixos-test}
       Available features: {benchmark, big-parallel, ca-derivations, kvm, nixos-test, recursive-nix, uid-range}
failed checks.aarch64-darwin.e2e-oidc 2m 45s
setup: /nix/store/rxf6xk79gbf2vbg8h7wr5cx8p5f3i6k5-closure-info.drv /nix/store/6lam8l5dmid8kai4xk9ck59i96wmakgg-run-nixos-vm.drv /nix/store/xc093h7m0ys7p3 …
setup:
  /nix/store/rxf6xk79gbf2vbg8h7wr5cx8p5f3i6k5-closure-info.drv
  /nix/store/6lam8l5dmid8kai4xk9ck59i96wmakgg-run-nixos-vm.drv
  /nix/store/xc093h7m0ys7p3ajgzc7yh07qxhj56g4-nixos-vm.drv
  /nix/store/y5x4s0cpd4cs1fsyqyn627h6y7nk9pns-driverConfiguration.json.drv
  /nix/store/1pyv2a5s65rxkg9pgj61v1hvxbz919mh-nixos-test-driver-horae-e2e-oidc.drv
  /nix/store/x8xkxwwhk7axf8ib9jvk3xkiwqqhm8p0-vm-test-run-horae-e2e-oidc.drv
Failed to find a machine for remote build!
derivation: x8xkxwwhk7axf8ib9jvk3xkiwqqhm8p0-vm-test-run-horae-e2e-oidc.drv
required (system, features): (aarch64-darwin, [apple-virt, nixos-test])
12 available machines:
(systems, maxjobs, supportedFeatures, mandatoryFeatures)
([aarch64-darwin], 8, [big-parallel, kvm, nixos-test, uid-range], [])
([aarch64-darwin], 8, [big-parallel, kvm, nixos-test, uid-range], [])
([aarch64-darwin], 8, [big-parallel, kvm, nixos-test, uid-range], [])
([aarch64-darwin], 8, [big-parallel, kvm, nixos-test, uid-range], [])
([aarch64-linux], 8, [big-parallel, kvm, nixos-test, uid-range], [])
([aarch64-linux], 8, [big-par…
error: Cannot build '/nix/store/x8xkxwwhk7axf8ib9jvk3xkiwqqhm8p0-vm-test-run-horae-e2e-oidc.drv'.
       Reason: platform mismatch
       Required system: 'aarch64-darwin'
       Current system: 'x86_64-linux'
       Reason: missing system features
       Required features: {apple-virt, nixos-test}
       Available features: {benchmark, big-parallel, ca-derivations, kvm, nixos-test, recursive-nix, uid-range}
failed checks.aarch64-darwin.tests 10m 52s
horae-tests-0.1.0: called `Result::unwrap()` on an `Err` value: error communicating with database: Socket is not connected (os error 57) Caused by: Socket i …
horae-tests-0.1.0:
called `Result::unwrap()` on an `Err` value: error communicating with database: Socket is not connected (os error 57)
Caused by:
    Socket is not connected (os error 57)
failures:
    importers::harvest::credentials::tests::completed_credential_changes_allow_immediate_retries
    importers::harvest::engine_tests::completed_imports_allow_immediate_retries
test result: FAILED. 887 passed; 2 failed; 10 ignored; 0 measured; 0 filtered out; finished in 128.64s
error: test failed, to rerun pass `-p horae --bin horae`
failed checks.aarch64-linux.e2e 7m 53s
vm-test-run-horae-e2e: ) ^ File "/nix/store/yv2q67grjgrymd498bgdfzlhyaj04cqv-nixos-test-driver-1.1/lib/python3.13/site-packages/test_driver/machine/__ …
vm-test-run-horae-e2e:
    )
    ^
  File "/nix/store/yv2q67grjgrymd498bgdfzlhyaj04cqv-nixos-test-driver-1.1/lib/python3.13/site-packages/test_driver/machine/__init__.py", line 878, in _execute
    self.connect()
    ~~~~~~~~~~~~^^
  File "/nix/store/yv2q67grjgrymd498bgdfzlhyaj04cqv-nixos-test-driver-1.1/lib/python3.13/site-packages/test_driver/machine/__init__.py", line 1057, in connect
    raise RuntimeError("Shell did not start in time")
RuntimeError: Shell did not start in time
failed checks.aarch64-linux.e2e-oidc 8m 15s
vm-test-run-horae-e2e-oidc: ) ^ File "/nix/store/yv2q67grjgrymd498bgdfzlhyaj04cqv-nixos-test-driver-1.1/lib/python3.13/site-packages/test_driver/machi …
vm-test-run-horae-e2e-oidc:
    )
    ^
  File "/nix/store/yv2q67grjgrymd498bgdfzlhyaj04cqv-nixos-test-driver-1.1/lib/python3.13/site-packages/test_driver/machine/__init__.py", line 878, in _execute
    self.connect()
    ~~~~~~~~~~~~^^
  File "/nix/store/yv2q67grjgrymd498bgdfzlhyaj04cqv-nixos-test-driver-1.1/lib/python3.13/site-packages/test_driver/machine/__init__.py", line 1057, in connect
    raise RuntimeError("Shell did not start in time")
RuntimeError: Shell did not start in time
18 succeeded
succeeded attributes
status attribute duration
loading…
6 already built
skipped attributes
status attribute duration
loading…