nixbot

builds

succeeded setup checks.aarch64-darwin.tests · build #94 · raw

1these 2 derivations will be built:2 /nix/store/0hhg4qx8w5myvmpnj8hbsvyr63q4hab6-cargo-vendor-dir.drv3 /nix/store/csrks7lhkwz817wdlp952ns99r3bqkpb-horae-tests-0.1.0.drv4error: build of '/nix/store/csrks7lhkwz817wdlp952ns99r3bqkpb-horae-tests-0.1.0.drv' on 'grpc://farm.numtide.com:50051?client-cert=/run/secrets/vars/per-machine/bld1/nix-farm-ci/crt&client-key=/run/secrets/vars/per-machine/bld1/nix-farm-ci/key&connect-timeout=22&system=aarch64-darwin' failed: Cannot build '/nix/store/csrks7lhkwz817wdlp952ns99r3bqkpb-horae-tests-0.1.0.drv'.5 Reason: builder failed with exit code 101.6 Output paths:7 /nix/store/lqvscyngdlxm3qx9acqnps2hh17vai5a-horae-tests-0.1.08 Last 25 log lines:9 > ---- importers::harvest::credentials::tests::completed_credential_changes_allow_immediate_retries stdout ----10 >11 > thread 'importers::harvest::credentials::tests::completed_credential_changes_allow_immediate_retries' (90472990) panicked at crates/horae/src/importers/harvest/credentials.rs:484:42:12 > called `Result::unwrap()` on an `Err` value: Other(error communicating with database: Socket is not connected (os error 57)13 >14 > Caused by:15 > Socket is not connected (os error 57))16 > note: run with `RUST_BACKTRACE=1` environment variable to display a backtrace17 >18 > ---- importers::harvest::engine_tests::completed_imports_allow_immediate_retries stdout ----19 >20 > thread 'importers::harvest::engine_tests::completed_imports_allow_immediate_retries' (90473313) panicked at crates/horae/src/importers/harvest/engine_tests.rs:133:14:21 > called `Result::unwrap()` on an `Err` value: error communicating with database: Socket is not connected (os error 57)22 >23 > Caused by:24 > Socket is not connected (os error 57)25 >26 >27 > failures:28 > importers::harvest::credentials::tests::completed_credential_changes_allow_immediate_retries29 > importers::harvest::engine_tests::completed_imports_allow_immediate_retries30 >31 > test result: FAILED. 887 passed; 2 failed; 10 ignored; 0 measured; 0 filtered out; finished in 128.64s32 >33 > error: test failed, to rerun pass `-p horae --bin horae`34 For full logs, run:35 nix log /nix/store/csrks7lhkwz817wdlp952ns99r3bqkpb-horae-tests-0.1.0.drv36error: Cannot build '/nix/store/csrks7lhkwz817wdlp952ns99r3bqkpb-horae-tests-0.1.0.drv'.37 Reason: builder failed with exit code 1.38 Output paths:39 /nix/store/lqvscyngdlxm3qx9acqnps2hh17vai5a-horae-tests-0.1.0