horae-tests-0.1.0
checks.aarch64-darwin.tests
· build #7
· raw
1mac02: building 1qy2aa8cyp87wavawy64lhfnmb90crpc-horae-tests-0.1.0.drv
unpackPhase
2unpacking source archive /nix/store/3vzy6k30adk2jdsllrbixqrmiycbm6w1-source3source root is source4Executing cargoSetupPostUnpackHook5Finished cargoSetupPostUnpackHookpatchPhase
6Executing cargoSetupPostPatchHook7Validating consistency between /nix/var/nix/builds/nix-61256-2988311043/source/Cargo.lock and /nix/var/nix/builds/nix-61256-2988311043/cargo-vendor-dir/Cargo.lock8Finished cargoSetupPostPatchHookbuildPhase
9 Compiling proc-macro2 v1.0.10610 Compiling quote v1.0.4611 Compiling unicode-ident v1.0.2412 Compiling serde_core v1.0.22813 Compiling autocfg v1.5.114 Compiling serde v1.0.22815 Compiling core-foundation-sys v0.8.716 Compiling thiserror v2.0.1817 Compiling iana-time-zone v0.1.6518 Compiling num-traits v0.2.1919 Compiling syn v2.0.11820 Compiling serde_derive v1.0.22821 Compiling thiserror-impl v2.0.1822 Compiling uuid v1.23.423 Compiling chrono v0.4.4524 Compiling horae-core v0.1.0 (/nix/var/nix/builds/nix-61256-2988311043/source/crates/core)25 Finished `test` profile [unoptimized + debuginfo] target(s) in 17.75s26------------27 Nextest run ID 50feeb9e-bdf4-4707-bd8a-a061221aa1dd with nextest profile: default28 Starting 121 tests across 1 binary29 Running [ 00:00:00] 0/121: 10 running, 0 passed, 0 skipped 30 [ 00:00:00] horae-core ed_alert_threshold_is_exact_without_rounding31 [ 00:00:00] horae-core ert_accepts_zero_percent_but_not_zero_budget32 [ 00:00:00] horae-core jects_invalid_inputs_and_widens_large_values33 [ 00:00:00] horae-core ::a_single_jump_announces_every_crossed_band34 [ 00:00:00] horae-core percentage_rounds_clamps_and_never_overflows35 [ 00:00:00] horae-core ::tests::current_band_is_the_highest_reached36 [ 00:00:00] horae-core dget::tests::each_crossing_is_announced_once37 [ 00:00:00] horae-core elow_a_band_does_not_fire_but_current_resets38 Running [ 00:00:00] => 20/121: 10 running, 20 passed, 0 skipped 39 [ 00:00:00] horae-core ::tests::minutes_between_is_exact_no_minimum40 [ 00:00:00] horae-core duration::tests::parse_colon41 [ 00:00:00] horae-core duration::tests::parse_decimal42 [ 00:00:00] horae-core s::parse_decimal_rounds_half_minutes_exactly43 [ 00:00:00] horae-core se_preserves_u32_boundary_without_saturating44 [ 00:00:00] horae-core rse_rejects_colon_overflow_without_panicking45 [ 00:00:00] horae-core ts_excessive_decimal_precision_and_numerator46 [ 00:00:00] horae-core cts_negative_non_finite_and_malformed_values47 PASS [ 0.014s] horae-core budget::tests::current_band_is_the_highest_reached48 PASS [ 0.019s] horae-core budget::tests::display_percentage_rounds_clamps_and_never_overflows49 PASS [ 0.020s] horae-core budget::tests::configured_alert_threshold_is_exact_without_rounding50 PASS [ 0.021s] horae-core budget::tests::large_values_do_not_overflow51 PASS [ 0.020s] horae-core budget::tests::each_crossing_is_announced_once52 PASS [ 0.020s] horae-core budget::tests::a_single_jump_announces_every_crossed_band53 PASS [ 0.021s] horae-core budget::tests::configured_alert_rejects_invalid_inputs_and_widens_large_values54 PASS [ 0.021s] horae-core budget::tests::configured_alert_accepts_zero_percent_but_not_zero_budget55 PASS [ 0.022s] horae-core budget::tests::drop_below_a_band_does_not_fire_but_current_resets56 PASS [ 0.028s] horae-core budget::tests::no_band_for_zero_or_missing_budget57 PASS [ 0.023s] horae-core budget::tests::over_budget_fires_even_without_a_configured_100_band58 PASS [ 0.016s] horae-core duration::tests::format_clamps_negative_to_zero59 PASS [ 0.018s] horae-core client::tests::default_rate_rejects_negative_fractional_cent_overflow_and_invalid_text60 PASS [ 0.021s] horae-core client::tests::profile_rejects_blank_overlong_and_null_names61 PASS [ 0.023s] horae-core client::tests::default_rate_preserves_absence_zero_and_exact_large_amounts62 PASS [ 0.022s] horae-core client::tests::profile_rejects_unsupported_currency_and_null_billing_fields63 PASS [ 0.022s] horae-core client::tests::profile_accepts_supported_currencies_and_unicode_character_limit64 PASS [ 0.023s] horae-core client::tests::optional_text_normalizes_only_blank_fields65 PASS [ 0.023s] horae-core duration::tests::format_hhmm_pads_minutes66 PASS [ 0.017s] horae-core duration::tests::format_round_trip67 Running [ 00:00:00] => 20/121: 10 running, 20 passed, 0 skipped 68 [ 00:00:00] horae-core ::tests::minutes_between_is_exact_no_minimum69 [ 00:00:00] horae-core duration::tests::parse_colon70 [ 00:00:00] horae-core duration::tests::parse_decimal71 [ 00:00:00] horae-core s::parse_decimal_rounds_half_minutes_exactly72 [ 00:00:00] horae-core se_preserves_u32_boundary_without_saturating73 [ 00:00:00] horae-core rse_rejects_colon_overflow_without_panicking74 [ 00:00:00] horae-core ts_excessive_decimal_precision_and_numerator75 [ 00:00:00] horae-core cts_negative_non_finite_and_malformed_values76 Running [ 00:00:00] ==> 45/121: 10 running, 20 passed, 0 skipped 77 [ 00:00:00] horae-core ::tests::minutes_between_is_exact_no_minimum78 [ 00:00:00] horae-core duration::tests::parse_colon79 [ 00:00:00] horae-core duration::tests::parse_decimal80 [ 00:00:00] horae-core s::parse_decimal_rounds_half_minutes_exactly81 [ 00:00:00] horae-core se_preserves_u32_boundary_without_saturating82 [ 00:00:00] horae-core rse_rejects_colon_overflow_without_panicking83 [ 00:00:00] horae-core ts_excessive_decimal_precision_and_numerator84 [ 00:00:00] horae-core cts_negative_non_finite_and_malformed_values85 PASS [ 0.016s] horae-core duration::tests::parse_decimal86 PASS [ 0.017s] horae-core duration::tests::minutes_between_is_exact_no_minimum87 PASS [ 0.018s] horae-core duration::tests::parse_colon88 PASS [ 0.015s] horae-core duration::tests::parse_rejects_negative_non_finite_and_malformed_values89 PASS [ 0.017s] horae-core duration::tests::parse_decimal_rounds_half_minutes_exactly90 PASS [ 0.018s] horae-core duration::tests::parse_preserves_u32_boundary_without_saturating91 PASS [ 0.018s] horae-core duration::tests::parse_rejects_colon_overflow_without_panicking92 PASS [ 0.017s] horae-core duration::tests::parse_rejects_excessive_decimal_precision_and_numerator93 PASS [ 0.016s] horae-core importers::harvest::convert::tests::conversion_handles_high_precision_without_intermediate_overflow94 PASS [ 0.023s] horae-core duration::tests::parse_round_trips_each_minute_in_a_day95 PASS [ 0.015s] horae-core importers::harvest::convert::tests::conversion_rejects_unrepresentable_scaled_values_without_panicking96 PASS [ 0.016s] horae-core importers::harvest::convert::tests::conversion_preserves_the_i64_boundary_and_rejects_rounding_past_it97 PASS [ 0.012s] horae-core importers::harvest::convert::tests::garbage_is_rejected98 PASS [ 0.013s] horae-core importers::harvest::convert::tests::conversion_reports_precision_and_numerator_limits99 PASS [ 0.016s] horae-core importers::harvest::convert::tests::high_precision_fraction_straddles_the_half_minute_exactly100 PASS [ 0.016s] horae-core importers::harvest::convert::tests::leading_and_trailing_forms_parse101 PASS [ 0.015s] horae-core importers::harvest::convert::tests::money_common_values_are_exact102 PASS [ 0.024s] horae-core importers::harvest::convert::tests::hours_round_trip_against_exporter_transform103 PASS [ 0.024s] horae-core importers::harvest::convert::tests::hours_common_values_are_exact104 PASS [ 0.018s] horae-core importers::harvest::convert::tests::money_round_trip_against_exporter_transform105 PASS [ 0.018s] horae-core importers::harvest::convert::tests::money_rounds_third_decimal_half_up106 PASS [ 0.017s] horae-core importers::harvest::convert::tests::round_half_up_at_the_boundary107 PASS [ 0.018s] horae-core importers::harvest::convert::tests::negative_is_rejected108 PASS [ 0.015s] horae-core importers::harvest::keys::tests::client_key_equal_across_case_and_whitespace109 PASS [ 0.015s] horae-core importers::harvest::keys::tests::composite_components_do_not_collide110 PASS [ 0.014s] horae-core importers::harvest::keys::tests::normalize_matches_sql_harvest_norm_contract111 Running [ 00:00:00] ===> 47/121: 10 running, 47 passed, 0 skipped 112 [ 00:00:00] horae-core s::conversion_matches_exact_scaled_rationals113 [ 00:00:00] horae-core sts::occurrence_counter_keys_are_independent114 [ 00:00:00] horae-core occurrence_counter_numbers_repeats_from_zero115 [ 00:00:00] horae-core s::project_key_falls_back_to_client_and_name116 [ 00:00:00] horae-core tests::project_key_prefers_code_when_present117 [ 00:00:00] horae-core keys::tests::task_key_shared_across_projects118 [ 00:00:00] horae-core ts::time_entry_key_distinguishes_and_matches119 [ 00:00:00] horae-core quires_binding_and_no_imports_or_active_work120 PASS [ 0.015s] horae-core importers::harvest::keys::tests::normalize_trims_and_case_folds121 Running [ 00:00:00] ===> 47/121: 10 running, 47 passed, 0 skipped 122 [ 00:00:00] horae-core s::conversion_matches_exact_scaled_rationals123 [ 00:00:00] horae-core sts::occurrence_counter_keys_are_independent124 [ 00:00:00] horae-core occurrence_counter_numbers_repeats_from_zero125 [ 00:00:00] horae-core s::project_key_falls_back_to_client_and_name126 [ 00:00:00] horae-core tests::project_key_prefers_code_when_present127 [ 00:00:00] horae-core keys::tests::task_key_shared_across_projects128 [ 00:00:00] horae-core ts::time_entry_key_distinguishes_and_matches129 [ 00:00:00] horae-core quires_binding_and_no_imports_or_active_work130 Running [ 00:00:00] ====> 72/121: 10 running, 72 passed, 0 skipped 131 [ 00:00:00] horae-core s::conversion_matches_exact_scaled_rationals132 [ 00:00:00] horae-core :line_amount_rejects_unrepresentable_results133 [ 00:00:00] horae-core line_amount_rounds_half_cents_up_not_to_even134 [ 00:00:00] horae-core invoice::tests::line_amount_zero_minutes135 [ 00:00:00] horae-core invoice::tests::line_amount_zero_rate136 [ 00:00:00] horae-core invoice::tests::resolve_rate_cascade137 [ 00:00:00] horae-core keeps_zero_and_explicit_missing_project_rate138 [ 00:00:00] horae-core ed_rate_mode_ignores_unselected_rate_sources139 PASS [ 0.016s] horae-core importers::harvest::keys::tests::occurrence_counter_numbers_repeats_from_zero140 PASS [ 0.015s] horae-core importers::harvest::keys::tests::task_key_shared_across_projects141 PASS [ 0.016s] horae-core importers::harvest::keys::tests::project_key_falls_back_to_client_and_name142 PASS [ 0.019s] horae-core importers::harvest::keys::tests::occurrence_counter_keys_are_independent143 PASS [ 0.017s] horae-core importers::harvest::keys::tests::project_key_prefers_code_when_present144 PASS [ 0.014s] horae-core importers::harvest::keys::tests::time_entry_key_distinguishes_and_matches145 PASS [ 0.018s] horae-core importers::harvest::types::account_switch_tests::account_switch_requires_binding_and_no_imports_or_active_work146 PASS [ 0.016s] horae-core importers::harvest::types::tests::archived_errors_and_new_inline_errors_reconcile_across_batches147 PASS [ 0.013s] horae-core importers::harvest::types::tests::import_modes_display_their_wire_names148 PASS [ 0.018s] horae-core importers::harvest::types::tests::does_not_reconcile_when_an_errored_count_has_no_reported_error149 PASS [ 0.014s] horae-core importers::harvest::types::tests::reconciles_when_errored_counts_match_collected_errors150 PASS [ 0.016s] horae-core invoice::tests::discount_allocation_handles_empty_zero_and_full_discounts151 PASS [ 0.016s] horae-core invoice::tests::discount_allocation_supports_maximum_representable_subtotal152 PASS [ 0.017s] horae-core invoice::tests::discount_allocation_conserves_header_amount_and_bounds_each_line153 PASS [ 0.017s] horae-core invoice::tests::discount_allocation_rejects_negative_lines_and_subtotal_overflow154 PASS [ 0.013s] horae-core invoice::tests::discount_allocation_uses_largest_remainder_then_stable_source_order155 PASS [ 0.019s] horae-core invoice::tests::discounted_fee_contribution_leaves_discount_available156 PASS [ 0.018s] horae-core invoice::tests::invoice_adjustments_reject_negative_subtotal_and_overflow157 PASS [ 0.018s] horae-core invoice::tests::invoice_adjustments_round_components_half_up158 PASS [ 0.019s] horae-core invoice::tests::invoice_adjustments_apply_discount_before_non_compounding_taxes159 PASS [ 0.014s] horae-core invoice::tests::line_amount_exact_hour160 PASS [ 0.017s] horae-core invoice::tests::line_amount_90_minutes161 PASS [ 0.017s] horae-core invoice::tests::line_amount_half_hour162 PASS [ 0.016s] horae-core invoice::tests::line_amount_odd_minutes163 PASS [ 0.018s] horae-core invoice::tests::line_amount_accepts_large_representable_amounts164 Running [ 00:00:00] ====> 72/121: 10 running, 72 passed, 0 skipped 165 [ 00:00:00] horae-core s::conversion_matches_exact_scaled_rationals166 [ 00:00:00] horae-core :line_amount_rejects_unrepresentable_results167 [ 00:00:00] horae-core line_amount_rounds_half_cents_up_not_to_even168 [ 00:00:00] horae-core invoice::tests::line_amount_zero_minutes169 [ 00:00:00] horae-core invoice::tests::line_amount_zero_rate170 [ 00:00:00] horae-core invoice::tests::resolve_rate_cascade171 [ 00:00:00] horae-core keeps_zero_and_explicit_missing_project_rate172 [ 00:00:00] horae-core ed_rate_mode_ignores_unselected_rate_sources173 Running [ 00:00:00] ======> 101/121: 10 running, 72 passed, 0 skipped 174 [ 00:00:00] horae-core s::conversion_matches_exact_scaled_rationals175 [ 00:00:00] horae-core :line_amount_rejects_unrepresentable_results176 [ 00:00:00] horae-core line_amount_rounds_half_cents_up_not_to_even177 [ 00:00:00] horae-core invoice::tests::line_amount_zero_minutes178 [ 00:00:00] horae-core invoice::tests::line_amount_zero_rate179 [ 00:00:00] horae-core invoice::tests::resolve_rate_cascade180 [ 00:00:00] horae-core keeps_zero_and_explicit_missing_project_rate181 [ 00:00:00] horae-core ed_rate_mode_ignores_unselected_rate_sources182 PASS [ 0.018s] horae-core invoice::tests::line_amount_rejects_unrepresentable_results183 PASS [ 0.016s] horae-core invoice::tests::line_amount_zero_rate184 PASS [ 0.017s] horae-core invoice::tests::line_amount_rounds_half_cents_up_not_to_even185 PASS [ 0.018s] horae-core invoice::tests::line_amount_zero_minutes186 PASS [ 0.018s] horae-core invoice::tests::resolve_rate_cascade187 PASS [ 0.016s] horae-core invoice::tests::selected_rate_mode_ignores_unselected_rate_sources188 PASS [ 0.017s] horae-core invoice::tests::selected_rate_keeps_zero_and_explicit_missing_project_rate189 PASS [ 0.015s] horae-core money::tests::addition_rejects_overflow_in_both_directions190 PASS [ 0.018s] horae-core money::tests::addition_retains_currency_checks_and_representable_boundaries191 PASS [ 0.016s] horae-core money::tests::format_cents_groups_thousands_and_keeps_sign192 PASS [ 0.016s] horae-core money::tests::parse_cents_reads_whole_and_fractional_amounts193 PASS [ 0.016s] horae-core money::tests::format_cents_plain_keeps_sign_below_one_unit194 PASS [ 0.017s] horae-core money::tests::parse_cents_tolerates_grouping_spaces_and_signs195 PASS [ 0.018s] horae-core money::tests::parse_cents_rejects_what_it_cannot_represent196 PASS [ 0.018s] horae-core project::tests::basics_accept_same_day_but_reject_reversed_dates197 PASS [ 0.019s] horae-core money::tests::parse_cents_is_exact_where_a_float_would_drift198 PASS [ 0.018s] horae-core project::tests::basics_accept_supported_currencies_and_optional_dates199 PASS [ 0.017s] horae-core project::tests::basics_reject_blank_and_overlong_names200 PASS [ 0.011s] horae-core project::tests::basics_reject_overlong_code_and_unsupported_currency201 PASS [ 0.011s] horae-core project::tests::fee_schedules_validate_amounts_and_milestone_total202 PASS [ 0.011s] horae-core project::tests::monetary_budgets_are_only_available_for_time_and_materials203 PASS [ 0.014s] horae-core project::tests::fee_schedules_reject_missing_overlong_and_excessive_milestones204 PASS [ 0.012s] horae-core project::tests::monthly_fee_dates_reject_invalid_calendar_inputs205 PASS [ 0.013s] horae-core project::tests::payment_terms_support_receipt_and_checked_days206 PASS [ 0.014s] horae-core project::tests::monthly_fee_dates_follow_calendar_months207 PASS [ 0.015s] horae-core project::tests::percentage_preserves_exact_hundredths208 PASS [ 0.014s] horae-core project::tests::percentage_rejects_invalid_precision_range_and_syntax209 Running [ 00:00:00] =====> 102/121: 10 running, 102 passed, 0 skipped 210 [ 00:00:00] horae-core s::conversion_matches_exact_scaled_rationals211 [ 00:00:00] horae-core rounding::tests::result_is_multiple_of_inc212 [ 00:00:00] horae-core rounding::tests::up_and_down213 [ 00:00:00] horae-core state::tests::invoiced_is_final214 [ 00:00:00] horae-core sts::managers_invoice_open_and_approved_time215 [ 00:00:00] horae-core state::tests::member_submit_and_reopen216 [ 00:00:00] horae-core state::tests::only_manager_can_approve217 [ 00:00:00] horae-core sts::clamp_to_day_prevents_crossing_midnight218 PASS [ 0.014s] horae-core rounding::tests::effective_minutes_respect_frozen_history_including_zero219 PASS [ 0.015s] horae-core rounding::tests::identity_when_inc_zero220 PASS [ 0.016s] horae-core rounding::tests::nearest_ties_round_up221 Running [ 00:00:00] =====> 102/121: 10 running, 102 passed, 0 skipped 222 [ 00:00:00] horae-core s::conversion_matches_exact_scaled_rationals223 [ 00:00:00] horae-core rounding::tests::result_is_multiple_of_inc224 [ 00:00:00] horae-core rounding::tests::up_and_down225 [ 00:00:00] horae-core state::tests::invoiced_is_final226 [ 00:00:00] horae-core sts::managers_invoice_open_and_approved_time227 [ 00:00:00] horae-core state::tests::member_submit_and_reopen228 [ 00:00:00] horae-core state::tests::only_manager_can_approve229 [ 00:00:00] horae-core sts::clamp_to_day_prevents_crossing_midnight230 PASS [ 0.015s] horae-core rounding::tests::up_and_down231 PASS [ 0.017s] horae-core rounding::tests::result_is_multiple_of_inc232 PASS [ 0.014s] horae-core state::tests::invoiced_is_final233 PASS [ 0.015s] horae-core state::tests::managers_invoice_open_and_approved_time234 PASS [ 0.015s] horae-core state::tests::member_submit_and_reopen235 PASS [ 0.015s] horae-core state::tests::only_manager_can_approve236 PASS [ 0.012s] horae-core time_of_day::tests::format_12h_matches_harvest_style237 PASS [ 0.015s] horae-core time_of_day::tests::clamp_to_day_prevents_crossing_midnight238 PASS [ 0.012s] horae-core time_of_day::tests::format_round_trips239 PASS [ 0.012s] horae-core time_of_day::tests::parse_reads_12h_including_edges240 PASS [ 0.011s] horae-core time_of_day::tests::parse_rejects_out_of_range_and_garbage241 PASS [ 0.012s] horae-core time_of_day::tests::parse_reads_24h242 PASS [ 0.012s] horae-core time_of_day::tests::snap_rounds_to_nearest_step243 PASS [ 0.012s] horae-core types::tests::budget_kind_wire_strings_match_db_enum244 PASS [ 0.013s] horae-core week::tests::configured_week_can_start_in_the_previous_year245 PASS [ 0.010s] horae-core week::tests::configured_week_contains_each_day_for_all_seven_start_days246 PASS [ 0.011s] horae-core week::tests::configured_week_reports_an_unrepresentable_start247 PASS [ 0.015s] horae-core week::tests::maps_any_weekday_to_its_monday248 PASS [ 0.179s] horae-core importers::harvest::convert::tests::conversion_matches_exact_scaled_rationals249------------250 Summary [ 0.235s] 121 tests run: 121 passed, 0 skipped251 Running [ 00:00:00] ======= 121/121: 10 running, 102 passed, 0 skipped 252 [ 00:00:00] horae-core s::conversion_matches_exact_scaled_rationals253 [ 00:00:00] horae-core rounding::tests::result_is_multiple_of_inc254 [ 00:00:00] horae-core rounding::tests::up_and_down255 [ 00:00:00] horae-core state::tests::invoiced_is_final256 [ 00:00:00] horae-core sts::managers_invoice_open_and_approved_time257 [ 00:00:00] horae-core state::tests::member_submit_and_reopen258 [ 00:00:00] horae-core state::tests::only_manager_can_approve259 [ 00:00:00] horae-core sts::clamp_to_day_prevents_crossing_midnight260The files belonging to this database system will be owned by user "_nixbld12".261This user must also own the server process.262263The database cluster will be initialized with locale "C".264The default text search configuration will be set to "english".265266Data page checksums are disabled.267268fixing permissions on existing directory /nix/var/nix/builds/nix-61256-2988311043/tmp.KnuM1HO6xs ... ok269creating subdirectories ... ok270selecting dynamic shared memory implementation ... posix271selecting default "max_connections" ... 100272selecting default "shared_buffers" ... 128MB273selecting default time zone ... UTC274creating configuration files ... ok275running bootstrap script ... ok276performing post-bootstrap initialization ... ok277syncing data to disk ... ok278279initdb: warning: enabling "trust" authentication for local connections280initdb: hint: You can change this by editing pg_hba.conf or using the option -A, or --auth-local and --auth-host, the next time you run initdb.281282Success. You can now start the database server using:283284 pg_ctl -D /nix/var/nix/builds/nix-61256-2988311043/tmp.KnuM1HO6xs -l logfile start285286waiting for server to start.... done287server started288 Compiling unicode-ident v1.0.24289 Compiling proc-macro2 v1.0.106290 Compiling serde v1.0.228291 Compiling serde_core v1.0.228292 Compiling cfg-if v1.0.4293 Compiling libc v0.2.186294 Compiling memchr v2.8.3295 Compiling version_check v0.9.5296 Compiling log v0.4.33297 Compiling libm v0.2.16298 Compiling itoa v1.0.18299 Compiling equivalent v1.0.2300 Compiling foldhash v0.2.0301 Compiling once_cell v1.21.4302 Compiling pin-project-lite v0.2.17303 Compiling typenum v1.20.1304 Compiling slab v0.4.12305 Compiling parking_lot_core v0.9.12306 Compiling scopeguard v1.2.0307 Compiling crossbeam-utils v0.8.22308 Compiling futures-core v0.3.32309 Compiling zeroize v1.9.0310 Compiling crossbeam-epoch v0.9.20311 Compiling crossbeam-deque v0.8.7312 Compiling hashbrown v0.17.1313 Compiling rayon-core v1.13.0314 Compiling futures-io v0.3.32315 Compiling quote v1.0.46316 Compiling futures-task v0.3.32317 Compiling num-traits v0.2.19318 Compiling syn v2.0.118319 Compiling futures-sink v0.3.32320 Compiling futures-channel v0.3.32321 Compiling generic-array v0.14.7322 Compiling subtle v2.6.1323 Compiling zmij v1.0.21324 Compiling allocator-api2 v0.2.21325 Compiling fnv v1.0.7326 Compiling getrandom v0.2.17327 Compiling rand_core v0.6.4328 Compiling stable_deref_trait v1.2.1329 Compiling crc32fast v1.5.0330 Compiling errno v0.3.14331 Compiling jobserver v0.1.35332 Compiling base64 v0.22.1333 Compiling find-msvc-tools v0.1.9334 Compiling shlex v2.0.1335 Compiling const-oid v0.9.6336 Compiling tracing-core v0.1.36337 Compiling cc v1.2.66338 Compiling zerocopy v0.8.53339 Compiling utf8_iter v1.0.4340 Compiling anyhow v1.0.103341 Compiling serde_json v1.0.150342 Compiling crypto-common v0.1.7343 Compiling percent-encoding v2.3.2344 Compiling rustc-hash v2.1.3345 Compiling block-buffer v0.10.4346 Compiling icu_normalizer_data v2.2.0347 Compiling digest v0.10.7348 Compiling simd-adler32 v0.3.9349 Compiling icu_properties_data v2.2.0350 Compiling heck v0.5.0351 Compiling writeable v0.6.3352 Compiling adler2 v2.0.1353 Compiling zlib-rs v0.6.6354 Compiling miniz_oxide v0.8.9355 Compiling signal-hook-registry v1.4.8356 Compiling mio v1.2.1357 Compiling socket2 v0.6.4358 Compiling cpufeatures v0.2.17359 Compiling utf16_iter v1.0.5360 Compiling num-conv v0.2.2361 Compiling write16 v1.0.0362 Compiling time-core v0.1.9363 Compiling powerfmt v0.2.0364 Compiling form_urlencoded v1.2.2365 Compiling time-macros v0.2.31366 Compiling ryu v1.0.23367 Compiling slotmap v1.1.1368 Compiling memmap2 v0.9.11369 Compiling rustversion v1.0.23370 Compiling bumpalo v3.20.3371 Compiling unicode-segmentation v1.13.3372 Compiling winnow v0.7.15373 Compiling arrayvec v0.7.8374 Compiling bitflags v2.13.0375 Compiling litemap v0.8.2376 Compiling deranged v0.5.8377 Compiling httparse v1.10.1378 Compiling unicode-xid v0.2.6379 Compiling getrandom v0.4.3380 Compiling tinyvec_macros v0.1.1381 Compiling siphasher v1.0.3382 Compiling tinyvec v1.11.0383 Compiling semver v1.0.28384 Compiling hashbrown v0.16.1385 Compiling spin v0.9.8386 Compiling fastrand v2.4.1387 Compiling polycool v0.4.0388 Compiling unicode-properties v0.1.4389 Compiling tower-service v0.3.3390 Compiling ring v0.17.14391 Compiling indexmap v2.14.0392 Compiling aho-corasick v1.1.4393 Compiling time v0.3.53394 Compiling regex-syntax v0.8.11395 Compiling wasmtime-internal-core v43.0.2396 Compiling mime v0.3.17397 Compiling fearless_simd v0.4.1398 Compiling unicode-bidi v0.3.18399 Compiling unicode-normalization v0.1.25400 Compiling fdeflate v0.3.7401 Compiling zune-core v0.5.1402 Compiling zune-jpeg v0.5.15403 Compiling serde_path_to_error v0.1.20404 Compiling sha2 v0.10.9405 Compiling synstructure v0.13.2406 Compiling untrusted v0.9.0407 Compiling core_maths v0.1.1408 Compiling konst_macro_rules v0.2.19409 Compiling ipnet v2.12.0410 Compiling ciborium-io v0.2.2411 Compiling hayro-ccitt v0.3.0412 Compiling tower-layer v0.3.3413 Compiling ident_case v1.0.1414 Compiling konst v0.2.20415 Compiling uuid v1.23.4416 Compiling const_format_proc_macros v0.2.34417 Compiling num-integer v0.1.46418 Compiling serde_derive v1.0.228419 Compiling thiserror-impl v2.0.18420 Compiling zerofrom-derive v0.1.7421 Compiling yoke-derive v0.8.2422 Compiling zerovec-derive v0.11.3423 Compiling displaydoc v0.2.6424 Compiling futures-macro v0.3.32425 Compiling zerofrom v0.1.8426 Compiling thiserror v2.0.18427 Compiling tracing-attributes v0.1.31428 Compiling yoke v0.8.3429 Compiling zerocopy-derive v0.8.53430 Compiling cobs v0.3.0431 Compiling tokio-macros v2.7.0432 Compiling bytemuck_derive v1.11.0433 Compiling futures-util v0.3.32434 Compiling regex-automata v0.4.14435 Compiling flate2 v1.1.9436 Compiling zerovec v0.11.6437 Compiling png v0.18.1438 Compiling hayro-jpeg2000 v0.3.5439 Compiling tracing v0.1.44440 Compiling bytemuck v1.25.1441 Compiling hayro-jbig2 v0.3.0442 Compiling float-cmp v0.9.0443 Compiling proc-macro-hack v0.5.20+deprecated444 Compiling tinystr v0.8.3445 Compiling target-lexicon v0.13.5446 Compiling byteorder-lite v0.1.0447 Compiling dioxus-core-types v0.7.9448 Compiling color_quant v1.1.0449 Compiling smallvec v1.15.2450 Compiling lock_api v0.4.14451 Compiling either v1.16.0452 Compiling bytes v1.12.0453 Compiling postcard v1.1.3454 Compiling rayon v1.12.0455 Compiling parking_lot v0.12.5456 Compiling kurbo v0.13.1457 Compiling tokio v1.52.3458 Compiling http v1.4.2459 Compiling cranelift-bitset v0.130.2460 Compiling quick-error v2.0.1461 Compiling unsafe-libyaml v0.2.11462 Compiling getrandom v0.3.4463 Compiling http-body v1.0.1464 Compiling weezl v0.1.12465 Compiling zerotrie v0.2.4466 Compiling potential_utf v0.1.5467 Compiling icu_collections v2.2.0468 Compiling gif v0.14.2469 Compiling image-webp v0.2.4470 Compiling icu_locale_core v2.2.0471 Compiling hayro-syntax v0.7.2472 Compiling euclid v0.22.14473 Compiling subsecond-types v0.7.9474 Compiling strict-num v0.1.1475 Compiling const_format v0.2.36476 Compiling ttf-parser v0.25.1477 Compiling phf_shared v0.13.1478 Compiling sync_wrapper v1.0.2479 Compiling libloading v0.8.9480 Compiling pxfm v0.1.30481 Compiling icu_provider v2.2.0482 Compiling icu_locale_data v2.2.0483 Compiling httpdate v1.0.3484 Compiling arrayref v0.3.9485 Compiling cranelift-srcgen v0.130.2486 Compiling unicode-script v0.5.8487 Compiling icu_properties v2.2.0488 Compiling icu_normalizer v2.2.0489 Compiling serde_yaml v0.9.34+deprecated490 Compiling cranelift-assembler-x64-meta v0.130.2491 Compiling tiny-skia-path v0.12.0492 Compiling ppv-lite86 v0.2.21493 Compiling rand_chacha v0.3.1494 Compiling rand v0.8.6495 Compiling half v2.7.1496 Compiling subsecond v0.7.9497 Compiling ciborium-ll v0.2.2498 Compiling phf_generator v0.13.1499 Compiling ciborium v0.2.2500 Compiling http-body-util v0.1.3501 Compiling generational-box v0.7.9502 Compiling unic-langid-impl v0.9.6503 Compiling font-types v0.11.3504 Compiling pin-project-internal v1.1.13505 Compiling async-trait v0.1.89506 Compiling encoding_rs v0.8.35507 Compiling idna_adapter v1.2.2508 Compiling base64ct v1.8.3509 Compiling idna v1.1.0510 Compiling rustix v1.1.4511 Compiling longest-increasing-subsequence v0.1.0512 Compiling try-lock v0.2.5513 Compiling unicode-ccc v0.4.0514 Compiling thiserror v1.0.69515 Compiling same-file v1.0.6516 Compiling unicode-bidi-mirroring v0.4.0517 Compiling rustybuzz v0.20.1518 Compiling moxcms v0.8.1519 Compiling url v2.5.8520 Compiling pem-rfc7468 v0.7.0521 Compiling walkdir v2.5.0522 Compiling pin-project v1.1.13523 Compiling want v0.3.1524 Compiling dioxus-core v0.7.9525 Compiling read-fonts v0.39.2526 Compiling unic-langid-macros-impl v0.9.6527 Compiling rand_core v0.9.5528 Compiling phf_macros v0.13.1529 Compiling pulley-macros v43.0.2530 Compiling tokio-util v0.7.18531 Compiling thiserror-impl v1.0.69532 Compiling rustls-pki-types v1.15.0533 Compiling leb128fmt v0.1.0534 Compiling wasm-bindgen-shared v0.2.126535 Compiling xmlwriter v0.1.0536 Compiling portable-atomic v1.13.1537 Compiling paste v1.0.15538 Compiling imagesize v0.14.0539 Compiling icu_collator_data v2.2.0540 Compiling bit-vec v0.8.0541 Compiling bit-set v0.8.0542 Compiling phf v0.13.1543 Compiling unic-langid-macros v0.9.6544 Compiling icu_locale v2.2.0545 Compiling rand_chacha v0.9.0546 Compiling der v0.7.10547 Compiling cranelift-entity v0.130.2548 Compiling fontdb v0.23.0549 Compiling gimli v0.33.0550 Compiling svgtypes v0.16.1551 Compiling futures-executor v0.3.32552 Compiling serde_spanned v0.6.9553 Compiling toml_datetime v0.6.11554 Compiling comemo-macros v0.5.1555 Compiling strum_macros v0.27.2556 Compiling enum-ordinalize-derive v4.4.1557 Compiling wasmtime-internal-versioned-export-macros v43.0.2558 Compiling core-foundation v0.9.4559 Compiling sha1 v0.10.6560 Compiling roxmltree v0.21.1561 Compiling quick-xml v0.41.0562 Compiling simplecss v0.2.2563 Compiling data-url v0.3.2564 Compiling unscanny v0.1.0565 Compiling toml_write v0.1.2566 Compiling unicode-vo v0.1.0567 Compiling pico-args v0.5.0568 Compiling wasmparser v0.239.0569 Compiling typst-utils v0.15.0570 Compiling cranelift-isle v0.130.2571 Compiling linked-hash-map v0.5.6572 Compiling yaml-rust v0.4.5573 Compiling usvg v0.47.0574 Compiling toml_edit v0.22.27575 Compiling plist v1.10.0576 Compiling enum-ordinalize v4.4.1577 Compiling comemo v0.5.1578 Compiling spki v0.7.3579 Compiling strum v0.27.2580 Compiling image v0.25.10581 Compiling cranelift-bforest v0.130.2582 Compiling unic-langid v0.9.6583 Compiling rand v0.9.4584 Compiling fancy-regex v0.16.2585 Compiling pulley-interpreter v43.0.2586 Compiling axum-core v0.5.6587 Compiling wasmparser v0.245.1588 Compiling bincode v1.3.3589 Compiling quick-xml v0.38.4590 Compiling num-bigint v0.4.8591 Compiling warnings-macro v0.2.0592 Compiling convert_case v0.8.0593 Compiling hmac v0.12.1594 Compiling wasmi_core v1.1.0595 Compiling data-encoding v2.11.0596 Compiling by_address v1.2.1597 Compiling cranelift-codegen-shared v0.130.2598 Compiling thin-vec v0.2.18599 Compiling chinese-variant v1.1.6600 Compiling object v0.38.1601 Compiling codex v0.3.0602 Compiling palette v0.7.6603 Compiling roman-numerals-rs v3.1.0604 Compiling rustls v0.23.41605 Compiling skrifa v0.42.1606 Compiling rust_decimal v1.42.1607 Compiling unicode-math-class v0.1.0608 Compiling citationberg v0.7.0609 Compiling biblatex v0.12.0610 Compiling wasmi_ir v1.1.0611 Compiling chinese-number v0.7.8612 Compiling cranelift-codegen-meta v0.130.2613 Compiling palette_derive v0.7.6614 Compiling warnings v0.2.1615 Compiling toml v0.8.23616 Compiling syntect v5.3.0617 Compiling icu_collator v2.2.1618 Compiling pkcs8 v0.10.2619 Compiling futures v0.3.32620 Compiling rustls-webpki v0.103.13621 Compiling cranelift-assembler-x64 v0.130.2622 Compiling typst-timing v0.15.0623 Compiling ecow v0.2.6624 Compiling darling_core v0.21.3625 Compiling approx v0.5.1626 Compiling csv-core v0.1.13627 Compiling proc-macro2-diagnostics v0.10.1628 Compiling lazy-js-bundle v0.7.9629 Compiling io-lifetimes v2.0.4630 Compiling system-configuration-sys v0.6.0631 Compiling foldhash v0.1.5632 Compiling mutate_once v0.1.2633 Compiling wasmi_collections v1.1.0634 Compiling atomic-waker v1.1.2635 Compiling fast-srgb8 v1.0.0636 Compiling parking v2.2.1637 Compiling pkg-config v0.3.33638 Compiling cpp_demangle v0.4.5639 Compiling zstd-sys v2.0.16+zstd.1.5.7640 Compiling kamadak-exif v0.6.1641 Compiling hashbrown v0.15.5642 Compiling cranelift-codegen v0.130.2643 Compiling hayagriva v0.10.1644 Compiling wasm-bindgen-macro-support v0.2.126645 Compiling wasm-encoder v0.245.1646 Compiling darling_macro v0.21.3647 Compiling csv v1.4.0648 Compiling typst-syntax v0.15.0649 Compiling two-face v0.4.5650 Compiling dioxus-signals v0.7.9651 Compiling wasmi v1.1.0652 Compiling hkdf v0.12.4653 Compiling webpki-roots v1.0.8654 Compiling lipsum v0.9.1655 Compiling regex v1.13.0656 Compiling chrono v0.4.45657 Compiling typst-macros v0.15.0658 Compiling typst-assets v0.15.0659 Compiling wasm-bindgen v0.2.126660 Compiling byteorder v1.5.0661 Compiling icu_segmenter_data v2.2.0662 Compiling arbitrary v1.4.2663 Compiling glidesort v0.1.2664 Compiling crc-catalog v2.5.0665 Compiling termcolor v1.4.1666 Compiling winnow v1.0.3667 Compiling az v1.3.0668 Compiling object v0.37.3669 Compiling typed-arena v2.0.2670 Compiling wasmtime-internal-component-util v43.0.2671 Compiling wasmprinter v0.245.1672 Compiling cranelift-control v0.130.2673 Compiling crc v3.4.0674 Compiling wasm-bindgen-macro v0.2.126675 Compiling darling v0.21.3676 Compiling hashlink v0.10.0677 Compiling toml_parser v1.1.2+spec-1.1.0678 Compiling h2 v0.4.15679 Compiling typst-library v0.15.0680 Compiling regalloc2 v0.15.1681 Compiling serde_urlencoded v0.7.1682 Compiling color v0.3.3683 Compiling lazy_static v1.5.0684 Compiling linebender_resource_handle v0.1.1685 Compiling dioxus-cli-config v0.7.9686 Compiling rustc-demangle v0.1.28687 Compiling io-extras v0.18.4688 Compiling hayro-postscript v0.1.0689 Compiling hayro-cmap v0.1.0690 Compiling wasmtime-environ v43.0.2691 Compiling peniko v0.6.1692 Compiling hyper v1.10.1693 Compiling system-configuration v0.7.0694 Compiling dioxus-rsx v0.7.9695 Compiling enumset_derive v0.15.0696 Compiling concurrent-queue v2.5.0697 Compiling guillotiere v0.7.0698 Compiling const-serialize-macro v0.7.2699 Compiling cookie v0.18.1700 Compiling unicase v2.9.0701 Compiling cap-primitives v3.4.5702 Compiling ambient-authority v0.0.2703 Compiling strsim v0.11.1704 Compiling zstd-safe v7.2.4705 Compiling leb128 v0.2.7706 Compiling utf-8 v0.7.6707 Compiling wast v35.0.2708 Compiling tokio-stream v0.1.18709 Compiling mime_guess v2.0.5710 Compiling js-sys v0.3.103711 Compiling const-serialize v0.7.2712 Compiling vello_common v0.0.8713 Compiling event-listener v5.4.1714 Compiling icu_segmenter v2.2.0715 Compiling dioxus-core-macro v0.7.9716 Compiling ar_archive_writer v0.5.2717 Compiling enumset v1.1.13718 Compiling hyper-util v0.1.20719 Compiling futures-intrusive v0.5.0720 Compiling hayro-interpret v0.7.0721 Compiling fs-set-times v0.20.3722 Compiling crossbeam-queue v0.3.13723 Compiling dioxus-hooks v0.7.9724 Compiling dioxus-document v0.7.9725 Compiling dioxus-html-internal-macro v0.7.9726 Compiling wasm-encoder v0.253.0727 Compiling tower v0.5.3728 Compiling icu_provider_blob v2.2.0729 Compiling http v0.2.12730 Compiling keyboard-types v0.7.0731 Compiling const-serialize-macro v0.8.0-alpha.0732 Compiling serde_repr v0.1.20733 Compiling stringprep v0.1.5734 Compiling signature v2.2.0735 Compiling ff v0.13.1736 Compiling bitmaps v2.1.0737 Compiling im-rc v15.1.0738 Compiling multer v3.1.0739 Compiling compression-core v0.4.32740 Compiling hypher v0.1.7741 Compiling whoami v1.6.1742 Compiling home v0.5.12743 Compiling dotenvy v0.15.7744 Compiling id-arena v2.3.0745 Compiling base16ct v0.2.0746 Compiling maybe-owned v0.3.4747 Compiling unicode-width v0.2.2748 Compiling hex v0.4.3749 Compiling rustls v0.21.12750 Compiling wasmtime-internal-unwinder v43.0.2751 Compiling sized-chunks v0.6.5752 Compiling sqlx-core v0.8.6753 Compiling dioxus-html v0.7.9754 Compiling wast v253.0.0755 Compiling sec1 v0.7.3756 Compiling wit-parser v0.245.1757 Compiling compression-codecs v0.4.38758 Compiling group v0.13.0759 Compiling psm v0.1.31760 Compiling vello_cpu v0.0.8761 Compiling atoi v2.0.0762 Compiling tungstenite v0.29.0763 Compiling wasmtime-internal-fiber v43.0.2764 Compiling wasmtime-internal-jit-debug v43.0.2765 Compiling pic-scale v0.7.10766 Compiling rustls-webpki v0.101.7767 Compiling sct v0.7.1768 Compiling md-5 v0.10.6769 Compiling serde_spanned v1.1.1770 Compiling toml_datetime v0.7.5+spec-1.1.0771 Compiling crypto-bigint v0.5.5772 Compiling rand_xoshiro v0.6.0773 Compiling dirs-sys-next v0.1.2774 Compiling cap-std v3.4.5775 Compiling wasmtime-internal-component-macro v43.0.2776 Compiling fixedbitset v0.4.2777 Compiling system-configuration-sys v0.5.0778 Compiling wasmtime-internal-cache v43.0.2779 Compiling toml_writer v1.1.1+spec-1.1.0780 Compiling toml v0.9.12+spec-1.1.0781 Compiling sqlx-postgres v0.8.6782 Compiling petgraph v0.6.5783 Compiling elliptic-curve v0.13.8784 Compiling directories-next v2.0.0785 Compiling wat v1.253.0786 Compiling hayro v0.7.1787 Compiling tokio-tungstenite v0.29.0788 Compiling wasmtime-internal-wit-bindgen v43.0.2789 Compiling web-sys v0.3.103790 Compiling zstd v0.13.3791 Compiling async-compression v0.4.42792 Compiling hayro-svg v0.7.0793 Compiling http-body v0.4.6794 Compiling h2 v0.3.27795 Compiling witx v0.9.1796 Compiling tungstenite v0.28.0797 Compiling darling_core v0.23.0798 Compiling sharded-slab v0.1.7799 Compiling cfb v0.7.3800 Compiling wasmtime v43.0.2801 Compiling dioxus-history v0.7.9802 Compiling matchers v0.2.0803 Compiling proc-macro-utils v0.10.0804 Compiling itertools v0.14.0805 Compiling rustc_version v0.4.1806 Compiling debugid v0.8.0807 Compiling axum-macros v0.5.1808 Compiling stacker v0.1.24809 Compiling tracing-log v0.2.0810 Compiling socket2 v0.5.10811 Compiling thread_local v1.1.9812 Compiling psl-types v2.0.11813 Compiling cbindgen v0.29.4814 Compiling toml_datetime v1.1.1+spec-1.1.0815 Compiling http-range-header v0.4.2816 Compiling litrs v1.0.0817 Compiling matchit v0.8.4818 Compiling rustix v0.38.44819 Compiling wiggle-macro v43.0.2820 Compiling inventory v0.3.24821 Compiling nu-ansi-term v0.50.3822 Compiling dioxus-fullstack-core v0.7.9823 Compiling document-features v0.2.12824 Compiling tracing-subscriber v0.3.23825 Compiling axum v0.8.9826 Compiling darling_macro v0.23.0827 Compiling toml_edit v0.25.12+spec-1.1.0828 Compiling tower-http v0.6.11829 Compiling publicsuffix v2.3.0830 Compiling wiggle-generate v43.0.2831 Compiling hyper v0.14.32832 Compiling tempfile v3.27.0833 Compiling fxprof-processed-profile v0.8.1834 Compiling curve25519-dalek v4.1.3835 Compiling manyhow-macros v0.11.4836 Compiling infer v0.19.0837 Compiling sqlx-macros-core v0.8.6838 Compiling tokio-rustls v0.24.1839 Compiling wasm-compose v0.245.1840 Compiling wasm-bindgen-futures v0.4.76841 Compiling const-serialize v0.8.0-alpha.0842 Compiling tokio-rustls v0.26.4843 Compiling dioxus-interpreter-js v0.7.9844 Compiling write-fonts v0.48.1845 Compiling typst-layout v0.15.0846 Compiling rfc6979 v0.4.0847 Compiling addr2line v0.26.1848 Compiling headers-core v0.3.0849 Compiling wasmtime-internal-jit-icache-coherence v43.0.2850 Compiling pdf-writer v0.15.0851 Compiling convert_case v0.10.0852 Compiling rmp v0.8.15853 Compiling mach2 v0.4.3854 Compiling cranelift-native v0.130.2855 Compiling cranelift-frontend v0.130.2856 Compiling bitflags v1.3.2857 Compiling utf8parse v0.2.2858 Compiling base64 v0.21.7859 Compiling system-interface v0.27.3860 Compiling num-bigint-dig v0.8.6861 Compiling wasmtime-internal-cranelift v43.0.2862 Compiling option-ext v0.2.0863 Compiling cap-fs-ext v3.4.5864 Compiling base16 v0.2.1865 Compiling objc2 v0.6.4866 Compiling dioxus-router-macro v0.7.9867 Compiling dirs-sys v0.5.0868 Compiling prost-derive v0.14.4869 Compiling hayro-write v0.7.0870 Compiling rustls-pemfile v1.0.4871 Compiling hyper-rustls v0.24.2872 Compiling anstyle-parse v1.0.0873 Compiling system-configuration v0.5.1874 Compiling rmp-serde v1.3.1875 Compiling derive_more-impl v2.1.1876 Compiling headers v0.4.1877 Compiling ecdsa v0.16.9878 Compiling manganis-core v0.7.9879 Compiling hyper-rustls v0.27.9880 Compiling sqlx-macros v0.8.6881 Compiling gloo-utils v0.2.0882 Compiling manyhow v0.11.4883 Compiling proc-macro-crate v3.5.0884 Compiling cookie_store v0.22.1885 Compiling darling v0.23.0886 Compiling tokio-tungstenite v0.28.0887 Compiling primeorder v0.13.6888 Compiling typst-svg v0.15.0889 Compiling typst-html v0.15.0890 Compiling tungstenite v0.27.0891 Compiling subsetter v0.2.6892 Compiling webpki-roots v0.26.11893 Compiling tower-sessions-core v0.14.0894 Compiling dioxus-devtools-types v0.7.9895 Compiling charset v0.1.5896 Compiling tiny-skia v0.12.0897 Compiling serde_qs v0.15.0898 Compiling rgb v0.8.53899 Compiling num-iter v0.1.46900 Compiling async-stream-impl v0.3.6901 Compiling macro-string v0.1.4902 Compiling inout v0.1.4903 Compiling webpki-roots v0.25.4904 Compiling sync_wrapper v0.1.2905 Compiling is_terminal_polyfill v1.70.2906 Compiling anstyle v1.0.14907 Compiling hashbrown v0.14.5908 Compiling anstyle-query v1.1.5909 Compiling colorchoice v1.0.5910 Compiling zip v2.4.2911 Compiling xxhash-rust v0.8.16912 Compiling dunce v1.0.5913 Compiling askama_escape v0.13.0914 Compiling objc2-encode v4.1.0915 Compiling xmp-writer v0.3.3916 Compiling dashmap v6.2.1917 Compiling resvg v0.47.0918 Compiling krilla v0.8.2919 Compiling dioxus-ssr v0.7.9920 Compiling manganis-macro v0.7.9921 Compiling dioxus-fullstack-macro v0.7.9922 Compiling anstream v1.0.0923 Compiling reqwest v0.11.27924 Compiling cipher v0.4.4925 Compiling async-stream v0.3.6926 Compiling dioxus-devtools v0.7.9927 Compiling content_disposition v0.4.0928 Compiling typst-realize v0.15.0929 Compiling ureq v2.12.1930 Compiling extism v1.30.0931 Compiling sqlx v0.8.6932 Compiling async-tungstenite v0.31.0933 Compiling reqwest v0.12.28934 Compiling derive_more v2.1.1935 Compiling serde_with_macros v3.21.0936 Compiling extism-convert-macros v1.30.0937 Compiling typst-eval v0.15.0938 Compiling gloo-net v0.6.0939 Compiling axum-extra v0.10.3940 Compiling prost v0.14.4941 Compiling dioxus-router v0.7.9942 Compiling dirs v6.0.0943 Compiling wasm-streams v0.4.2944 Compiling dioxus-asset-resolver v0.7.9945 Compiling dioxus-logger v0.7.9946 Compiling cap-time-ext v3.4.5947 Compiling ed25519 v2.2.3948 Compiling cap-rand v3.4.5949 Compiling pkcs1 v0.7.5950 Compiling dioxus-stores-macro v0.7.9951 Compiling tracing-futures v0.2.5952 Compiling ureq-proto v0.6.0953 Compiling lru v0.16.4954 Compiling zopfli v0.8.3955 Compiling ordered-float v2.10.1956 Compiling universal-hash v0.5.1957 Compiling send_wrapper v0.6.0958 Compiling opaque-debug v0.3.1959 Compiling const-str v0.7.1960 Compiling base64 v0.13.1961 Compiling utf8-zero v0.8.1962 Compiling clap_lex v1.1.0963 Compiling clap_builder v4.6.0964 Compiling ureq v3.3.0965 Compiling dioxus-fullstack v0.7.9 (/nix/var/nix/builds/nix-61256-2988311043/source/vendor/dioxus-fullstack-0.7.9)966 Compiling oauth2 v4.4.2967 Compiling poly1305 v0.8.0968 Compiling serde-value v0.7.0969 Compiling dioxus-server v0.7.9970 Compiling dioxus-stores v0.7.9971 Compiling rsa v0.9.10972 Compiling ed25519-dalek v2.2.0973 Compiling typst v0.15.0974 Compiling typst-kit v0.15.0975 Compiling extism-convert v1.30.0976 Compiling serde_with v3.21.0977 Compiling krilla-svg v0.8.1978 Compiling manganis v0.7.9979 Compiling chacha20 v0.9.1980 Compiling tower-sessions-memory-store v0.14.0981 Compiling p384 v0.13.1982 Compiling p256 v0.13.2983 Compiling tower-cookies v0.11.0984 Compiling itertools v0.10.5985 Compiling extism-manifest v1.30.0986 Compiling serde_plain v1.0.2987 Compiling clap_derive v4.6.1988 Compiling aead v0.5.2989 Compiling dioxus-config-macro v0.7.9990 Compiling dyn-clone v1.0.20991 Compiling horae v0.1.0 (/nix/var/nix/builds/nix-61256-2988311043/source/crates/horae)992 Compiling dioxus-config-macros v0.7.9993 Compiling glob v0.3.3994 Compiling chacha20poly1305 v0.10.1995 Compiling tower-sessions v0.14.0996 Compiling typst-pdf v0.15.0997 Compiling typst-as-lib v0.16.0998 Compiling dioxus v0.7.9999 Compiling rust_xlsxwriter v0.80.01000 Compiling horae-core v0.1.0 (/nix/var/nix/builds/nix-61256-2988311043/source/crates/core)1001 Compiling tower-sessions-sqlx-store v0.15.01002 Compiling clap v4.6.11003 Compiling serial_test_derive v3.5.01004 Compiling openidconnect v3.5.01005 Compiling serial_test v3.5.01006 Compiling wiggle v43.0.21007 Compiling wasi-common v43.0.21008 Finished `test` profile [unoptimized + debuginfo] target(s) in 10m 12s1009 Running unittests src/main.rs (target/debug/deps/horae-d25262ae1fc74356)10101011running 836 tests1012test auth::oidc::tests::no_account_is_denied_not_provisioned ... ok1013test auth::oidc::tests::deactivated_subject_match_is_denied ... ok1014test auth::oidc::tests::first_login_links_subject_via_verified_email ... ok1015test auth::oidc::tests::deactivated_email_match_is_denied ... ok1016test auth::oidc::tests::subject_match_logs_in_without_relinking ... ok1017test auth::oidc::tests::extra_audiences_are_trusted_only_when_listed ... ok1018test auth::oidc::tests::subject_match_takes_precedence_over_email ... ok1019test auth::oidc::tests::unverified_email_is_not_matched ... ok1020test auth::page::tests::configured_label_is_html_escaped ... ok1021test auth::page::tests::oidc_variant_uses_the_configured_label_and_hands_off_to_start ... ok1022test auth::page::tests::dev_variant_offers_the_admin_bypass_and_no_fake_controls ... ok1023test cli::imports::tests::csv_named_pipe_is_rejected_without_waiting_for_a_writer ... ok1024test cli::imports::tests::invalid_csv_files_fail_before_contacting_the_server ... ok1025test cli::imports::tests::cancellation_racing_completion_does_not_claim_cancellation_was_requested ... ok1026test cli::imports::tests::api_submission_captures_generation_without_retrying_uncertain_acceptance ... ok1027test cli::imports::tests::missing_session_is_a_structured_configuration_failure ... ok1028test cli::imports::tests::malformed_submission_acknowledgement_retains_its_request_identity ... ok1029test cli::imports::tests::private_session_accepts_https_and_loopback_only ... ok1030test cli::imports::tests::redirects_are_not_followed_or_exposed_as_server_error_text ... ok1031test cli::imports::tests::retry_snapshot_is_compatible_with_missing_and_future_values ... ok1032test cli::imports::tests::ordinary_json_is_bounded_and_invalid_replies_are_not_echoed ... ok1033test cli::imports::tests::missing_and_mismatched_jobs_fail_without_substitution ... ok1034test cli::imports::tests::report_marks_confirmed_failed_outcomes_as_incomplete ... ok1035test cli::imports::tests::session_rejects_cookie_header_injection_without_echoing_the_value ... ok1036test cli::imports::tests::session_rejects_public_permissions_and_symlinks ... ok1037test cli::imports::tests::session_rejects_plaintext_remote_and_credential_bearing_urls ... ok1038test cli::imports::tests::archived_errors_publish_without_clobbering_and_preserve_the_prior_file_on_failure ... ok1039test cli::tests::environment_probe ... ok1040test cli::tests::remote_commands_reject_conflicting_or_unbounded_options ... ok1041test cli::tests::remote_import_and_job_commands_accept_the_documented_arguments ... ok1042test config::tests::dev_login_is_allowed_on_loopback ... ok1043test config::tests::dev_login_is_refused_off_loopback ... ok1044test cli::imports::tests::status_and_wait_distinguish_failed_jobs_from_failed_reads ... ok1045test config::tests::environment::environment_probe ... ok1046test config::tests::environment::example_environment_can_configure_all_required_oidc_and_harvest_fields ... ok1047test config::tests::environment::empty_environment_has_no_authentication_or_plugin_credentials ... ok1048test cli::tests::default_command_uses_the_same_defaults_and_environment_as_serve ... ok1049test cli::tests::default_command_rejects_invalid_environment_ports ... ok1050test config::tests::environment::obsolete_authentication_variables_do_not_configure_the_server ... ok1051test config::tests::environment::partial_oidc_configuration_remains_disabled_without_a_callback ... ok1052test config::tests::environment::job_attempt_limit_uses_the_documented_environment_variable ... ok1053test config::tests::without_dev_login_any_bind_is_fine ... ok1054test db::tests::pool_connections_force_custom_plans ... ok1055test config::tests::environment::mail_environment_requires_a_complete_valid_configuration ... ok1056test config::tests::environment::invalid_job_attempt_limits_reject_startup ... ok1057test config::tests::environment::secure_cookies_use_the_documented_prefixed_variable ... ok1058test auth::oidc::tests::linking::simultaneous_logins_with_the_same_subject_are_allowed ... ok1059test auth::oidc::tests::linking::unverified_email_cannot_link_an_account ... ok1060test auth::oidc::tests::linking::different_subjects_cannot_both_claim_an_unlinked_account ... ok1061test auth::oidc::tests::linking::existing_subject_wins_over_another_accounts_email ... ok1062test harvest::pagination_tests::harvest_own_time_omits_private_project_budget_metadata ... ok1063test harvest::pagination_tests::harvest_pagination_total_pages_does_not_overflow ... ok1064test auth::oidc::tests::linking::deactivation_during_first_link_denies_login ... ok1065test db::tests::reset_empties_the_database_and_reapplies_migrations ... ok1066test cli::imports::tests::wait_deadline_caps_a_pending_request_without_cancelling_the_job ... ok1067test harvest::pagination_tests::harvest_pagination_catalog_links_preserve_filters_and_break_name_ties ... ok1068test harvest::tests::a_manager_lists_users_with_their_rates ... ok1069test harvest::tests::a_manager_sees_the_whole_org ... ok1070test harvest::pagination_tests::harvest_pagination_empty_and_out_of_range_pages_keep_the_contract ... ok1071test harvest::tests::a_member_cannot_fetch_a_colleagues_entry ... ok1072test harvest::tests::a_member_cannot_filter_to_a_colleague ... ok1073test harvest::tests::a_member_cannot_list_users ... ok1074test harvest::pagination_tests::harvest_pagination_malformed_filters_are_client_errors ... ok1075test harvest::tests::a_member_sees_only_their_own_time_entries ... ok1076test harvest::tests::harvest_effective_minutes_match_sql_for_open_and_frozen_time ... ok1077test harvest::pagination_tests::harvest_task_access_filters_counts_and_preserves_rate_free_history ... ok1078test harvest::tests::harvest_entry_rates_respect_selected_project_mode ... ok1079test harvest::tests::page_window_defaults_and_checked_offsets ... ok1080test harvest::tests::harvest_entry_rates_follow_the_cascade_and_frozen_invoice_line ... ok1081test harvest::pagination_tests::harvest_pagination_rejects_invalid_windows_on_every_collection ... ok1082test harvest::tests::harvest_marks_unbilled_non_billable_contexts_consistently ... ok1083test importers::harvest::account_switch::tests::a_b_a_keeps_old_callbacks_requests_and_retries_fenced ... ok1084test importers::harvest::account_switch::tests::change_preserves_terminal_history_and_rejects_stale_confirmation ... ok1085test harvest::tests::members_cannot_read_own_project_rates_or_cost_overrides ... ok1086test importers::harvest::account_switch::tests::queue_acceptance_does_not_wait_for_the_import_session_lock ... ok1087test importers::harvest::account_switch::tests::competing_callbacks_and_confirmations_have_one_winner ... ok1088test importers::harvest::account_switch::tests::disconnect_and_reconnect_fence_callbacks_but_not_same_account_work ... ok1089test importers::harvest::account_switch::tests::competing_change_and_submission_cannot_both_succeed ... ok1090test importers::harvest::api_source::http::tests::cancelled_backoff_does_not_wait_or_retry ... ok1091test importers::harvest::api_source::http::tests::cursor_links_are_authoritative_even_with_null_or_stale_page_numbers ... ok1092test harvest::pagination_tests::harvest_pagination_router_preserves_session_and_tenant_guards ... ok1093test importers::harvest::account_switch::tests::queued_work_and_provenance_block_without_changing_binding ... ok1094test importers::harvest::api_source::http::tests::http_pages_follow_cursor_and_preserve_headers_and_encoded_filter ... ok1095test importers::harvest::api_source::http::tests::missing_next_cursor_is_not_silently_treated_as_completed ... ok1096test importers::harvest::api_source::http::tests::pagination_cycle_detection_survives_restarting_after_every_page ... ok1097test importers::harvest::api_source::http::tests::persisted_cursor_resumes_with_a_new_client_and_stays_complete_at_eof ... ok1098test importers::harvest::api_source::http::tests::rejected_page_does_not_advance_the_cursor ... ok1099test importers::harvest::api_source::http::tests::rejects_pagination_outside_the_authenticated_endpoint ... ok1100test importers::harvest::api_source::http::tests::resumed_cursor_rejects_untrusted_destinations_and_invalid_state_before_http ... ok1101test importers::harvest::api_source::http::tests::http_retries_429_but_never_follows_redirects_or_shortens_long_backoff ... ok1102test importers::harvest::api_source::tests::assembled_rows_convert_to_exact_minutes ... ok1103test importers::harvest::api_source::tests::assembles_rows_joining_parents_by_id ... ok1104test importers::harvest::api_source::tests::hours_render_as_exact_decimals ... ok1105test importers::harvest::api_source::tests::http_page_preserves_decimal_values_before_integer_conversion ... ok1106test importers::harvest::api_source::tests::json_exponents_expand_exactly_with_bounded_output ... ok1107test importers::harvest::api_source::http::tests::http_rejects_oversized_malformed_and_cyclic_pages ... ok1108test importers::harvest::credentials::tests::bad_key_length_is_rejected ... ok1109test importers::harvest::account_switch::tests::running_jobs_block_change_and_old_execution_never_reaches_http ... ok1110test harvest::tests::imported_legacy_rates_survive_retry_in_harvest_list_and_detail ... ok1111test importers::harvest::account_switch::tests::successful_change_preserves_business_rows_and_failure_rolls_back_secrets ... ok1112test importers::harvest::account_switch::tests::retry_and_change_are_serialized ... ok1113test importers::harvest::credentials::tests::decode_hex_rejects_bad_input ... ok1114test importers::harvest::credentials::tests::another_account_cannot_replace_credentials_or_watermarks ... ok1115test importers::harvest::credentials::tests::encrypt_then_decrypt_round_trips ... ok1116test importers::harvest::api_source::http::tests::slow_consumer_backpressures_http_and_cancellation_stops_further_pages ... ok1117test importers::harvest::credentials::tests::concurrent_first_connections_cannot_bind_different_accounts ... ok1118test importers::harvest::credentials::tests::nonce_makes_ciphertext_nondeterministic ... ok1119test importers::harvest::credentials::tests::connect_and_disconnect_share_import_exclusion_without_blocking_other_orgs ... ok1120test importers::harvest::credentials::tests::disconnect_preserves_identity_and_provenance_for_the_original_account ... ok1121test importers::harvest::credentials::tests::connection_changes_work_with_a_single_connection_pool ... ok1122test importers::harvest::credentials::tests::wrong_key_fails_to_decrypt ... ok1123test harvest::pagination_tests::harvest_pagination_time_entries_keep_the_filtered_set_and_date_ties ... ok1124test importers::harvest::csv_source::tests::bad_date_becomes_a_row_error_not_a_rejection ... ok1125test importers::harvest::csv_source::tests::conflicting_email_aliases_error_only_the_affected_row ... ok1126test importers::harvest::csv_source::tests::cursor_beyond_upload_is_rejected_without_parsing_rows ... ok1127test importers::harvest::csv_source::tests::csv_records_preserve_multiline_unicode_across_single_byte_reads ... ok1128test importers::harvest::csv_source::tests::delivers_a_row_before_reading_the_rest_of_the_file ... ok1129test importers::harvest::csv_source::tests::empty_file_is_rejected ... ok1130test importers::harvest::csv_source::tests::cursor_resumes_after_multiline_unicode_and_preserves_error_locations ... ok1131test importers::harvest::csv_source::tests::invalid_utf8_errors_one_record_and_continues ... ok1132test importers::harvest::csv_source::tests::missing_required_columns_is_rejected ... ok1133test importers::harvest::csv_source::tests::parse_bool_accepts_yes_variants ... ok1134test importers::harvest::csv_source::tests::names_stay_separate_from_optional_email ... ok1135test importers::harvest::credentials::tests::failed_credential_write_does_not_leave_an_account_binding ... ok1136test importers::harvest::csv_source::tests::parses_rows_case_insensitively ... ok1137test importers::harvest::csv_source::tests::identity_columns_are_required_and_cannot_repeat ... ok1138test importers::harvest::credentials::tests::migration_binds_existing_connections_without_changing_secrets_or_markers ... ok1139test importers::harvest::credentials::tests::unidentified_legacy_provenance_requires_operator_review ... ok1140test importers::harvest::credentials::tests::same_account_reconnect_rotates_encryption_without_resetting_watermarks ... ok1141test importers::harvest::engine_tests::api_sync_adopts_entries_from_a_prior_csv_import ... ok1142test importers::harvest::engine_tests::api_connection_checks_work_with_a_single_connection_pool ... ok1143test importers::harvest::engine_tests::api_and_csv_share_the_lock_but_other_organizations_can_import ... ok1144test importers::harvest::engine_tests::bad_records_are_reported_and_run_continues ... ok1145test importers::harvest::credentials::tests::completed_credential_changes_allow_immediate_retries ... ok1146test importers::harvest::engine_tests::concurrent_imports_reject_overlap_without_collapsing_repeated_entries ... ok1147test importers::harvest::engine_tests::cancelled_http_waiter_keeps_the_lock_until_its_worker_exits ... ok1148test importers::harvest::engine_tests::csv_ambiguous_names_include_inactive_users_but_unique_email_disambiguates ... ok1149test importers::harvest::engine_tests::csv_malformed_file_is_rejected_with_no_writes ... ok1150test importers::harvest::engine_tests::cancellation_rolls_back_rows_and_releases_the_import_session ... ok1151test importers::harvest::engine_tests::csv_import_populates_and_is_idempotent ... ok1152test harvest::pagination_tests::harvest_project_progress_permissions_cover_counts_pages_and_details ... ok1153test importers::harvest::engine_tests::completed_imports_allow_immediate_retries ... FAILED1154test importers::harvest::engine_tests::csv_name_fallback_requires_a_full_unique_name_and_never_overrides_email ... ok1155test importers::harvest::engine_tests::csv_name_only_matches_one_org_user_and_reimports_without_duplicates ... ok1156test importers::harvest::engine_tests::csv_streaming::csv_preview_errors_and_repeated_rows_match_commit_and_reimport ... ok1157test importers::harvest::engine_tests::csv_name_only_dry_run_and_duplicate_occurrences_preserve_history ... ok1158test importers::harvest::engine_tests::csv_streaming::cancelling_a_csv_waiting_for_more_bytes_releases_its_session ... ok1159test importers::harvest::engine_tests::csv_streaming::csv_applies_before_eof_but_transport_failure_rolls_back_everything ... ok1160test importers::harvest::engine_tests::csv_streaming::durable_csv_preview_crosses_batch_boundaries_without_committing_domain_data ... ok1161test harvest::pagination_tests::harvest_project_cost_overrides_require_admin_without_fabricated_fallback ... ok1162test importers::harvest::engine_tests::csv_streaming::csv_sql_backpressure_stops_reading_later_input_rows ... ok1163test importers::harvest::engine_tests::csv_streaming::durable_csv_preview_resumes_after_a_crash_without_recounting_rows ... ok1164test importers::harvest::engine_tests::csv_streaming::durable_csv_stale_commit_is_fenced_without_a_heartbeat ... ok1165test importers::harvest::engine_tests::csv_streaming::measure_csv_durable_100k ... ignored, 100,000-row durable CSV measurement; run explicitly with --release --nocapture1166test importers::harvest::engine_tests::csv_streaming::measure_csv_durable_large_catalog_100k ... ignored, 100,000-row durable CSV with 5,000 parent sets; run explicitly with --release --nocapture1167test importers::harvest::engine_tests::csv_streaming::measure_csv_streaming_100k ... ignored, 100,000-row CSV measurement; run explicitly with --release --nocapture1168test importers::harvest::engine_tests::csv_streaming::measure_csv_streaming_large_catalog_100k ... ignored, 100,000-row CSV with 5,000 parent sets; run explicitly with --release --nocapture1169test importers::harvest::engine_tests::csv_streaming::durable_csv_preview_rejects_a_stale_next_batch ... ok1170test importers::harvest::engine_tests::csv_streaming::durable_csv_report_metadata_is_bounded_after_recovery ... ok1171test importers::harvest::engine_tests::distinct_harvest_ids_with_identical_fields_import_as_two ... ok1172test importers::harvest::engine_tests::csv_streaming::durable_csv_cancel_joins_parser_and_preserves_committed_rows ... ok1173test importers::harvest::engine_tests::dry_run_writes_nothing_and_matches_commit ... ok1174test importers::harvest::engine_tests::edited_entry_still_matched_by_provenance ... ok1175test importers::harvest::engine_tests::csv_streaming::durable_csv_resumes_committed_batches_without_recounting_duplicate_rows ... ok1176test importers::harvest::engine_tests::full_import_creates_all_levels_with_exact_minutes ... ok1177test importers::harvest::engine_tests::failed_source_releases_the_session_and_rolls_back_partial_rows ... ok1178test importers::harvest::engine_tests::lookup_cache::cold_query_callsite_on_untraced_thread_is_still_captured ... ok1179test importers::harvest::engine_tests::csv_streaming::durable_csv_preview_cancel_preserves_simulation_for_manual_retry ... ok1180test importers::harvest::engine_tests::lookup_cache::cached_email_and_full_name_do_not_share_a_namespace ... ok1181test importers::harvest::engine_tests::csv_streaming::durable_csv_cancel_preserves_its_completed_batches_for_manual_retry ... ok1182test importers::harvest::engine_tests::import_rejects_ambiguous_normalized_email_without_partial_writes ... ok1183test importers::harvest::engine_tests::csv_streaming::durable_csv_reclaimed_lease_cannot_commit_the_next_batch ... ok1184test importers::harvest::engine_tests::lookup_cache::cached_project_task_still_validates_each_rows_rate ... ok1185test importers::harvest::engine_tests::lookup_cache::lookup_index_migration_preserves_existing_ambiguous_identities ... ok1186test importers::harvest::engine_tests::lookup_cache::new_run_rechecks_previously_cached_user_for_ambiguity ... ok1187test importers::harvest::engine_tests::lookup_cache::project_task_cache_distinguishes_both_sides_of_the_link ... ok1188test importers::harvest::engine_tests::lookup_cache::rolled_back_row_does_not_cache_user_or_project_task ... ok1189test importers::harvest::engine_tests::natural_key_reimport_normalizes_whitespace_and_ascii_case ... ok1190test importers::harvest::engine_tests::overflowing_decimals_fail_only_their_rows ... ok1191test importers::harvest::oauth::tests::authorize_url_carries_state_and_encoded_redirect ... ok1192test importers::harvest::oauth::tests::authorize_url_preserves_query_values_without_injecting_parameters ... ok1193test importers::harvest::oauth_callback_tests::account_policy_failures_return_safe_actionable_conflicts ... ok1194test importers::harvest::oauth_callback_tests::mismatched_state_is_rejected_without_a_code ... ok1195test importers::harvest::oauth_callback_tests::missing_returned_state_is_rejected ... ok1196test importers::harvest::oauth_callback_tests::missing_stored_state_is_rejected ... ok1197test importers::harvest::oauth_callback_tests::provider_error_is_rejected_before_exchange ... ok1198test importers::harvest::oauth_callback_tests::valid_matching_state_yields_the_code ... ok1199test importers::harvest::oauth_callback_tests::valid_state_but_missing_code_is_rejected ... ok1200test importers::harvest::report::tests::archive_metadata_cannot_masquerade_as_a_legacy_or_inconsistent_report ... ok1201test importers::harvest::report::tests::archived_report_round_trips_without_losing_error_accounting ... ok1202test importers::harvest::report::tests::legacy_report_preserves_its_counts_and_error_details ... ok1203test importers::harvest::report::tests::report_rejects_unsupported_and_invalid_versions ... ok1204test importers::harvest::report::tests::serialized_report_has_a_supported_schema_version ... ok1205test importers::harvest::resolve::checkpoint_tests::run_cache_round_trip_preserves_identity_namespaces_and_occurrences ... ok1206test importers::harvest::engine_tests::reimporting_identical_csv_rows_is_idempotent ... ok1207test importers::harvest::engine_tests::second_identical_run_creates_nothing ... ok1208test importers::harvest::engine_tests::csv_streaming::csv_measurement_recovers_a_complete_batch_without_recounting ... ok1209test importers::harvest::engine_tests::watermark_advances_only_on_commit ... ok1210test importers::harvest::engine_tests::submission_barrier_blocks_imported_time_entries ... ok1211test importers::harvest::resolve::preview::tests::checkpoint_restores_known_task_currency_and_keeps_old_currency_unknown ... ok1212test importers::harvest::engine_tests::two_identical_csv_rows_import_as_two_entries ... ok1213test importers::harvest::engine_tests::lookup_cache::repeated_rows_resolve_each_user_and_project_task_once ... ok1214test importers::harvest::streaming::durable::preview::tests::restoration_omits_unneeded_virtual_entries ... ok1215test importers::harvest::resolve::preview::tests::rejects_foreign_parent_snapshots_before_restoring_any_rows ... ok1216test importers::harvest::streaming::tests::api_planning_policy_ends_with_the_transaction ... ok1217test importers::harvest::sync_tests::api_requires_email_even_when_full_name_matches ... ok1218test importers::harvest::sync_tests::api_rejects_ambiguous_email_without_advancing_watermark ... ok1219test importers::harvest::engine_tests::large_run_reuses_parents_and_reconciles_totals ... ok1220test importers::harvest::sync_tests::checkpoints::durable_api_finalization_retry_does_not_repeat_completed_downloads ... ok1221test importers::harvest::engine_tests::csv_streaming::durable_csv_preview_matches_existing_and_new_rows_with_one_connection ... ok1222test importers::harvest::sync_tests::checkpoints::durable_api_cancellation_preserves_confirmed_pages_for_manual_retry ... ok1223test importers::harvest::sync_tests::checkpoints::durable_api_preview_cancellation_preserves_confirmed_pages_for_manual_retry ... ok1224test importers::harvest::sync_tests::checkpoints::durable_api_preview_reclaimed_worker_cannot_checkpoint_its_next_page ... ok1225test importers::harvest::sync_tests::checkpoints::durable_api_preview_resume_preserves_row_errors ... ok1226test importers::harvest::sync_tests::checkpoints::durable_api_preview_finalization_retry_does_not_repeat_completed_downloads ... ok1227test importers::harvest::sync_tests::checkpoints::durable_api_preview_resumes_after_a_confirmed_parent_batch ... ok1228test importers::harvest::sync_tests::checkpoints::durable_api_preview_resumes_catalog_download ... ok1229test importers::harvest::sync_tests::checkpoints::durable_api_reclaimed_worker_cannot_commit_its_next_page ... ok1230test importers::harvest::sync_tests::checkpoints::durable_api_resume_keeps_earlier_errors_and_does_not_advance_watermark ... ok1231test importers::harvest::sync_tests::checkpoints::durable_api_preview_resumes_pages_without_publishing_domain_data ... ok1232test importers::harvest::sync_tests::checkpoints::durable_api_resume_remembers_an_earlier_missing_timestamp ... ok1233test importers::harvest::sync_tests::checkpoints::durable_api_resumes_a_partially_downloaded_catalog ... ok1234test importers::harvest::sync_tests::disconnect_and_reconnect_preserves_imported_records_and_exact_identity ... ok1235test importers::harvest::sync_tests::checkpoints::durable_api_resumes_committed_pages_and_preserves_the_high_watermark ... ok1236test importers::harvest::sync_tests::dry_run_leaves_data_provenance_and_watermark_unchanged ... ok1237test importers::harvest::sync_tests::empty_sync_does_not_invent_a_watermark ... ok1238test importers::harvest::sync_tests::exact_api_decimals_survive_preview_commit_and_reimport ... ok1239test importers::harvest::sync_tests::missing_source_timestamp_keeps_the_previous_watermark ... ok1240test importers::harvest::sync_tests::checkpoints::durable_api_resumes_after_a_confirmed_parent_batch ... ok1241test importers::harvest::sync_tests::failed_client_propagates_to_project_and_entry_without_placeholder_records ... ok1242test importers::harvest::sync_tests::missing_client_fallback_and_failed_project_savepoints_do_not_poison_cache ... ok1243test importers::harvest::sync_tests::invalid_parent_blocks_dependent_time_but_other_catalog_records_survive ... ok1244test importers::harvest::sync_tests::failed_rows_are_available_to_the_next_incremental_retry ... ok1245test importers::harvest::sync_tests::checkpoints::failed_api_preview_publishes_its_last_confirmed_page_report ... ok1246test importers::harvest::sync_tests::checkpoints::failed_api_commit_publishes_its_last_confirmed_page_report ... ok1247test importers::harvest::sync_tests::out_of_range_api_decimals_error_per_row_and_leave_retry_watermark ... ok1248test importers::harvest::sync_tests::paging::later_download_failure_rolls_back_parents_rows_and_watermark ... ok1249test importers::harvest::sync_tests::scale::api_100k_commit_and_reimport ... ignored, 100,000-entry scale measurement; run explicitly with --release --nocapture1250test importers::harvest::sync_tests::scale::api_100k_dry_run ... ignored, 100,000-entry scale measurement; run explicitly with --release --nocapture1251test importers::harvest::sync_tests::scale::api_durable_100k_commit_and_reimport ... ignored, 100,000-entry durable API measurement; run explicitly with --release --nocapture1252test importers::harvest::sync_tests::scale::api_durable_100k_dry_run ... ignored, 100,000-entry durable API measurement; run explicitly with --release --nocapture1253test importers::harvest::sync_tests::parent_catalog_preserves_metadata_and_counts_each_entity_once ... ok1254test importers::harvest::sync_tests::paging::cancelled_page_consumer_retains_lock_until_worker_exits_and_rolls_back ... ok1255test importers::harvest::sync_tests::checkpoints::durable_api_preview_preserves_adoptions_and_repeated_ids_across_recovery ... ok1256test importers::harvest::sync_tests::paging::durable_api_stale_commit_cannot_advance_data_or_watermark ... ok1257test importers::harvest::sync_tests::parent_only_api_import_creates_catalog_and_reimport_skips_it ... ok1258test importers::harvest::sync_tests::watermark_never_passes_the_start_of_capture ... ok1259test importers::harvest::sync_tests::refreshed_tokens_survive_a_dry_run_rollback_in_the_same_import_session ... ok1260test importers::harvest::sync_tests::parent_only_dry_run_previews_without_persisting_catalog ... ok1261test importers::harvest::sync_tests::successful_sync_only_marks_the_incrementally_fetched_entity ... ok1262test importers::harvest::sync_tests::paging::invalid_and_missing_timestamp_rows_cross_page_boundaries_without_advancing ... ok1263test jobs::outbox::tests::acknowledges_confirmed_delivery_without_reclaiming_it ... ok1264test init::tests::init_creates_one_org_and_one_admin_and_nothing_else ... ok1265test init::tests::init_refuses_when_an_organization_exists ... ok1266test importers::harvest::sync_tests::watermark_write_failure_rolls_back_imported_data ... ok1267test jobs::outbox::tests::invalid_payload_is_not_delivered_and_does_not_leak_into_errors ... ok1268test importers::harvest::sync_tests::paging::durable_api_cancel_waits_for_the_producer_before_acknowledging ... ok1269test jobs::outbox::tests::plugin_failure_retries_with_the_same_event_identity ... ok1270test jobs::report::stream_tests::download_keeps_its_snapshot_when_later_progress_archives_the_inline_tail ... ok1271test importers::harvest::sync_tests::scale::durable_measurement_finishes_from_its_eof_checkpoint ... ok1272test jobs::report::tests::legacy_upgrade_preserves_job_states_and_existing_archives ... ok1273test importers::harvest::sync_tests::scale::http_pages_preview_commit_and_reimport ... ok1274test jobs::tests::cancellation_and_retry_are_scoped_and_idempotent ... ok1275test jobs::report::tests::report_fragments_survive_until_the_owning_job_expires ... ok1276test jobs::tests::claims_are_atomic_and_expired_leases_recover ... ok1277test jobs::report::tests::upgrading_legacy_reports_preserves_errors_and_fences_old_attempts ... ok1278test jobs::tests::cleanup_retains_retryable_uploads_and_deletes_expired_jobs ... ok1279test jobs::report::stream_tests::download_reports_missing_fragments_after_its_buffered_page ... ok1280test jobs::tests::expired_final_attempt_fails_without_claiming_again ... ok1281test jobs::tests::concurrent_csv_resubmission_preserves_identity_after_upload_cleanup ... ok1282test jobs::tests::api_job_keeps_its_policy_across_duplicate_enqueue_and_manual_retry ... ok1283test jobs::tests::cancellation_waits_for_the_claimed_execution_before_allowing_retry ... ok1284test jobs::tests::history_paginates_tied_timestamps_and_rejects_foreign_cursors ... ok1285test jobs::tests::failed_csv_commit_retains_confirmed_report_through_history_and_retry ... ok1286test jobs::tests::csv_job_persists_its_policy_with_the_upload ... ok1287test jobs::outbox::tests::worker_delivers_available_events_and_stops_cleanly ... ok1288test jobs::report::stream_tests::download_reads_only_when_consumed_and_releases_its_connection ... ok1289test jobs::tests::failed_csv_preview_retains_confirmed_report_through_history_and_retry ... ok1290test jobs::tests::expired_lease_cannot_renew_or_commit_using_an_old_transaction_timestamp ... ok1291test jobs::tests::import_adapters_reject_a_lease_from_another_organization ... ok1292test jobs::tests::outbox_delivery_is_idempotent ... ok1293test jobs::tests::final_failure_is_retained_and_manual_retry_gets_a_new_budget ... ok1294test importers::harvest::sync_tests::scale::durable_api_report_preserves_overflow_errors_after_recovery ... ok1295test jobs::tests::payload_kind_is_stable_and_round_trips ... ok1296test jobs::tests::payload_versions_preserve_legacy_jobs_and_reject_unknown_versions ... ok1297test jobs::tests::invalid_stored_payloads_reach_a_terminal_error ... ok1298test jobs::tests::retry_snapshot_does_not_guess_unknown_payloads_or_sources ... ok1299test jobs::tests::missing_configuration_records_error_and_requeues ... ok1300test jobs::tests::shutdown_deadline_drops_and_joins_in_flight_work ... ok1301test jobs::tests::shutdown_waits_for_in_flight_work ... ok1302test jobs::tests::retry_snapshot_matches_status_and_list_without_exposing_payload ... ok1303test jobs::tests::outbox_same_kind_consumers_cannot_claim_the_same_lease ... ok1304test jobs::tests::outbox_stale_claims_cannot_acknowledge_or_reschedule_delivery ... ok1305test jobs::tests::outbox_rollback_does_not_publish_an_event ... ok1306test jobs::tests::synthetic_job_uses_the_same_registered_envelope ... ok1307test jobs::tests::cancellation_survives_a_crash_before_the_worker_acknowledges ... ok1308test models::project_creation::tests::draft_roundtrip_preserves_incomplete_input_without_demo_data ... ok1309test models::project_creation::tests::unauthorized_catalog_cost_is_absent_from_serialized_options ... ok1310test models::project_creation::tests::unknown_draft_fields_are_rejected ... ok1311test jobs::tests::upload_organization_must_match_its_job ... ok1312test notifications::tests::cancelling_delivery_kills_the_active_sender ... ok1313test jobs::tests::reclaimed_attempt_rejects_stale_results_even_with_the_same_worker_name ... ok1314test notifications::tests::acknowledged_email_is_never_claimed_again ... ok1315test notifications::tests::disabled_mail_worker_does_not_claim_pending_notifications ... ok1316test notifications::tests::mail_configuration_is_disabled_by_default_and_rejects_partial_values ... ok1317test notifications::tests::mail_configuration_requires_an_executable_file_and_safe_sender ... ok1318test jobs::tests::stopped_worker_leaves_queued_jobs_unclaimed ... ok1319test notifications::tests::recipient_injection_is_rejected_before_starting_a_process ... ok1320test notifications::tests::rendered_mail_bounds_body_lines_for_long_unicode_and_control_names ... ok1321test notifications::tests::failed_email_retries_same_identity_and_eventually_stops ... ok1322test notifications::tests::foreign_notification_payload_is_terminal_and_never_sent ... ok1323test jobs::tests::outbox_claims_only_the_requested_event_kind ... ok1324test notifications::tests::mail_worker_delivers_only_its_kind_and_drains_cleanly ... ok1325test notifications::tests::sendmail_failure_does_not_expose_program_output ... ok1326test jobs::tests::submission_key_cannot_change_api_mode_or_scope ... ok1327test notifications::tests::revoked_recipient_does_not_receive_a_pending_email ... ok1328test pages::clients::filters::tests::clearing_query_preserves_selected_currency_and_lifecycle ... ok1329test pages::clients::filters::tests::lifecycle_counts_share_query_and_currency_filters ... ok1330test pages::clients::filters::tests::name_search_ignores_case_and_surrounding_whitespace ... ok1331test pages::clients::filters::tests::preferred_or_visible_project_currency_matches_but_query_still_applies ... ok1332test pages::clients::form::tests::absent_billing_authority_never_produces_an_edit_payload ... ok1333test pages::clients::form::tests::ambiguous_creation_errors_require_explicit_recovery ... ok1334test pages::clients::form::tests::clearing_a_rate_is_explicit_and_needs_no_currency_confirmation ... ok1335test pages::clients::form::tests::invalid_fields_are_not_rewritten_by_validation ... ok1336test pages::clients::form::tests::rate_replacement_requires_confirmation_in_the_current_currency ... ok1337test pages::clients::form::tests::untouched_fields_keep_zero_rate_and_original_snapshot ... ok1338test pages::importers::presentation::tests::interrupted_report_is_partial_regardless_of_retry_prerequisites ... ok1339test pages::importers::presentation::tests::no_selection_does_not_claim_no_import_history ... ok1340test pages::importers::presentation::tests::source_labels_do_not_guess_unknown_importers ... ok1341test pages::importers::presentation::tests::states_and_phases_have_readable_unknown_fallbacks ... ok1342test pages::importers::presentation::tests::summaries_distinguish_zero_skipped_and_mixed_outcomes ... ok1343test pages::invoices::defaults_form::tests::invoice_fields_bound_metadata_by_characters_and_reject_nul ... ok1344test pages::invoices::defaults_form::tests::invoice_fields_preserve_exact_percentages_and_custom_terms ... ok1345test pages::invoices::defaults_form::tests::invoice_fields_preserve_receipt_terms_and_empty_optional_percentages ... ok1346test pages::invoices::defaults_form::tests::invoice_fields_reject_invalid_percentages_terms_and_second_tax ... ok1347test pages::invoices::preparation::fees::tests::fee_inputs_require_exact_amounts_and_an_explicit_positive_charge ... ok1348test pages::invoices::preparation::fees::tests::refresh_keeps_raw_edits_and_does_not_select_new_sources ... ok1349test pages::invoices::preparation::fees::tests::refresh_preserves_missing_or_relabelled_edits_until_explicit_removal ... ok1350test pages::invoices::preparation::tests::invoice_context_selects_only_the_exact_available_client ... ok1351test pages::invoices::preparation::tests::invoice_review_requires_matching_sources_and_valid_values ... ok1352test pages::invoices::preparation::tests::unavailable_or_malformed_invoice_context_never_uses_the_first_client ... ok1353test pages::new_project::basics::tests::a_batch_that_would_exceed_the_tag_limit_is_rejected ... ok1354test pages::new_project::basics::tests::a_full_tag_list_still_accepts_a_duplicate ... ok1355test pages::new_project::basics::tests::overlong_tags_are_rejected_without_truncation ... ok1356test pages::new_project::basics::tests::tag_length_counts_characters_instead_of_bytes ... ok1357test pages::new_project::basics::tests::tags_trim_and_deduplicate_without_changing_existing_spelling ... ok1358test notifications::tests::retry_can_recover_without_changing_message_identity ... ok1359test pages::new_project::draft::tests::a_mismatched_acknowledgement_does_not_lose_pending_input ... ok1360test pages::new_project::draft::tests::a_retry_keeps_the_unacknowledged_payload_and_revision ... ok1361test pages::new_project::draft::tests::a_validation_rejection_allows_corrected_input_at_the_same_revision ... ok1362test pages::new_project::draft::tests::an_empty_form_is_not_reported_as_saved ... ok1363test pages::new_project::draft::tests::any_saved_draft_wins_over_context_including_empty_or_matching_client ... ok1364test pages::new_project::draft::tests::context_prefills_only_a_new_form_without_fixing_its_currency ... ok1365test pages::new_project::draft::tests::resuming_preserves_the_server_identity_and_incomplete_fields ... ok1366test pages::new_project::team::tests::adding_everyone_deduplicates_without_replacing_project_overrides ... ok1367test pages::new_project::billing::tests::budget_errors_target_a_control_that_can_be_corrected ... ok1368test pages::new_project::team::tests::removing_a_member_keeps_an_empty_restricted_task_restricted ... ok1369test pages::new_project::tests::a_rejected_creation_can_be_edited_but_an_uncertain_commit_must_be_retried ... ok1370test pages::new_project::tests::only_known_validation_fields_can_target_a_control ... ok1371test pages::projects::budget_display_tests::configured_scopes_sum_without_hiding_an_individual_overrun ... ok1372test pages::projects::budget_display_tests::display_preserves_units_sign_and_large_integer_values ... ok1373test pages::projects::budget_display_tests::tag_filter_matches_identity_without_duplicates_or_name_collisions ... ok1374test pages::projects::budget_display_tests::unallocated_zero_and_overflow_budgets_are_not_conflated ... ok1375test pages::reports::tests::cost_total_uses_organization_currency_across_billing_currencies ... ok1376test pages::reports::tests::mixed_currencies_are_not_added_even_when_the_numbers_would_overflow ... ok1377test pages::reports::tests::monetary_total_overflow_is_visible_instead_of_panicking ... ok1378test pages::new_project::team::tests::exceeding_the_team_limit_does_not_partially_add_people ... ok1379test pages::reports::tests::single_currency_totals_are_formatted_and_empty_reports_have_no_amount ... ok1380test pages::reports::tests::redacted_costs_do_not_become_zero_or_partial_totals ... ok1381test pages::timesheet::tests::cal_span_day_shows_only_the_anchor_column ... ok1382test pages::timesheet::tests::cal_span_defaults_to_week ... ok1383test pages::timesheet::tests::cal_span_unknown_falls_back_to_week ... ok1384test pages::timesheet::tests::cal_span_url_roundtrips ... ok1385test pages::timesheet::tests::cal_span_week_shows_all_seven_days ... ok1386test pages::timesheet::tests::cal_span_work_week_preserves_date_order_across_weekends ... ok1387test pages::timesheet::tests::cal_span_work_week_shows_monday_to_friday ... ok1388test pages::timesheet::tests::cal_span_work_week_skips_sunday_when_it_is_the_first_column ... ok1389test pages::timesheet::tests::day_col_class_marks_today ... ok1390test pages::timesheet::tests::day_col_class_marks_weekend ... ok1391test pages::timesheet::tests::day_col_class_plain_weekday ... ok1392test pages::timesheet::tests::day_col_class_today_wins_over_weekend ... ok1393test pages::timesheet::tests::invalid_duration_cannot_start_a_timer_save_or_clear_a_cell ... ok1394test pages::timesheet::tests::only_a_blank_duration_can_start_an_eligible_timer ... ok1395test pages::timesheet::tests::timed_lanes_still_widens_overlapping_entries ... ok1396test pages::timesheet::tests::timed_lanes_terminates_on_a_zero_length_entry ... ok1397test pages::timesheet::tests::today_offset_is_none_after_the_week ... ok1398test pages::timesheet::tests::today_offset_is_none_before_the_week ... ok1399test pages::timesheet::tests::today_offset_is_six_on_the_sunday ... ok1400test pages::timesheet::tests::today_offset_is_zero_on_the_monday ... ok1401test pages::timesheet::tests::value_cell_class_empty_wins_over_today ... ok1402test pages::timesheet::tests::value_cell_class_marks_today_when_nonzero ... ok1403test pages::timesheet::tests::weekend_style_follows_the_date_not_the_column_offset ... ok1404test pages::timesheet::tests::weekly_duration_edit_preserves_nine_am_start_notes_and_billability ... ok1405test pages::timesheet::tests::weekly_new_entries_are_untimed_and_explicit_clears_still_work ... ok1406test notifications::tests::sendmail_receives_fixed_arguments_and_stable_message_identity ... ok1407test notifications::tests::stale_email_lease_cannot_start_delivery ... ok1408test plugin::database::tests::application_database_owner_is_not_a_plugin_identity ... ok1409test plugin::database::tests::dedicated_reader_is_accepted_but_new_write_grants_are_rejected ... ok1410test plugin::database::tests::project_configuration_is_private_even_when_plugin_grants_are_misconfigured ... ok1411test jobs::tests::submission_key_cannot_change_csv_bytes_or_mode ... ok1412test notifications::tests::sendmail_timeout_kills_and_reaps_the_child ... ok1413test plugin::event::tests::active_transition_fires_only_on_a_real_flip ... ok1414test plugin::event::tests::budget_and_timer_events_serialize ... ok1415test plugin::event::tests::new_events_have_stable_hook_names ... ok1416test plugin::event::tests::project_membership_payload_excludes_private_configuration ... ok1417test plugin::event::tests::role_change_event_carries_previous_role ... ok1418test plugin::event::tests::submission_event_serializes_payload ... ok1419test plugin::event::tests::us2_events_have_stable_hook_names ... ok1420test notifications::tests::verbose_sender_output_is_discarded_without_blocking_delivery ... ok1421test plugin::host::tests::config_lookup::a_set_key_is_returned ... ok1422test plugin::host::tests::config_lookup::an_unset_key_is_none ... ok1423test plugin::database::tests::reader_accepts_optional_first_party_rounding_helper ... ok1424test jobs::tests::invalid_policy_cannot_enqueue_a_job_or_upload ... ok1425test plugin::database::tests::reader_cannot_execute_security_definer_functions ... ok1426test plugin::database::tests::reader_rejects_unapproved_invoker_functions ... ok1427test plugin::host::tests::database_queries_preserve_parameters_and_rollback_session_settings ... ok1428test plugin::host::tests::database_tests::unconfigured_sql_never_falls_back_to_application_state ... ok1429test plugin::host::tests::response_shaping::error_json_wraps_the_message ... ok1430test plugin::host::tests::response_shaping::http_body_accepts_the_size_limit_and_rejects_larger_responses ... ok1431test plugin::host::tests::response_shaping::http_response_carries_status_and_body ... ok1432test plugin::host::tests::response_shaping::invalid_http_utf8_is_an_error_not_an_empty_success ... ok1433test plugin::host::tests::statement_is_read_only::a_cte_select_is_allowed ... ok1434test plugin::host::tests::statement_is_read_only::a_second_statement_is_rejected ... ok1435test plugin::host::tests::statement_is_read_only::a_single_trailing_semicolon_is_allowed ... ok1436test plugin::host::tests::statement_is_read_only::a_write_hidden_behind_a_comment_is_rejected ... ok1437test plugin::host::tests::statement_is_read_only::plain_select_is_allowed ... ok1438test plugin::host::tests::statement_is_read_only::writes_are_rejected ... ok1439test plugin::host::tests::wrap_select::strips_a_trailing_semicolon_before_wrapping ... ok1440test plugin::host::tests::wrap_select::wraps_as_a_bounded_row_query ... ok1441test plugin::database::tests::reader_cannot_have_access_to_credentials ... ok1442test plugin::database::tests::reader_cannot_switch_into_another_role ... ok1443test plugin::manifest::tests::accepts_all_published_business_events ... ok1444test plugin::manifest::tests::config_defaults_to_empty_when_absent ... ok1445test plugin::manifest::tests::parse_valid_manifest ... ok1446test plugin::manifest::tests::reject_empty_hooks ... ok1447test plugin::manifest::tests::reject_unknown_hook ... ok1448test plugin::manifest::tests::parses_optional_config_table ... ok1449test jobs::tests::missing_csv_upload_records_error_and_requeues ... ok1450test plugin::host::tests::database_tests::query_discards_session_advisory_locks ... ok1451test plugin::host::tests::database_tests::select_cannot_write_or_gain_application_privileges ... ok1452test plugin::host::tests::database_tests::query_results_are_bounded_without_silent_truncation ... ok14531454running 1 test1455test plugin::registry::tests::initialization::guest_initializers_have_an_engine_instruction_budget ... ok14561457test result: ok. 1 passed; 0 failed; 0 ignored; 0 measured; 835 filtered out; finished in 0.24s145814591460running 1 test1461test jobs::tests::synthetic_job_executes_through_claim_and_completion ... ok1462test plugin::registry::tests::initialization::guest_initializers_have_an_engine_instruction_budget ... ok14631464test result: ok. 1 passed; 0 failed; 0 ignored; 0 measured; 835 filtered out; finished in 0.19s146514661467running 1 test1468test plugin::registry::tests::initialization::guest_initializers_have_an_engine_instruction_budget ... ok14691470test result: ok. 1 passed; 0 failed; 0 ignored; 0 measured; 835 filtered out; finished in 0.14s147114721473running 1 test1474test plugin::registry::tests::initialization::guest_initializers_have_an_engine_instruction_budget ... ok14751476test result: ok. 1 passed; 0 failed; 0 ignored; 0 measured; 835 filtered out; finished in 0.21s14771478test plugin::registry::tests::initialization::guest_initializers_have_an_engine_instruction_budget ... ok1479test plugin::host::tests::a_query_cannot_disable_its_own_deadline ... ok1480test plugin::registry::tests::isolation::cancelling_a_waiter_keeps_capacity_reserved_until_the_host_call_exits ... ok1481test plugin::registry::tests::isolation::confirmed_dispatch_returns_overload_for_retry ... ok1482test plugin::registry::tests::isolation::confirmed_dispatch_returns_plugin_failure_for_retry ... ok1483test plugin::registry::tests::isolation::confirmed_dispatch_attempts_other_plugins_after_one_fails ... ok1484test plugin::registry::tests::isolation::confirmed_dispatch_waits_for_the_plugin_to_finish ... ok1485test plugin::registry::tests::isolation::different_plugins_share_the_running_call_limit ... ok1486test plugin::registry::tests::isolation::events_execute_outside_the_async_worker ... ok1487test plugin::registry::tests::isolation::loaded_plugins_cannot_start_with_excessive_memory ... ok1488test plugin::registry::tests::isolation::loaded_plugins_cannot_grow_memory_past_the_limit ... ok1489test plugin::registry::tests::initialization::instruction_budget_is_replenished_for_each_call ... ok1490test plugin::registry::tests::isolation::pending_capacity_rejects_new_work_without_spawning_tasks ... ok1491test plugin::registry::tests::isolation::widgets_execute_outside_the_async_worker ... ok1492test plugin::registry::tests::load_empty_directory ... ok1493test plugin::registry::tests::load_nonexistent_directory ... ok1494test plugin::registry::tests::isolation::oversized_event_payloads_are_not_queued ... ok1495test render::tests::invoice_template_formats_large_minor_units_exactly ... ok1496test reports::bounded::tests::cancelled_export_keeps_its_slot_until_the_renderer_exits ... ok1497test reports::bounded::tests::export_admission_stays_reserved_until_the_body_is_dropped ... ok1498test reports::bounded::tests::export_rendering_runs_off_the_async_worker ... ok1499test reports::bounded::tests::output_budget_checks_writes_and_seeks_without_truncation ... ok1500test reports::bounded::tests::rendered_output_limit_rejects_oversized_files_and_releases_admission ... ok1501test plugin::registry::tests::isolation::oversized_wasm_output_is_rejected_before_copying_it ... ok1502test reports::bounded::tests::renderer_errors_and_panics_release_admission ... ok1503test reports::bounded::tests::timed_out_export_keeps_its_slot_until_the_renderer_exits ... ok1504test reports::limits::tests::bounded_entries_enforce_the_row_limit_after_all_filters ... ok1505test reports::limits::tests::bounded_entries_reject_large_fields_and_combined_text ... ok1506test reports::limits::tests::bounded_exports_preserve_real_workbooks_and_deterministic_pdf ... ok1507test plugin::registry::tests::load_test_plugins ... ok1508test plugin::registry::tests::collect_widgets_from_echo_plugin ... ok1509test plugin::registry::tests::dispatch_event_with_no_subscribers ... ok1510test plugin::host::tests::database_tests::wasm_host_uses_the_restricted_connection_on_a_current_thread_runtime ... ok1511test reports::limits::tests::bounded_invoice_limits_include_branding_and_preserve_tenant_scope ... ok1512test reports::limits::tests::measure_bounded_export_limits ... ignored, manual release export measurement; set HORAE_EXPORT_PROBE_DIR for artifacts1513test reports::limits::tests::bounded_projects_filter_archives_before_size_checks ... ok1514test reports::limits::tests::tag_filter_applies_before_xlsx_size_checks_and_rendering ... ok1515test plugin::registry::tests::isolation::a_wasm_timeout_releases_the_worker_and_instance ... ok1516test plugin::registry::tests::dispatch_to_echo_plugin_succeeds ... ok1517test plugin::registry::tests::failing_plugin_does_not_block_caller ... ok1518test reports::streaming::database_tests::measure_streaming_csv_export ... ignored, Manual release measurement of a 100,000-row CSV download1519test plugin::registry::tests::dispatch_invoice_sent_to_echo_plugin ... ok1520test reports::limits::tests::fee_exports_preserve_absent_quantities_and_render_a_real_pdf ... ok1521test reports::limits::tests::invoice_exports_show_saved_adjustments_and_exact_large_amounts ... ok1522test reports::streaming::database_tests::a_real_database_error_interrupts_the_csv_body ... ok1523test reports::streaming::database_tests::streamed_fee_invoice_has_no_fabricated_hours_or_hourly_rate ... ok1524test reports::privacy_tests::unauthorized_project_text_does_not_affect_export_size_limits ... ok1525test reports::streaming::database_tests::dropping_streamed_timesheet_closes_its_database_connection ... ok1526test reports::streaming::tests::completed_csv_keeps_admission_until_body_drop ... ok1527test reports::streaming::tests::csv_backpressure_and_body_drop_bound_and_cancel_source_reads ... ok1528test reports::streaming::tests::csv_does_not_truncate_a_quoted_unicode_record_larger_than_a_chunk ... ok1529test reports::streaming::tests::csv_emits_a_chunk_before_the_source_finishes ... ok1530test reports::streaming::tests::csv_failure_or_panic_after_a_chunk_is_not_successful_eof ... ok1531test reports::streaming::tests::csv_startup_errors_are_http_errors_and_release_admission ... ok1532test reports::streaming::database_tests::streamed_projects_preserve_scope_budget_and_tenant_isolation ... ok1533test reports::streaming::tests::dropping_csv_during_startup_cancels_the_producer ... ok1534test route::tests::client_detail_preserves_identity_and_highlights_only_clients ... ok1535test route::tests::client_workflow_paths_preserve_context_and_navigation_section ... ok1536test route::tests::edit_project_preserves_identity_and_highlights_only_projects ... ok1537test route::tests::malformed_context_reaches_the_workflow_for_validation_after_recovery ... ok1538test route::tests::new_project_is_static_and_highlights_only_projects ... ok1539test reports::streaming::database_tests::streamed_timesheet_preserves_csv_escaping_frozen_zero_and_all_filters ... ok1540test reports::streaming::database_tests::streamed_invoice_metadata_and_lines_share_one_snapshot ... ok1541test reports::streaming::tests::csv_timeout_interrupts_an_already_started_body ... ok1542test reports::streaming::database_tests::streamed_timesheet_exceeds_xlsx_row_limit_without_one_large_body_chunk ... ok1543test reports::limits::tests::export_queries_are_read_only_and_have_a_database_deadline ... ok1544test reports::streaming::database_tests::streamed_invoice_uses_stored_exact_cents_and_tenant_scoped_metadata ... ok1545test seed::tests::late_seed_failure_rolls_back_all_demo_data ... ok1546test seed::tests::concurrent_init_and_seed_cannot_mix_organizations ... ok1547test server_fns::approvals::submission_tests::cancelling_a_submission_releases_its_write_barrier ... ok1548test reports::privacy_tests::project_downloads_follow_progress_visibility ... ok1549test server_fns::approvals::submission_tests::submission_accepts_the_organizations_sunday_start ... ok1550test seed::tests::seed_refuses_an_initialized_organization_without_writes ... ok1551test server_fns::approvals::submission_tests::submission_barrier_allows_shared_writers_for_the_same_user ... ok1552test server_fns::approvals::submission_tests::submission_does_not_wait_for_another_users_writer ... ok1553test server_fns::approvals::submission_tests::submission_rejects_a_start_that_is_not_the_organizations_week_start ... ok1554test server_fns::approvals::submission_tests::submission_freezes_the_minutes_after_a_competing_edit ... ok1555test seed::tests::concurrent_initializers_cannot_create_two_organizations ... ok1556test server_fns::approvals::submission_tests::submission_uses_one_pool_connection ... ok1557test server_fns::approvals::tests::ignores_stopped_and_out_of_week_timers ... ok1558test server_fns::approvals::submission_tests::submission_waits_for_a_new_timer_before_checking_the_week ... ok1559test server_fns::budget_tests::configured_alert_and_outbox_roll_back_together ... ok1560test server_fns::approvals::tests::sees_a_running_timer_inside_the_week ... ok1561test seed::tests::seed_refuses_a_second_organization_even_when_the_demo_exists ... ok1562test server_fns::budget_tests::concurrent_budget_checks_have_one_band_claimant ... ok1563test server_fns::budget_tests::budget_notification_schema_enforces_tenants_and_no_public_access ... ok1564test server_fns::budget_tests::configured_alert_recipients_are_active_same_org_managers_and_project_leads ... ok1565test server_fns::budget_tests::configured_alerts_deduplicate_concurrent_checks_and_recrossing ... ok1566test server_fns::budget_tests::configured_alerts_require_enabled_active_project_and_authorized_recipient ... ok1567test reports::limits::tests::export_size_checks_and_reads_share_a_repeatable_read_snapshot ... ok1568test server_fns::budget_tests::configured_budget_does_not_read_foreign_or_legacy_projects ... ok1569test server_fns::budget_tests::configured_nonbillable_projects_count_time_without_hidden_checkbox ... ok1570test server_fns::budget_tests::configured_monthly_budget_excludes_other_months_and_nonbillable_time ... ok1571test server_fns::budget_tests::configured_budget_sweep_recovers_missed_checks_without_duplicates ... ok1572test seed::tests::repeated_seed_preserves_every_row_and_user_edits ... ok1573test server_fns::budget_tests::configured_amount_budget_uses_resolved_rates_and_explicit_zero ... ok1574test server_fns::budget_tests::configured_monthly_budget_includes_leap_day_and_preserves_locked_rounding ... ok1575test server_fns::budget_tests::configured_task_and_person_budgets_do_not_share_consumption ... ok1576test server_fns::budget_tests::configured_person_budget_excludes_other_people_and_has_its_own_alert ... ok1577test server_fns::budget_tests::overview_budget_progress_is_current_period_scoped_and_authorized ... ok1578test server_fns::budget_tests::overview_budget_progress_batches_projects_without_mixing_scopes ... ok1579test reports::streaming::database_tests::streamed_tag_filter_excludes_other_projects_without_duplicating_rows ... ok1580test server_fns::clients::tests::both_activation_transitions_change_once_and_preserve_details ... ok1581test server_fns::budget_tests::configured_task_fee_budget_respects_billability_and_alert_scope ... ok1582test server_fns::budget_tests::overview_budget_progress_includes_people_without_an_allowance ... ok1583test server_fns::clients::tests::client_invoices_keep_exact_client_scope_statuses_and_currencies ... ok1584test server_fns::clients::tests::client_invoices_reject_a_winning_concurrent_revocation ... ok1585test server_fns::clients::tests::client_details_keep_catalog_identity_but_omit_member_billing ... ok1586test server_fns::clients::tests::client_details_distinguish_unset_zero_and_positive_manager_rates ... ok1587test server_fns::clients::tests::client_default_rate_prevents_currency_relabelling ... ok1588test server_fns::clients::tests::client_default_rate_allows_detail_edits_and_equivalent_currency ... ok1589test server_fns::clients::tests::client_details_hide_foreign_missing_and_inactive_actor_records ... ok1590test server_fns::clients::tests::client_invoices_hold_authority_until_the_read_finishes ... ok1591test server_fns::clients::tests::concurrent_deletion_is_not_an_unchanged_mutation ... ok1592test server_fns::clients::tests::currency_edit_rechecks_a_concurrently_added_client_default_rate ... ok1593test server_fns::clients::tests::client_summaries_reject_a_foreign_actor_even_when_client_org_is_known ... ok1594test server_fns::clients::tests::client_invoices_require_manager_authority_even_without_invoices ... ok1595test server_fns::clients::tests::client_summaries_keep_catalog_without_projects_and_count_archived_projects ... ok1596test seed::tests::seed_leaves_an_older_or_partial_demo_unchanged ... ok1597test server_fns::clients::tests::client_summaries_follow_existing_progress_visibility_and_revoke_inactive_users ... ok1598test server_fns::clients::tests::client_summaries_exclude_foreign_clients_and_unreadable_project_currencies ... ok1599test server_fns::clients::tests::each_field_changes_once_and_preserves_inactive_status ... ok1600test server_fns::clients::tests::profile_noop_preserves_row_and_returns_no_update_event_signal ... ok1601test server_fns::clients::tests::profile_currency_change_without_a_rate_keeps_it_unset ... ok1602test server_fns::clients::tests::profile_saves_reject_invalid_input_without_partial_writes ... ok1603test seed::tests::concurrent_seed_runs_create_only_one_demo ... ok1604test server_fns::clients::tests::missing_and_foreign_clients_are_not_noops ... ok1605test server_fns::clients::tests::profile_saves_recheck_manager_org_and_active_actor ... ok1606test server_fns::clients::tests::profile_update_rechecks_authority_after_waiting_for_a_concurrent_demotion ... ok1607test server_fns::clients::tests::profile_create_persists_normalized_identity_and_exact_optional_rate ... ok1608test server_fns::clients::tests::profile_update_preserves_historical_rows_and_inactive_status ... ok1609test server_fns::clients::tests::repeating_a_competing_edit_does_not_report_a_change ... ok1610test server_fns::importers::authorization_tests::cli_job_endpoints_have_stable_registered_paths ... ok1611test server_fns::clients::tests::unchanged_edit_preserves_the_row ... ok1612test server_fns::importers::authorization_tests::request_bound_import_endpoints_are_not_registered ... ok1613test server_fns::importers::csv_upload::tests::csv_upload_extractor_preserves_raw_bytes ... ok1614test server_fns::importers::csv_upload::tests::csv_upload_requires_its_header_without_reading_the_body ... ok1615test server_fns::importers::tests::concurrent_api_import_returns_a_retryable_conflict ... ok1616test server_fns::clients::tests::unchanged_activation_preserves_the_row ... ok1617test server_fns::clients::tests::repeating_a_competing_deactivation_does_not_report_a_transition ... ok1618test server_fns::clients::tests::profile_update_requires_explicit_rate_intent_for_currency_changes ... ok1619test server_fns::importers::tests::submission_identity_rejects_expired_future_and_non_v7_keys ... ok1620test server_fns::clients::tests::profile_update_rejects_stale_rate_even_when_the_target_currency_is_unchanged ... ok1621test server_fns::clients::tests::restoring_a_competing_deactivation_reports_reactivation ... ok1622test server_fns::clients::tests::profile_update_rejects_stale_currency_even_when_the_rate_is_still_unset ... ok1623test server_fns::clients::tests::profile_update_rechecks_financial_snapshot_after_waiting_for_a_concurrent_edit ... ok1624test server_fns::importers::tests::csv_route_rejects_invalid_modes_and_headers_without_reading_uploads ... ok1625test server_fns::clients::tests::restoring_values_after_a_competing_edit_reports_a_change ... ok1626test server_fns::invoices::fee_tests::concurrent_invoices_claim_a_single_fee_once ... ok1627test server_fns::invoices::fee_tests::fee_invoice_does_not_claim_hours_or_another_clients_fee ... ok1628test server_fns::invoices::fee_tests::fee_occurrence_rejects_cross_organization_project ... ok1629test server_fns::importers::authorization_tests::job_endpoints_enforce_session_role_and_organization ... ok1630test server_fns::invoices::fee_tests::fee_total_overflow_rolls_back_occurrences_and_invoice ... ok1631test server_fns::invoices::fee_tests::fee_balance_migration_allocates_discount_without_rewriting_invoice_snapshots ... ok1632test server_fns::invoices::fee_tests::invoice_line_sources_reject_mixed_sources_and_invented_fee_quantities ... ok1633test server_fns::invoices::fee_tests::draft_fee_edit_replaces_amount_and_preserves_source_and_retry_identity ... ok1634test server_fns::invoices::fee_tests::fee_preview_keeps_source_identity_and_reports_discounted_draft_balances ... ok1635test server_fns::invoices::fee_tests::milestones_include_unbilled_overdue_fees_but_not_future_fees ... ok1636test server_fns::invoices::fee_tests::draft_fee_edit_rejects_invalid_lines_and_current_unauthorized_actors ... ok1637test server_fns::invoices::fee_tests::monthly_fees_use_calendar_dates_and_skip_already_claimed_months ... ok1638test server_fns::invoices::fee_tests::invoice_preview_does_not_materialize_fees_and_preserves_released_snapshots ... ok1639test server_fns::invoices::fee_tests::monthly_first_and_fifteenth_respect_partial_period_and_project_end ... ok1640test server_fns::invoices::fee_tests::invoice_status_rechecks_authority_after_waiting_for_the_invoice_lock ... ok1641test server_fns::invoices::fee_tests::draft_fee_edit_serializes_retries_and_rejects_stale_revisions ... ok1642test server_fns::invoices::fee_tests::fee_preview_discount_ties_follow_source_keys_not_display_dates ... ok1643test server_fns::invoices::fee_tests::prepared_fee_selection_rejects_invalid_values_and_empty_generation ... ok1644test server_fns::invoices::fee_tests::concurrent_discounted_invoice_retries_return_one_invoice ... ok1645test server_fns::invoices::fee_tests::removing_discount_and_billing_the_remainder_cannot_both_succeed ... ok1646test server_fns::invoices::fee_tests::invoice_defaults_apply_to_selected_fees_without_claiming_other_projects ... ok1647test server_fns::invoices::fee_tests::reviewed_generation_does_not_materialize_unselected_months ... ok1648test server_fns::invoices::fee_tests::single_fee_can_be_invoiced_without_time ... ok1649test server_fns::invoices::fee_tests::project_fee_context_keeps_monthly_balances_separate ... ok1650test server_fns::invoices::fee_tests::void_releases_fee_identity_without_rewriting_the_original_line ... ok1651test server_fns::invoices::preview::tests::excess_rejects_an_unrepresentable_total_even_when_the_remainder_fits ... ok1652test server_fns::invoices::preview::tests::unselected_fee_currencies_do_not_relabel_or_block_selected_charges ... ok1653test server_fns::invoices::fee_tests::mixed_time_and_fee_discount_conserves_cents_without_reopening_time ... ok1654test server_fns::invoices::tests::configured_fixed_fee_hours_are_not_invoiced_but_legacy_fees_are_unchanged ... ok1655test server_fns::invoices::fee_tests::settled_fee_sources_remain_reviewable_without_automatic_charges ... ok1656test server_fns::invoices::tests::billing_cascade_agrees_across_all_four_levels_including_zero ... ok1657test server_fns::invoices::tests::configured_project_currency_and_cost_override_keep_their_denominations ... ok1658test server_fns::invoices::fee_tests::reviewed_generation_rejects_changed_time_before_claiming_it ... ok1659test server_fns::invoices::tests::effective_minutes_migration_preserves_historical_invoice_quantities ... ok1660test server_fns::invoices::fee_tests::discounted_fee_leaves_a_balance_and_void_releases_only_its_contribution ... ok1661test server_fns::invoices::fee_tests::project_fee_context_matches_invoice_balances_and_current_authority ... ok1662test server_fns::invoices::fee_tests::draft_fee_edit_requires_current_balance_and_exact_excess_confirmation ... ok1663test server_fns::invoices::tests::effective_minutes_sql_matches_domain_rounding ... ok1664test server_fns::invoices::tests::imported_rates::imported_legacy_project_keeps_exact_rates_and_totals_on_retry ... ok1665test server_fns::invoices::fee_tests::reviewed_generation_bills_partial_fees_and_rejects_stale_balances ... ok1666test server_fns::invoices::tests::invoice_defaults_are_invoice_owned_and_only_drafts_are_editable ... ok1667test server_fns::invoices::tests::invoice_defaults_validate_all_override_fields ... ok1668test server_fns::invoices::tests::invoice_line_overflow_leaves_time_unbilled ... ok1669test server_fns::invoices::fee_tests::zero_fee_is_invoiced_once_until_voided ... ok1670test server_fns::invoices::tests::invoice_defaults_legacy_insert_preserves_dates_and_exact_total ... ok1671test server_fns::invoices::tests::invoice_defaults_selection_rejects_unavailable_projects_before_claiming ... ok1672test server_fns::invoices::tests::imported_rates::imported_task_rates_require_matching_currency_only_for_new_configured_links ... ok1673test server_fns::invoices::tests::invoice_total_overflow_leaves_all_time_unbilled ... ok1674test server_fns::invoices::tests::invoice_preview_keeps_time_rates_and_defaults_in_one_snapshot ... ok1675test server_fns::invoices::tests::invoice_transitions_reject_invalid_states_and_foreign_organizations ... ok1676test server_fns::invoices::tests::invoiced_amounts_survive_rate_changes_and_void_uses_current_rates ... ok1677test server_fns::invoices::tests::invoicing_leaves_running_time_open ... ok1678test server_fns::invoices::tests::invoiced_billability_survives_later_project_changes ... ok1679test server_fns::invoices::tests::invoice_preview_rejects_large_results_instead_of_truncating_them ... ok1680test server_fns::invoices::tests::invoicing_uses_and_freezes_effective_minutes ... ok1681test server_fns::invoices::tests::large_invoice_and_reports_agree_without_intermediate_overflow ... ok1682test server_fns::invoices::tests::non_billable_context_produces_no_unbilled_amount_on_any_report ... ok1683test server_fns::invoices::fee_tests::reviewed_generation_requires_exact_excess_and_current_authority ... ok1684test server_fns::invoices::tests::mixed_project_currencies_cannot_partially_create_an_invoice ... ok1685test server_fns::invoices::tests::only_running_time_does_not_create_an_invoice ... ok1686test server_fns::invoices::tests::invoice_preview_requires_explicit_resolution_and_scopes_selected_projects ... ok1687test server_fns::invoices::tests::project_rate_is_used_by_invoices_reports_and_spend ... ok1688test server_fns::invoices::tests::void_reopens_time_without_stale_rounding ... ok1689test server_fns::invoices::tests::selected_project_rate_modes_agree_across_billing_consumers ... ok1690test server_fns::organization::tests::each_branding_field_changes_once_including_null_and_empty ... ok1691test server_fns::organization::tests::missing_organization_is_not_an_unchanged_update ... ok1692test server_fns::organization::tests::repeating_a_competing_branding_edit_does_not_report_a_change ... ok1693test server_fns::invoices::tests::invoice_preview_matches_generation_without_claiming_time ... ok1694test server_fns::invoices::tests::void_waits_for_a_concurrent_payment_and_then_refuses ... ok1695test server_fns::organization::tests::unchanged_branding_preserves_the_row ... ok1696test server_fns::invoices::tests::imported_rates::rejected_import_rate_does_not_poison_the_next_row_or_its_catalog_rate ... ok1697test server_fns::project_creation::editing::tests::editing_milestones_keeps_invoice_snapshots_and_fee_identities_immutable ... ok1698test server_fns::organization::tests::restoring_branding_after_a_competing_edit_reports_a_change ... ok1699test server_fns::project_creation::editing::tests::concurrent_edits_have_one_winner_and_association_writes_invalidate_open_forms ... ok1700test server_fns::project_creation::assignment_tests::finalization_reuses_catalog_and_keeps_lead_overrides_local_on_retry ... ok1701test server_fns::project_creation::assignment_tests::invalid_assignment_graphs_leave_no_partial_creation_or_draft_change ... ok1702test server_fns::project_creation::editing::tests::editor_rechecks_tenant_role_and_active_status ... ok1703test server_fns::project_creation::editing::tests::editor_preserves_fee_schedule_and_operational_milestone_ids ... ok1704test server_fns::project_creation::editing::tests::editor_loads_legacy_values_without_fabricating_a_billing_mode_or_draft ... ok1705test server_fns::project_creation::editing::tests::editor_recovers_full_configuration_and_redacts_private_values_after_role_change ... ok1706test server_fns::project_creation::editing::tests::editor_keeps_archived_selected_identities_and_nullable_overrides ... ok1707test server_fns::invoices::tests::invoice_defaults_edit_rechecks_status_after_waiting_for_a_concurrent_send ... ok1708test server_fns::project_creation::editing::tests::editor_recovers_each_budget_scope_without_turning_absence_into_zero ... ok1709test server_fns::project_creation::editing::tests::foreign_actor_cannot_save_or_retry_another_organizations_edit ... ok1710test server_fns::project_creation::editing::tests::saves_recheck_current_authority_and_do_not_repeat_noops ... ok1711test server_fns::project_creation::editing::tests::save_edits_the_same_legacy_project_and_never_creates_a_draft_or_configuration ... ok1712test server_fns::project_creation::editing::tests::task_catalog_and_graph_changes_roll_back_together_on_duplicate_resolution ... ok1713test server_fns::project_creation::editing::tests::save_updates_configured_sections_atomically_and_rejects_stale_or_invalid_edits ... ok1714test server_fns::project_creation::editing::tests::save_preserves_recorded_time_and_rejects_removing_its_task_or_person ... ok1715test server_fns::invoices::tests::invoice_defaults_conflict_rolls_back_all_claims ... ok1716test server_fns::project_creation::editing::tests::manager_edit_preserves_private_settings_and_cannot_remove_them_indirectly ... ok1717test server_fns::project_creation::tests::client_dialog_validates_details_and_persists_an_explicit_zero_rate ... ok1718test server_fns::project_creation::tests::draft_ownership_discard_and_role_changes_are_enforced ... ok1719test server_fns::project_creation::tests::creation_actor_is_revalidated_inside_the_transaction ... ok1720test server_fns::project_creation::tests::creation_client_must_be_active_and_in_the_same_organization ... ok1721test server_fns::project_creation::tests::creation_options_are_scoped_bounded_and_redact_manager_costs ... ok1722test server_fns::project_creation::tests::billing_schema_rejects_partial_fee_schedules ... ok1723test server_fns::invoices::tests::invoice_defaults_apply_exact_adjustments_and_payment_terms ... ok1724test server_fns::project_creation::tests::final_validation_checks_invoice_defaults_and_scoped_budget_totals ... ok1725test server_fns::project_creation::tests::final_validation_preserves_exact_budgets_and_rejects_unavailable_email ... ok1726test server_fns::project_creation::tests::final_validation_requires_complete_fee_schedules_and_distinct_entities ... ok1727test server_fns::project_creation::tests::final_validation_requires_real_details_and_ignores_hidden_type_settings ... ok1728test server_fns::project_creation::tests::draft_validation_preserves_incomplete_input_but_bounds_its_size ... ok1729test server_fns::project_creation::tests::draft_schema_rejects_foreign_creator_and_completed_project ... ok1730test server_fns::project_creation::tests::existing_projects_have_no_implicit_new_billing_configuration ... ok1731test server_fns::project_creation::tests::draft_save_retries_do_not_overwrite_a_newer_revision ... ok1732test server_fns::project_creation::tests::managers_cannot_store_administrator_notes_or_costs_in_a_draft ... ok1733test server_fns::project_creation::tests::draft_schema_enforces_one_current_draft_per_creator ... ok1734test server_fns::project_creation::tests::finalization_persists_task_access_and_project_only_financial_overrides ... ok1735test server_fns::project_creation::tests::finalization_rechecks_client_role_revision_and_rate_currency ... ok1736test server_fns::project_creation::tests::draft_schema_rejects_oversize_payload_and_invalid_revision ... ok1737test server_fns::project_creation::editing::tests::editor_load_uses_current_role_across_all_billing_configurations ... ok1738test server_fns::project_creation::validation::tests::assignment_rejections_identify_the_invalid_row ... ok1739test server_fns::project_creation::validation::tests::basic_rejections_identify_the_field_without_echoing_input ... ok1740test server_fns::project_creation::validation::tests::billing_rejections_identify_the_active_control ... ok1741test server_fns::project_creation::validation::tests::inactive_billing_inputs_remain_in_the_draft_without_blocking_creation ... ok1742test server_fns::project_creation::validation::tests::invoice_rejections_identify_the_field_without_echoing_input ... ok1743test server_fns::project_creation::validation::tests::milestone_rejections_target_the_invalid_row_by_identity ... ok1744test server_fns::project_creation::validation::tests::non_billable_projects_ignore_hidden_invoice_inputs ... ok1745test server_fns::project_creation::validation::tests::task_name_and_access_rejections_identify_the_invalid_row ... ok1746test server_fns::project_creation::tests::selected_catalog_bounds_requests_and_excludes_inactive_people ... ok1747test server_fns::projects::bulk_tests::bulk_accepts_one_hundred_projects_and_mixed_status_noops ... ok1748test server_fns::projects::bulk_tests::bulk_ids_validate_before_writes_and_normalize_duplicates ... ok1749test server_fns::project_creation::tests::simultaneous_draft_updates_have_one_winner ... ok1750test server_fns::project_creation::tests::selected_catalog_is_scoped_deduplicated_and_redacts_manager_costs ... ok1751test server_fns::project_creation::tests::invalid_task_rolls_back_project_and_keeps_the_draft ... ok1752test server_fns::project_creation::tests::finalize_is_atomic_and_repeated_submission_returns_one_project ... ok1753test server_fns::project_creation::import_tests::imported_catalog_rate_cannot_be_relabelled_as_workspace_currency ... ok1754test server_fns::project_creation::tests::missing_draft_responses_do_not_disclose_foreign_ownership ... ok1755test server_fns::project_creation::tests::selected_client_lookup_is_scoped_and_keeps_archived_identity ... ok1756test server_fns::projects::bulk_tests::bulk_missing_or_foreign_project_rolls_back_earlier_changes ... ok1757test server_fns::projects::bulk_tests::bulk_reversed_overlapping_batches_finish_without_deadlock ... ok1758test server_fns::projects::bulk_tests::bulk_status_preserves_details_history_and_noop_versions ... ok1759test server_fns::projects::bulk_tests::bulk_preserves_invoiced_history_assignments_and_spend ... ok1760test server_fns::projects::bulk_tests::bulk_database_failure_rolls_back_earlier_changes ... ok1761test server_fns::projects::mutation_tests::project::both_activation_transitions_preserve_details_and_change_once ... ok1762test server_fns::projects::mutation_tests::project::configured_edits_recheck_settings_after_waiting_for_the_project ... ok1763test server_fns::projects::mutation_tests::project::concurrent_deletion_is_rejected_by_both_mutations ... ok1764test server_fns::project_creation::import_tests::imports_preserve_finalized_project_configuration_and_restricted_access ... ok1765test server_fns::projects::mutation_tests::project::budgets_and_rates_distinguish_null_zero_and_normalized_values ... ok1766test server_fns::projects::mutation_tests::project::configured_edits_preserve_non_hourly_billing ... ok1767test server_fns::projects::mutation_tests::project::configured_edits_preserve_compatible_changes_and_idempotence ... ok1768test server_fns::projects::mutation_tests::project::inactive_project_edits_preserve_identity_and_reject_implicit_migrations ... ok1769test server_fns::projects::mutation_tests::project::configured_edits_reject_incompatible_financial_changes_atomically ... ok1770test server_fns::projects::mutation_tests::project::invalid_project_fields_leave_the_row_unchanged ... ok1771test server_fns::projects::mutation_tests::project::repeating_a_competing_deactivation_reports_no_transition ... ok1772test server_fns::projects::details_tests::unlinked_and_private_project_tags_do_not_leak_into_filters ... ok1773test server_fns::projects::mutation_tests::project::missing_and_foreign_rows_are_not_noops ... ok1774test server_fns::projects::mutation_tests::project::repeating_a_competing_edit_requires_a_fresh_revision ... ok1775test server_fns::projects::mutation_tests::project::restoring_a_competing_deactivation_reports_reactivation ... ok1776test server_fns::projects::mutation_tests::task::rate_edits_set_currency_without_relabelling_renames_or_noops ... ok1777test server_fns::projects::mutation_tests::task::missing_and_foreign_rows_are_not_noops ... ok1778test server_fns::projects::mutation_tests::task::both_activation_transitions_preserve_details_and_change_once ... ok1779test server_fns::projects::mutation_tests::project::unchanged_activation_preserves_the_row ... ok1780test server_fns::projects::mutation_tests::task::each_detail_field_changes_once_and_preserves_inactive_status ... ok1781test server_fns::projects::mutation_tests::project::restoring_a_competing_edit_does_not_overwrite_the_other_session ... ok1782test server_fns::projects::mutation_tests::task::concurrent_deletion_returns_not_found_for_both_mutations ... ok1783test server_fns::projects::mutation_tests::project::unchanged_edit_preserves_the_row ... ok1784test server_fns::projects::mutation_tests::task::repeating_a_competing_edit_does_not_report_a_change ... ok1785test server_fns::projects::mutation_tests::task::repeating_a_competing_deactivation_reports_no_transition ... ok1786test server_fns::projects::mutation_tests::task::unchanged_activation_preserves_the_row ... ok1787test server_fns::projects::privacy_tests::legacy_members_retain_progress_without_new_settings ... ok1788test server_fns::projects::details_tests::project_details_and_tags_follow_current_progress_and_private_permissions ... ok1789test server_fns::projects::privacy_tests::client_project_filter_preserves_progress_access_and_rate_redaction ... ok1790test server_fns::projects::mutation_tests::task::unchanged_edit_preserves_the_row ... ok1791test server_fns::projects::mutation_tests::task::restoring_a_competing_edit_reports_a_change ... ok1792test server_fns::projects::mutation_tests::task::restoring_a_competing_deactivation_reports_reactivation ... ok1793test server_fns::projects::tests::enabling_is_tenant_scoped_even_for_existing_links_and_preserves_overrides ... ok1794test server_fns::projects::privacy_tests::project_members_and_leads_receive_progress_without_rates ... ok1795test server_fns::projects::tests::assignments_are_scoped_to_the_viewers_organization ... ok1796test server_fns::projects::privacy_tests::revoked_membership_preserves_only_own_historical_tracking_identity ... ok1797test server_fns::projects::tests::enabling_tasks_accepts_exact_project_currency_rates_and_preserves_existing_links ... ok1798test server_fns::projects::privacy_tests::outsiders_and_inactive_viewers_have_no_project_reads ... ok1799test server_fns::projects::tests::creating_a_project_task_enables_it_with_its_defaults ... ok1800test server_fns::projects::privacy_tests::private_progress_does_not_prevent_tracking_or_reveal_financial_fields ... ok1801test server_fns::projects::tests::project_rate_distinguishes_inheritance_zero_and_exact_amounts ... ok1802test server_fns::projects::privacy_tests::project_reads_use_current_authority_and_reject_foreign_scope ... ok1803test server_fns::projects::details_tests::project_details_only_offer_task_rate_currency_to_current_managers ... ok1804test server_fns::projects::tests::project_rate_helper_has_no_public_execute_grant ... ok1805test server_fns::projects::tests::project_rate_sql_matches_rust_for_missing_zero_and_present_sources ... ok1806test server_fns::projects::tests::enabling_tasks_rejects_explicit_rates_unused_by_the_project ... ok1807test server_fns::projects::tests::members_can_list_identities_but_not_assignment_rates ... ok1808test server_fns::projects::tests::enabling_tasks_rejects_incompatible_catalog_currency ... ok1809test server_fns::projects::tests::managers_and_admins_can_read_assignment_rates ... ok1810test server_fns::projects::tests::failed_project_task_creation_leaves_no_orphan_task ... ok1811test server_fns::projects::tests::enabling_tasks_rejects_invalid_or_wrong_currency_explicit_rates_without_linking ... ok1812test server_fns::projects::tests::enabling_tasks_only_inherits_rates_used_by_configured_projects ... ok1813test server_fns::projects::tests::unknown_catalog_currency_requires_explicit_configured_rates_but_preserves_legacy ... ok1814test server_fns::reports::tests::filters_and_renames_keep_report_identity_and_totals ... ok1815test server_fns::reports::tests::manager_report_omits_groups_containing_private_project_costs ... ok1816test server_fns::reports::tests::report_uses_current_active_actor_and_tenant_for_every_filter ... ok1817test server_fns::reports::tests::same_names_keep_separate_groups_for_every_dimension ... ok1818test server_fns::time_entries::tests::a_limit_bounds_a_listing_on_its_own ... ok1819test server_fns::snapshot::reader_tests::legacy_readers_preserve_actor_tenant_filters_and_missing_resources ... ok1820test server_fns::time_entries::tests::a_reorder_rejects_foreign_missing_timed_and_duplicate_ids ... ok1821test server_fns::time_entries::tests::a_running_timer_cannot_be_moved_to_another_day ... ok1822test server_fns::snapshot::reader_tests::legacy_readers_preserve_inherited_connection_settings ... ok1823test server_fns::time_entries::tests::an_unlimited_listing_needs_both_ends_of_the_range ... ok1824test server_fns::time_entries::tests::admin_may_log_time_without_assignment ... ok1825test server_fns::time_entries::tests::clamps_duration_against_the_snapped_start ... ok1826test server_fns::time_entries::tests::an_open_entry_can_move_into_a_day_with_locked_time ... ok1827test server_fns::time_entries::tests::assigned_member_may_log_time ... ok1828test server_fns::time_entries::tests::concurrent_timer_starts_insert_exactly_one_entry ... ok1829test server_fns::snapshot::reader_tests::legacy_readers_reject_revoked_session_identity ... ok1830test server_fns::time_entries::tests::inactive_project_cannot_accept_new_time_even_for_admin ... ok1831test server_fns::time_entries::tests::new_time_and_picker_reject_inactive_or_foreign_contexts ... ok1832test server_fns::time_entries::tests::edits_preserve_archived_time_but_cannot_override_non_billability ... ok1833test server_fns::time_entries::tests::rejects_out_of_range_start ... ok1834test server_fns::time_entries::tests::moving_locked_time_rejects_the_entire_reorder ... ok1835test server_fns::time_entries::tests::snaps_unaligned_start_to_the_grid ... ok1836test server_fns::snapshot::reader_tests::legacy_invoice_detail_keeps_metadata_and_lines_in_one_snapshot ... ok1837test server_fns::time_entries::tests::new_time_and_picker_require_a_project_task_link ... ok1838test server_fns::time_entries::tests::untimed_start_is_left_untouched ... ok1839test server_fns::time_entries::tests::unassigned_member_is_forbidden ... ok1840test server_fns::time_entries::tests::submission_barrier_blocks_edits_and_cross_week_reorders ... ok1841test server_fns::time_entries::tests::new_time_uses_effective_billability_for_manual_entries_and_timers ... ok1842test server_fns::time_entries::tests::submission_barrier_blocks_manual_entries_and_timer_starts ... ok1843test server_fns::snapshot::reader_tests::legacy_readers_cancel_without_retaining_authority_or_pool_connection ... ok1844test server_fns::time_entries::update_tests::missing_foreign_and_locked_entries_are_not_noops ... ok1845test server_fns::time_entries::update_tests::each_editable_field_changes_once_including_nulls ... ok1846test server_fns::time_entries::update_tests::effective_billability_noop_preserves_the_row ... ok1847test server_fns::time_entries::update_tests::competing_edit_that_restores_old_values_still_reports_a_change ... ok1848test server_fns::time_entries::update_tests::competing_identical_edit_is_a_noop_after_the_first_commit ... ok1849test server_fns::snapshot::reader_tests::legacy_readers_deny_writer_first_revocation ... ok1850test server_fns::time_entries::update_tests::concurrent_lock_or_delete_is_rechecked_before_editing ... ok1851test server_fns::reports::tests::tag_filters_keep_report_dimensions_and_details_in_sync ... ok1852test server_fns::time_entries::update_tests::restricted_reordering_rejects_the_whole_batch ... ok1853test server_fns::time_entries::update_tests::restricted_empty_task_rejects_changes_and_noop_edits ... ok1854test server_fns::time_entries::update_tests::normalized_noop_preserves_the_row_and_updated_at ... ok1855test server_fns::time_entries::update_tests::revoked_grant_does_not_trap_an_own_running_timer ... ok1856test server_fns::time_entries::update_tests::restriction_changes_are_rechecked_before_manual_or_timer_insertion ... ok1857test server_fns::time_entries::update_tests::restricted_task_rejects_reschedule_and_delete ... ok1858test server_fns::time_entries::update_tests::restricted_empty_task_rejects_picker_manual_and_timer_starts ... ok1859test server_fns::users::tests::concurrency::demotion_and_deactivation_keep_an_active_admin ... ok1860test server_fns::users::tests::concurrency::access_changes_cannot_target_another_organization ... ok1861test server_fns::time_entries::update_tests::revoked_timer_stop_preserves_the_open_state_guard ... ok1862test server_fns::users::tests::hide_rates_clears_both_rate_fields ... ok1863test server_fns::time_entries::update_tests::task_grants_allow_tracking_and_archived_history_for_every_role ... ok1864test server_fns::time_entries::update_tests::task_grant_revocation_committed_during_an_edit_is_rechecked ... ok1865test server_fns::users::tests::concurrency::deactivation_and_demotion_keep_an_active_admin ... ok1866test server_fns::users::tests::concurrency::concurrent_demotions_keep_an_active_admin ... ok1867test server_fns::users::tests::concurrency::concurrent_deactivations_keep_an_active_admin ... ok1868test server_fns::snapshot::reader_tests::legacy_readers_hold_reader_first_authority_until_materialized ... ok1869test server_fns::users::tests::concurrency::unchanged_admin_access_is_allowed ... ok1870test server_fns::users::tests::concurrency::the_last_admin_cannot_be_demoted_or_deactivated ... ok1871test server_fns::reports::tests::shared_person_and_task_are_partitioned_by_currency ... ok18721873failures:18741875---- importers::harvest::engine_tests::completed_imports_allow_immediate_retries stdout ----18761877thread 'importers::harvest::engine_tests::completed_imports_allow_immediate_retries' (86136239) panicked at crates/horae/src/importers/harvest/engine_tests.rs:133:14:1878called `Result::unwrap()` on an `Err` value: error communicating with database: Socket is not connected (os error 57)18791880Caused by:1881 Socket is not connected (os error 57)1882note: run with `RUST_BACKTRACE=1` environment variable to display a backtrace188318841885failures:1886 importers::harvest::engine_tests::completed_imports_allow_immediate_retries18871888test result: FAILED. 825 passed; 1 failed; 10 ignored; 0 measured; 0 filtered out; finished in 96.56s18891890error: test failed, to rerun pass `-p horae --bin horae`