failed attributes
| status |
attribute |
duration |
| failed |
checks.aarch64-darwin.e2e
|
1h 46m |
setup:
/nix/store/33g46rcp0n2p78kfdzdsw9k64lxw26hz-closure-info.drv
/nix/store/w8cm9nfpc932vn3si6a332lrk0im1z9c-run-nixos-vm.drv
/nix/store/jw0pc2glqsgijq …
setup:
/nix/store/33g46rcp0n2p78kfdzdsw9k64lxw26hz-closure-info.drv
/nix/store/w8cm9nfpc932vn3si6a332lrk0im1z9c-run-nixos-vm.drv
/nix/store/jw0pc2glqsgijqh467i74w7q008x7dg9-nixos-vm.drv
/nix/store/7nrl7mmbji2jdk9kw79bpy63bfjlx2hd-driverConfiguration.json.drv
/nix/store/vafqx4klqqc87dhl8bbq06avbvglrabg-nixos-test-driver-horae-e2e.drv
/nix/store/n1a0xl33wgyywawrfxb5p5gkjmigagqi-vm-test-run-horae-e2e.drv
Failed to find a machine for remote build!
derivation: n1a0xl33wgyywawrfxb5p5gkjmigagqi-vm-test-run-horae-e2e.drv
required (system, features): (aarch64-darwin, [apple-virt, nixos-test])
12 available machines:
(systems, maxjobs, supportedFeatures, mandatoryFeatures)
([aarch64-darwin], 8, [big-parallel, kvm, nixos-test, uid-range], [])
([aarch64-darwin], 8, [big-parallel, kvm, nixos-test, uid-range], [])
([aarch64-darwin], 8, [big-parallel, kvm, nixos-test, uid-range], [])
([aarch64-darwin], 8, [big-parallel, kvm, nixos-test, uid-range], [])
([aarch64-linux], 8, [big-parallel, kvm, nixos-test, uid-range], [])
([aarch64-linux], 8, [big-parallel…
error: Cannot build '/nix/store/n1a0xl33wgyywawrfxb5p5gkjmigagqi-vm-test-run-horae-e2e.drv'.
Reason: platform mismatch
Required system: 'aarch64-darwin'
Current system: 'x86_64-linux'
Reason: missing system features
Required features: {apple-virt, nixos-test}
Available features: {benchmark, big-parallel, ca-derivations, kvm, nixos-test, recursive-nix, uid-range}
|
| failed |
checks.aarch64-darwin.e2e-oidc
|
1h 54m |
setup:
/nix/store/jgvnv73sr3f4knp9jmc4bcii8m64g37m-closure-info.drv
/nix/store/wfxg8zsqs3llcrc1a7255cp980gpjxdc-run-nixos-vm.drv
/nix/store/79qbva2b81ldpd …
setup:
/nix/store/jgvnv73sr3f4knp9jmc4bcii8m64g37m-closure-info.drv
/nix/store/wfxg8zsqs3llcrc1a7255cp980gpjxdc-run-nixos-vm.drv
/nix/store/79qbva2b81ldpd9rr6xkg61qfwxjp01f-nixos-vm.drv
/nix/store/br8k5bpj9j6pyajrny7ybqml5fnnqfpa-driverConfiguration.json.drv
/nix/store/rl0gc0ynh3fv4fd8v2jca9avirbgkhsg-nixos-test-driver-horae-e2e-oidc.drv
/nix/store/qqrsqaicbk338clssvqy58g23g8pxva1-vm-test-run-horae-e2e-oidc.drv
Failed to find a machine for remote build!
derivation: qqrsqaicbk338clssvqy58g23g8pxva1-vm-test-run-horae-e2e-oidc.drv
required (system, features): (aarch64-darwin, [apple-virt, nixos-test])
12 available machines:
(systems, maxjobs, supportedFeatures, mandatoryFeatures)
([aarch64-darwin], 8, [big-parallel, kvm, nixos-test, uid-range], [])
([aarch64-darwin], 8, [big-parallel, kvm, nixos-test, uid-range], [])
([aarch64-darwin], 8, [big-parallel, kvm, nixos-test, uid-range], [])
([aarch64-darwin], 8, [big-parallel, kvm, nixos-test, uid-range], [])
([aarch64-linux], 8, [big-parallel, kvm, nixos-test, uid-range], [])
([aarch64-linux], 8, [big-par…
error: Cannot build '/nix/store/qqrsqaicbk338clssvqy58g23g8pxva1-vm-test-run-horae-e2e-oidc.drv'.
Reason: platform mismatch
Required system: 'aarch64-darwin'
Current system: 'x86_64-linux'
Reason: missing system features
Required features: {apple-virt, nixos-test}
Available features: {benchmark, big-parallel, ca-derivations, kvm, nixos-test, recursive-nix, uid-range}
|
| failed |
checks.aarch64-darwin.tests
|
21m 42s |
horae-tests-0.1.0:
called `Result::unwrap()` on an `Err` value: error communicating with database: Socket is not connected (os error 57)
Caused by:
Socket i …
horae-tests-0.1.0:
called `Result::unwrap()` on an `Err` value: error communicating with database: Socket is not connected (os error 57)
Caused by:
Socket is not connected (os error 57)
note: run with `RUST_BACKTRACE=1` environment variable to display a backtrace
failures:
importers::harvest::engine_tests::completed_imports_allow_immediate_retries
test result: FAILED. 825 passed; 1 failed; 10 ignored; 0 measured; 0 filtered out; finished in 96.56s
error: test failed, to rerun pass `-p horae --bin horae`
|
| failed |
checks.aarch64-linux.e2e
|
6m 51s |
vm-test-run-horae-e2e:
)
^
File "/nix/store/yv2q67grjgrymd498bgdfzlhyaj04cqv-nixos-test-driver-1.1/lib/python3.13/site-packages/test_driver/machine/__ …
vm-test-run-horae-e2e:
)
^
File "/nix/store/yv2q67grjgrymd498bgdfzlhyaj04cqv-nixos-test-driver-1.1/lib/python3.13/site-packages/test_driver/machine/__init__.py", line 878, in _execute
self.connect()
~~~~~~~~~~~~^^
File "/nix/store/yv2q67grjgrymd498bgdfzlhyaj04cqv-nixos-test-driver-1.1/lib/python3.13/site-packages/test_driver/machine/__init__.py", line 1057, in connect
raise RuntimeError("Shell did not start in time")
RuntimeError: Shell did not start in time
|
| failed |
checks.aarch64-linux.e2e-oidc
|
8m 31s |
vm-test-run-horae-e2e-oidc:
)
^
File "/nix/store/yv2q67grjgrymd498bgdfzlhyaj04cqv-nixos-test-driver-1.1/lib/python3.13/site-packages/test_driver/machi …
vm-test-run-horae-e2e-oidc:
)
^
File "/nix/store/yv2q67grjgrymd498bgdfzlhyaj04cqv-nixos-test-driver-1.1/lib/python3.13/site-packages/test_driver/machine/__init__.py", line 878, in _execute
self.connect()
~~~~~~~~~~~~^^
File "/nix/store/yv2q67grjgrymd498bgdfzlhyaj04cqv-nixos-test-driver-1.1/lib/python3.13/site-packages/test_driver/machine/__init__.py", line 1057, in connect
raise RuntimeError("Shell did not start in time")
RuntimeError: Shell did not start in time
|