horae-tests-0.1.0
checks.x86_64-linux.tests
· build #657
· raw
unpackPhase
1unpacking source archive /nix/store/annwfzah867w9hclkzskd6qaxa2nq4dm-source2source root is sourcepatchPhase
3Executing configureCargoCommonVars4decompressing cargo artifacts from /nix/store/p0fga5r55aw5iwdy8h0dpr32lhcczl5i-horae-checks-deps-0.1.0/target.tar.zst to targetconfigurePhase
5will append /build/source/.cargo-home/config.toml with contents of /nix/store/i0bj632any4bjpvnl84zc2h7cq8zn0mz-vendor-cargo-deps/config.toml6default configurePhase, nothing to dobuildPhase
7+++ command cargo nextest run -p horae-core --test-threads 488 Compiling proc-macro2 v1.0.1069 Compiling serde_core v1.0.22810 Compiling serde v1.0.22811 Compiling num-traits v0.2.1912 Compiling quote v1.0.4613 Compiling syn v2.0.11814 Compiling uuid v1.23.415 Compiling serde_derive v1.0.22816 Compiling thiserror-impl v2.0.1817 Compiling thiserror v2.0.1818 Compiling chrono v0.4.4519 Compiling horae-core v0.1.0 (/build/source/crates/core)20 Finished `test` profile [unoptimized + debuginfo] target(s) in 7.47s21------------22 Nextest run ID 60ebe8d8-65e7-46f8-8488-4836486c8233 with nextest profile: default23 Starting 191 tests across 1 binary24 Running [ 00:00:00] 0/191: 48 running, 0 passed, 0 skipped 25 [ 00:00:00] horae-core ert_accepts_zero_percent_but_not_zero_budget26 [ 00:00:00] horae-core ividual_overruns_or_recover_overflow_as_zero27 [ 00:00:00] horae-core ::a_single_jump_announces_every_crossed_band28 [ 00:00:00] horae-core ls_exclude_blank_but_include_zero_allowances29 [ 00:00:00] horae-core ed_alert_threshold_is_exact_without_rounding30 [ 00:00:00] horae-core jects_invalid_inputs_and_widens_large_values31 [ 00:00:00] horae-core percentage_rounds_clamps_and_never_overflows32 [ 00:00:00] horae-core ::tests::current_band_is_the_highest_reached33 Running [ 00:00:00] =======> 188/191: 3 running, 188 passed, 0 skipped 34 [ 00:00:00] horae-core s::conversion_matches_exact_scaled_rationals35 [ 00:00:00] horae-core h_valid_grant_pair_and_its_revoked_selection36 [ 00:00:00] horae-core mpotent_order_independent_and_duplicate_free373839404142 PASS [ 0.005s] horae-core duration::tests::minutes_between_is_exact_no_minimum43 PASS [ 0.006s] horae-core duration::tests::format_round_trip44 PASS [ 0.005s] horae-core duration::tests::parse_decimal45 PASS [ 0.006s] horae-core duration::tests::parse_preserves_u32_boundary_without_saturating46 PASS [ 0.007s] horae-core duration::tests::parse_decimal_rounds_half_minutes_exactly47 PASS [ 0.007s] horae-core duration::tests::parse_colon48 PASS [ 0.007s] horae-core client::tests::default_rate_preserves_absence_zero_and_exact_large_amounts49 PASS [ 0.007s] horae-core client::tests::profile_rejects_blank_overlong_and_null_names50 PASS [ 0.008s] horae-core budget::tests::current_band_is_the_highest_reached51 PASS [ 0.008s] horae-core budget::tests::drop_below_a_band_does_not_fire_but_current_resets52 PASS [ 0.008s] horae-core budget::tests::configured_alert_threshold_is_exact_without_rounding53 PASS [ 0.007s] horae-core importers::harvest::convert::tests::money_round_trip_against_exporter_transform54 PASS [ 0.007s] horae-core budget::tests::over_budget_fires_even_without_a_configured_100_band55 PASS [ 0.007s] horae-core duration::tests::format_hhmm_pads_minutes56 PASS [ 0.007s] horae-core duration::tests::parse_rejects_colon_overflow_without_panicking57 PASS [ 0.008s] horae-core budget::tests::allocated_totals_do_not_hide_individual_overruns_or_recover_overflow_as_zero58 PASS [ 0.008s] horae-core importers::harvest::convert::tests::conversion_preserves_the_i64_boundary_and_rejects_rounding_past_it59 PASS [ 0.008s] horae-core duration::tests::parse_rejects_negative_non_finite_and_malformed_values60 PASS [ 0.008s] horae-core budget::tests::configured_alert_accepts_zero_percent_but_not_zero_budget61 PASS [ 0.008s] horae-core importers::harvest::convert::tests::conversion_handles_high_precision_without_intermediate_overflow62 PASS [ 0.008s] horae-core budget::tests::no_band_for_zero_or_missing_budget63 PASS [ 0.008s] horae-core importers::harvest::convert::tests::hours_common_values_are_exact64 PASS [ 0.007s] horae-core importers::harvest::keys::tests::client_key_equal_across_case_and_whitespace65 PASS [ 0.008s] horae-core client::tests::profile_accepts_supported_currencies_and_unicode_character_limit66 PASS [ 0.008s] horae-core budget::tests::configured_alert_rejects_invalid_inputs_and_widens_large_values67 PASS [ 0.007s] horae-core importers::harvest::convert::tests::round_half_up_at_the_boundary68 Running [ 00:00:00] =======> 188/191: 3 running, 188 passed, 0 skipped 69 [ 00:00:00] horae-core s::conversion_matches_exact_scaled_rationals70 [ 00:00:00] horae-core h_valid_grant_pair_and_its_revoked_selection71 [ 00:00:00] horae-core mpotent_order_independent_and_duplicate_free727374757677 PASS [ 0.008s] horae-core budget::tests::display_percentage_rounds_clamps_and_never_overflows78 PASS [ 0.008s] horae-core budget::tests::a_single_jump_announces_every_crossed_band79 PASS [ 0.008s] horae-core duration::tests::format_clamps_negative_to_zero80 PASS [ 0.008s] horae-core importers::harvest::convert::tests::garbage_is_rejected81 PASS [ 0.008s] horae-core duration::tests::parse_round_trips_each_minute_in_a_day82 PASS [ 0.009s] horae-core client::tests::optional_text_normalizes_only_blank_fields83 PASS [ 0.009s] horae-core importers::harvest::convert::tests::money_common_values_are_exact84 PASS [ 0.010s] horae-core importers::harvest::convert::tests::hours_round_trip_against_exporter_transform85 PASS [ 0.010s] horae-core importers::harvest::convert::tests::high_precision_fraction_straddles_the_half_minute_exactly86 PASS [ 0.010s] horae-core client::tests::profile_rejects_unsupported_currency_and_null_billing_fields87 PASS [ 0.011s] horae-core importers::harvest::convert::tests::conversion_reports_precision_and_numerator_limits88 PASS [ 0.012s] horae-core importers::harvest::convert::tests::conversion_rejects_unrepresentable_scaled_values_without_panicking89 PASS [ 0.012s] horae-core budget::tests::each_crossing_is_announced_once90 PASS [ 0.012s] horae-core budget::tests::large_values_do_not_overflow91 PASS [ 0.013s] horae-core client::tests::default_rate_rejects_negative_fractional_cent_overflow_and_invalid_text92 PASS [ 0.016s] horae-core importers::harvest::convert::tests::negative_is_rejected93 PASS [ 0.016s] horae-core importers::harvest::keys::tests::composite_components_do_not_collide94 PASS [ 0.016s] horae-core importers::harvest::convert::tests::money_rounds_third_decimal_half_up95 PASS [ 0.016s] horae-core importers::harvest::convert::tests::leading_and_trailing_forms_parse96 PASS [ 0.007s] horae-core importers::harvest::types::account_switch_tests::account_switch_requires_binding_and_no_imports_or_active_work97 PASS [ 0.016s] horae-core duration::tests::parse_rejects_excessive_decimal_precision_and_numerator98 PASS [ 0.007s] horae-core importers::harvest::keys::tests::task_key_shared_across_projects99 PASS [ 0.007s] horae-core invoice::tests::discount_allocation_supports_maximum_representable_subtotal100 PASS [ 0.007s] horae-core importers::harvest::keys::tests::normalize_matches_sql_harvest_norm_contract101 PASS [ 0.007s] horae-core invoice::tests::line_amount_exact_hour102 PASS [ 0.007s] horae-core invoice::tests::selected_rate_keeps_zero_and_explicit_missing_project_rate103 Running [ 00:00:00] =======> 188/191: 3 running, 188 passed, 0 skipped 104 [ 00:00:00] horae-core s::conversion_matches_exact_scaled_rationals105 [ 00:00:00] horae-core h_valid_grant_pair_and_its_revoked_selection106 [ 00:00:00] horae-core mpotent_order_independent_and_duplicate_free107108109110111112 PASS [ 0.007s] horae-core importers::harvest::keys::tests::occurrence_counter_numbers_repeats_from_zero113 PASS [ 0.007s] horae-core invoice::tests::discount_allocation_rejects_negative_lines_and_subtotal_overflow114 PASS [ 0.007s] horae-core importers::harvest::keys::tests::occurrence_counter_keys_are_independent115 PASS [ 0.007s] horae-core importers::harvest::keys::tests::normalize_trims_and_case_folds116 PASS [ 0.007s] horae-core importers::harvest::types::tests::archived_errors_and_new_inline_errors_reconcile_across_batches117 PASS [ 0.016s] horae-core budget::tests::allocated_totals_exclude_blank_but_include_zero_allowances118 PASS [ 0.011s] horae-core importers::harvest::keys::tests::project_key_prefers_code_when_present119 PASS [ 0.009s] horae-core money::tests::addition_rejects_overflow_in_both_directions120 PASS [ 0.010s] horae-core invoice::tests::invoice_adjustments_reject_negative_subtotal_and_overflow121 PASS [ 0.009s] horae-core invoice::tests::selected_rate_mode_ignores_unselected_rate_sources122 PASS [ 0.010s] horae-core invoice::tests::line_amount_zero_minutes123 PASS [ 0.008s] horae-core money::tests::format_cents_groups_thousands_and_keeps_sign124 PASS [ 0.010s] horae-core invoice::tests::line_amount_accepts_large_representable_amounts125 PASS [ 0.010s] horae-core invoice::tests::invoice_adjustments_apply_discount_before_non_compounding_taxes126 PASS [ 0.011s] horae-core importers::harvest::types::tests::does_not_reconcile_when_an_errored_count_has_no_reported_error127 PASS [ 0.010s] horae-core invoice::tests::line_amount_half_hour128 PASS [ 0.007s] horae-core importers::harvest::keys::tests::project_key_falls_back_to_client_and_name129 PASS [ 0.010s] horae-core invoice::tests::discount_allocation_uses_largest_remainder_then_stable_source_order130 PASS [ 0.010s] horae-core invoice::tests::line_amount_rounds_half_cents_up_not_to_even131 PASS [ 0.010s] horae-core invoice::tests::line_amount_90_minutes132 PASS [ 0.011s] horae-core importers::harvest::types::tests::reconciles_when_errored_counts_match_collected_errors133 PASS [ 0.010s] horae-core invoice::tests::line_amount_zero_rate134 PASS [ 0.010s] horae-core invoice::tests::line_amount_rejects_unrepresentable_results135 PASS [ 0.011s] horae-core importers::harvest::keys::tests::time_entry_key_distinguishes_and_matches136 PASS [ 0.011s] horae-core invoice::tests::line_amount_odd_minutes137 PASS [ 0.011s] horae-core invoice::tests::resolve_rate_cascade138 Running [ 00:00:00] =======> 188/191: 3 running, 188 passed, 0 skipped 139 [ 00:00:00] horae-core s::conversion_matches_exact_scaled_rationals140 [ 00:00:00] horae-core h_valid_grant_pair_and_its_revoked_selection141 [ 00:00:00] horae-core mpotent_order_independent_and_duplicate_free142143144145146147 PASS [ 0.012s] horae-core invoice::tests::discount_allocation_handles_empty_zero_and_full_discounts148 PASS [ 0.012s] horae-core invoice::tests::discounted_fee_contribution_leaves_discount_available149 PASS [ 0.013s] horae-core importers::harvest::types::tests::import_modes_display_their_wire_names150 PASS [ 0.013s] horae-core invoice::tests::discount_allocation_conserves_header_amount_and_bounds_each_line151 PASS [ 0.013s] horae-core invoice::tests::invoice_adjustments_round_components_half_up152 PASS [ 0.011s] horae-core money::tests::addition_retains_currency_checks_and_representable_boundaries153 PASS [ 0.005s] horae-core money::tests::parse_cents_rejects_what_it_cannot_represent154 PASS [ 0.005s] horae-core money::tests::parse_cents_reads_whole_and_fractional_amounts155 PASS [ 0.011s] horae-core money::tests::parse_cents_is_exact_where_a_float_would_drift156 PASS [ 0.004s] horae-core permissions::catalog::tests::empty_selection_includes_member_floor157 PASS [ 0.005s] horae-core permissions::approvals::tests::all_records_need_approval_scope_even_when_both_domains_are_readable158 PASS [ 0.005s] horae-core permissions::approvals::tests::empty_record_sets_do_not_remove_identity_or_explicit_grant_checks159 PASS [ 0.005s] horae-core permissions::catalog::stored_tests::restores_custom_selection_without_reapplying_profile_defaults160 PASS [ 0.005s] horae-core permissions::approvals::tests::inactive_and_foreign_provenance_deny_even_with_all_grants161 PASS [ 0.005s] horae-core permissions::catalog::tests::approve_all_includes_read_scopes_but_not_write_or_expense_management162 PASS [ 0.006s] horae-core money::tests::parse_cents_tolerates_grouping_spaces_and_signs163 PASS [ 0.006s] horae-core permissions::catalog::stored_tests::rejects_every_missing_prerequisite_without_repairing_input164 PASS [ 0.006s] horae-core permissions::approvals::tests::removing_the_last_matching_relationship_revokes_both_domains165 PASS [ 0.006s] horae-core permissions::catalog::stored_tests::rejects_each_missing_floor_grant166 PASS [ 0.006s] horae-core permissions::approvals::tests::catalog_grants_cannot_substitute_for_approval167 PASS [ 0.006s] horae-core permissions::approvals::tests::expense_read_scope_and_approval_scope_form_an_intersection168 PASS [ 0.006s] horae-core permissions::catalog::tests::dependency_graph_matches_the_reference_edges_without_extra_cross_resource_grants169 PASS [ 0.006s] horae-core permissions::catalog::tests::catalog_has_fifty_distinct_known_grants170 PASS [ 0.007s] horae-core permissions::catalog::stored_tests::rejects_duplicate_grants_instead_of_silently_deduplicating171 Running [ 00:00:00] =======> 188/191: 3 running, 188 passed, 0 skipped 172 [ 00:00:00] horae-core s::conversion_matches_exact_scaled_rationals173 [ 00:00:00] horae-core h_valid_grant_pair_and_its_revoked_selection174 [ 00:00:00] horae-core mpotent_order_independent_and_duplicate_free175176177178179180 PASS [ 0.007s] horae-core permissions::approvals::tests::no_expense_read_is_needed_when_there_are_no_expenses181 PASS [ 0.015s] horae-core money::tests::format_cents_plain_keeps_sign_below_one_unit182 PASS [ 0.009s] horae-core permissions::approvals::tests::reevaluation_does_not_reuse_prior_read_or_approval_success183 PASS [ 0.010s] horae-core permissions::catalog::tests::administrator_selection_covers_known_catalog_without_unknown_ids184 PASS [ 0.010s] horae-core permissions::catalog::tests::every_profile_includes_floor_and_is_closed_under_dependencies185 PASS [ 0.010s] horae-core permissions::catalog::tests::finance_profiles_cannot_edit_rates_and_project_manager_has_no_financial_grants186 PASS [ 0.010s] horae-core permissions::catalog::tests::member_has_only_own_time_and_expense_access187 PASS [ 0.010s] horae-core permissions::catalog::stored_tests::stored_order_does_not_change_the_selected_set188 PASS [ 0.010s] horae-core permissions::catalog::stored_tests::restores_each_builtin_selection_without_changing_grants189 PASS [ 0.010s] horae-core permissions::approvals::tests::only_expense_reads_or_their_write_prerequisites_make_others_expenses_visible190 PASS [ 0.010s] horae-core permissions::approvals::tests::one_unreadable_expense_denies_the_whole_supplied_set191 PASS [ 0.005s] horae-core permissions::person_management::tests::each_catalog_grant_has_the_specified_compatibility_without_changing_grants192 PASS [ 0.010s] horae-core permissions::catalog::stored_tests::rejects_unsupported_versions_even_for_valid_grants193 PASS [ 0.005s] horae-core permissions::person_management::tests::self_link_rejects_the_proposal_in_every_position_without_filtering_it194 PASS [ 0.011s] horae-core permissions::catalog::stored_tests::rejects_empty_saved_selection_instead_of_adding_member_floor195 PASS [ 0.010s] horae-core permissions::catalog::tests::known_permission_name_decodes_without_legacy_role_conversion196 PASS [ 0.011s] horae-core permissions::approvals::tests::missing_dimensions_and_input_duplicates_do_not_infer_scope197 PASS [ 0.011s] horae-core permissions::catalog::tests::removing_absent_permission_is_an_idempotent_no_op198 PASS [ 0.011s] horae-core permissions::catalog::tests::adding_all_catalog_grants_produces_exactly_the_catalog199 PASS [ 0.011s] horae-core permissions::catalog::tests::profiles_reject_legacy_rank_names_and_unknown_values200 PASS [ 0.009s] horae-core permissions::catalog::tests::report_and_withdrawal_grants_do_not_add_unrelated_authority201 PASS [ 0.011s] horae-core permissions::catalog::tests::direct_profile_defaults_match_the_known_reference_catalog202 PASS [ 0.012s] horae-core permissions::catalog::tests::floor_cannot_be_removed_or_partially_modified203 Running [ 00:00:00] =======> 188/191: 3 running, 188 passed, 0 skipped 204 [ 00:00:00] horae-core s::conversion_matches_exact_scaled_rationals205 [ 00:00:00] horae-core h_valid_grant_pair_and_its_revoked_selection206 [ 00:00:00] horae-core mpotent_order_independent_and_duplicate_free207208209210211212 PASS [ 0.010s] horae-core permissions::catalog::tests::template_names_trim_without_changing_display_or_internal_spaces213 PASS [ 0.011s] horae-core permissions::catalog::tests::removing_managed_time_read_also_removes_all_reads_writes_and_approvals214 PASS [ 0.010s] horae-core permissions::catalog::tests::unknown_permission_names_are_rejected215 PASS [ 0.010s] horae-core permissions::catalog::tests::template_names_reject_empty_and_overlong_unicode_names216 PASS [ 0.008s] horae-core permissions::person_management::tests::combined_unrelated_grants_do_not_create_person_management_eligibility217 PASS [ 0.011s] horae-core permissions::catalog::tests::removing_one_financial_permission_preserves_unrelated_families218 PASS [ 0.013s] horae-core permissions::catalog::tests::every_declared_dependency_is_added_and_removing_it_removes_the_dependent219 PASS [ 0.010s] horae-core permissions::person_management::tests::own_tracking_floor_does_not_qualify220 PASS [ 0.010s] horae-core permissions::person_management::tests::eligibility_tracks_last_compatible_grant_loss_and_restoration221 PASS [ 0.010s] horae-core permissions::person_management::tests::other_people_and_empty_removal_need_neither_grants_nor_a_separate_actor222 PASS [ 0.005s] horae-core project::tests::basics_reject_overlong_code_and_unsupported_currency223 PASS [ 0.005s] horae-core project::tests::basics_reject_blank_and_overlong_names224 PASS [ 0.005s] horae-core project::tests::monetary_budgets_are_only_available_for_time_and_materials225 PASS [ 0.005s] horae-core project::tests::monthly_fee_dates_follow_calendar_months226 PASS [ 0.015s] horae-core permissions::catalog::tests::removing_invoice_draft_write_keeps_read_but_removes_managed_and_all_write227 PASS [ 0.005s] horae-core project::tests::monthly_fee_dates_reject_invalid_calendar_inputs228 PASS [ 0.005s] horae-core rounding::tests::nearest_ties_round_up229 PASS [ 0.012s] horae-core permissions::rates::tests::explicit_rate_edits_require_write_even_for_zero_or_an_equal_value230 PASS [ 0.009s] horae-core permissions::tests::scope_union_obeys_set_laws231 PASS [ 0.012s] horae-core permissions::rates::tests::unrelated_catalog_grants_never_authorize_ordinary_financial_fields232 PASS [ 0.008s] horae-core rounding::tests::effective_minutes_respect_frozen_history_including_zero233 PASS [ 0.008s] horae-core project::tests::percentage_preserves_exact_hundredths234 PASS [ 0.009s] horae-core permissions::tests::assignments_do_not_grant_scope_and_missing_assignments_do_not_match235 PASS [ 0.009s] horae-core permissions::tests::removing_an_assignment_removes_only_that_matching_dimension236 Running [ 00:00:00] =======> 188/191: 3 running, 188 passed, 0 skipped 237 [ 00:00:00] horae-core s::conversion_matches_exact_scaled_rationals238 [ 00:00:00] horae-core h_valid_grant_pair_and_its_revoked_selection239 [ 00:00:00] horae-core mpotent_order_independent_and_duplicate_free240241242243244245 PASS [ 0.008s] horae-core project::tests::percentage_rejects_invalid_precision_range_and_syntax246 PASS [ 0.012s] horae-core permissions::rates::tests::grant_removal_denies_without_mutating_the_remaining_selection247 PASS [ 0.009s] horae-core permissions::tests::every_scope_combination_matches_only_explicitly_granted_dimensions248 PASS [ 0.007s] horae-core state::tests::managers_invoice_open_and_approved_time249 PASS [ 0.007s] horae-core state::tests::invoiced_is_final250 PASS [ 0.009s] horae-core permissions::tests::inactive_or_foreign_context_is_denied_for_every_scope_combination251 PASS [ 0.009s] horae-core project::tests::basics_accept_same_day_but_reject_reversed_dates252 PASS [ 0.007s] horae-core state::tests::only_manager_can_approve253 PASS [ 0.009s] horae-core project::tests::fee_schedules_reject_missing_overlong_and_excessive_milestones254 PASS [ 0.007s] horae-core rounding::tests::up_and_down255 PASS [ 0.008s] horae-core project::tests::payment_terms_support_receipt_and_checked_days256 PASS [ 0.012s] horae-core permissions::rates::tests::billable_owner_never_uses_the_other_management_dimension257 PASS [ 0.012s] horae-core permissions::rates::tests::read_only_cost_grant_cannot_authorize_an_explicit_rate_edit258 PASS [ 0.007s] horae-core state::tests::member_submit_and_reopen259 PASS [ 0.012s] horae-core permissions::rates::tests::unchanged_rate_edit_requires_no_financial_write_grant260 PASS [ 0.013s] horae-core permissions::rates::tests::billable_actions_use_only_their_own_grant_and_owner_scope261 PASS [ 0.013s] horae-core permissions::rates::tests::cost_and_billable_grants_are_independent_and_read_does_not_allow_write262 PASS [ 0.007s] horae-core time_of_day::tests::clamp_to_day_prevents_crossing_midnight263 PASS [ 0.013s] horae-core permissions::rates::tests::identity_and_tenant_mismatches_deny_even_all_financial_grants264 PASS [ 0.009s] horae-core rounding::tests::result_is_multiple_of_inc265 PASS [ 0.020s] horae-core permissions::catalog::tests::removing_any_non_floor_grant_keeps_the_remaining_selection_closed266 PASS [ 0.011s] horae-core project::tests::basics_accept_supported_currencies_and_optional_dates267 PASS [ 0.018s] horae-core permissions::person_management::tests::any_compatible_grant_suffices_in_every_pair268 PASS [ 0.012s] horae-core project::tests::fee_schedules_validate_amounts_and_milestone_total269 PASS [ 0.014s] horae-core permissions::rates::tests::removing_read_prerequisites_denies_both_actions270 PASS [ 0.015s] horae-core permissions::rates::tests::all_six_defaults_have_the_approved_financial_access271 Running [ 00:00:00] =======> 188/191: 3 running, 188 passed, 0 skipped 272 [ 00:00:00] horae-core s::conversion_matches_exact_scaled_rationals273 [ 00:00:00] horae-core h_valid_grant_pair_and_its_revoked_selection274 [ 00:00:00] horae-core mpotent_order_independent_and_duplicate_free275276277278279280 PASS [ 0.014s] horae-core permissions::tests::assignment_matching_searches_all_members_and_is_insensitive_to_duplicates281 PASS [ 0.012s] horae-core rounding::tests::identity_when_inc_zero282 PASS [ 0.004s] horae-core time_of_day::tests::snap_rounds_to_nearest_step283 PASS [ 0.004s] horae-core week::tests::configured_week_can_start_in_the_previous_year284 PASS [ 0.004s] horae-core time_of_day::tests::format_round_trips285 PASS [ 0.004s] horae-core time_of_day::tests::parse_reads_12h_including_edges286 PASS [ 0.004s] horae-core time_of_day::tests::parse_reads_24h287 PASS [ 0.004s] horae-core week::tests::maps_any_weekday_to_its_monday288 PASS [ 0.005s] horae-core time_of_day::tests::parse_rejects_out_of_range_and_garbage289 PASS [ 0.005s] horae-core week::tests::configured_week_reports_an_unrepresentable_start290 PASS [ 0.005s] horae-core week::tests::configured_week_contains_each_day_for_all_seven_start_days291 PASS [ 0.006s] horae-core time_of_day::tests::format_12h_matches_harvest_style292 PASS [ 0.006s] horae-core types::tests::budget_kind_wire_strings_match_db_enum293 Running [ 00:00:00] =======> 188/191: 3 running, 188 passed, 0 skipped 294 [ 00:00:00] horae-core s::conversion_matches_exact_scaled_rationals295 [ 00:00:00] horae-core h_valid_grant_pair_and_its_revoked_selection296 [ 00:00:00] horae-core mpotent_order_independent_and_duplicate_free297298299300301302 PASS [ 0.053s] horae-core importers::harvest::convert::tests::conversion_matches_exact_scaled_rationals303 PASS [ 0.039s] horae-core permissions::catalog::tests::normalization_is_idempotent_order_independent_and_duplicate_free304 PASS [ 0.044s] horae-core permissions::catalog::stored_tests::restores_each_valid_grant_pair_and_its_revoked_selection305------------306 Summary [ 0.066s] 191 tests run: 191 passed, 0 skipped307 Running [ 00:00:00] ======== 191/191: 3 running, 188 passed, 0 skipped 308 [ 00:00:00] horae-core s::conversion_matches_exact_scaled_rationals309 [ 00:00:00] horae-core h_valid_grant_pair_and_its_revoked_selection310 [ 00:00:00] horae-core mpotent_order_independent_and_duplicate_free311312313314315316The files belonging to this database system will be owned by user "nixbld".317This user must also own the server process.318319The database cluster will be initialized with locale "C".320The default text search configuration will be set to "english".321322Data page checksums are disabled.323324fixing permissions on existing directory /build/tmp.y2kbvF6D0k ... ok325creating subdirectories ... ok326selecting dynamic shared memory implementation ... posix327selecting default "max_connections" ... 100328selecting default "shared_buffers" ... 128MB329selecting default time zone ... UTC330creating configuration files ... ok331running bootstrap script ... ok332performing post-bootstrap initialization ... ok333syncing data to disk ... ok334335initdb: warning: enabling "trust" authentication for local connections336initdb: hint: You can change this by editing pg_hba.conf or using the option -A, or --auth-local and --auth-host, the next time you run initdb.337338Success. You can now start the database server using:339340 pg_ctl -D /build/tmp.y2kbvF6D0k -l logfile start341342waiting for server to start.... done343server started344+++ command cargo test -p horae --features server -- --test-threads 8345 Compiling horae v0.1.0 (/build/source/crates/horae)346 Compiling horae-core v0.1.0 (/build/source/crates/core)347 Finished `test` profile [unoptimized + debuginfo] target(s) in 6m 30s348 Running unittests src/main.rs (target/debug/deps/horae-0767924faa118e50)349350running 1504 tests351test auth::oidc::tests::deactivated_email_match_is_denied ... ok352test auth::oidc::tests::deactivated_subject_match_is_denied ... ok353test auth::oidc::tests::first_login_links_subject_via_verified_email ... ok354test auth::oidc::tests::extra_audiences_are_trusted_only_when_listed ... ok355test auth::oidc::tests::subject_match_takes_precedence_over_email ... ok356test auth::oidc::tests::unverified_email_is_not_matched ... ok357test auth::page::tests::configured_label_is_html_escaped ... ok358test auth::oidc::tests::no_account_is_denied_not_provisioned ... ok359test auth::oidc::tests::subject_match_logs_in_without_relinking ... ok360test auth::page::tests::oidc_variant_uses_the_configured_label_and_hands_off_to_start ... ok361test auth::page::tests::dev_variant_offers_the_admin_bypass_and_no_fake_controls ... ok362test cli::imports::tests::api_submission_captures_generation_without_retrying_uncertain_acceptance ... ok363test cli::imports::tests::cancellation_racing_completion_does_not_claim_cancellation_was_requested ... ok364test cli::imports::tests::csv_connection_closed_without_response_remains_indeterminate ... ok365test cli::imports::tests::archived_errors_publish_without_clobbering_and_preserve_the_prior_file_on_failure ... ok366test cli::imports::tests::csv_named_pipe_is_rejected_without_waiting_for_a_writer ... ok367test cli::imports::tests::malformed_submission_acknowledgement_retains_its_request_identity ... ok368test cli::imports::tests::invalid_csv_files_fail_before_contacting_the_server ... ok369test cli::imports::tests::missing_session_is_a_structured_configuration_failure ... ok370test cli::imports::tests::missing_and_mismatched_jobs_fail_without_substitution ... ok371test cli::imports::tests::private_session_accepts_https_and_loopback_only ... ok372test cli::imports::tests::redirects_are_not_followed_or_exposed_as_server_error_text ... ok373test cli::imports::tests::report_marks_confirmed_failed_outcomes_as_incomplete ... ok374test cli::imports::tests::ordinary_json_is_bounded_and_invalid_replies_are_not_echoed ... ok375test cli::imports::tests::retry_snapshot_is_compatible_with_missing_and_future_values ... ok376test cli::imports::tests::session_rejects_cookie_header_injection_without_echoing_the_value ... ok377test cli::imports::tests::session_rejects_plaintext_remote_and_credential_bearing_urls ... ok378test cli::imports::tests::session_rejects_public_permissions_and_symlinks ... ok379test cli::imports::tests::csv_upload_preserves_bytes_across_stream_chunk_boundaries ... ok380test cli::imports::tests::status_and_wait_distinguish_failed_jobs_from_failed_reads ... ok381test auth::oidc::tests::linking::unverified_email_cannot_link_an_account ... ok382test auth::oidc::tests::linking::deactivation_during_first_link_denies_login ... ok383test auth::oidc::tests::linking::different_subjects_cannot_both_claim_an_unlinked_account ... ok384test cli::tests::environment_probe ... ok385test cli::tests::remote_commands_reject_conflicting_or_unbounded_options ... ok386test cli::tests::remote_import_and_job_commands_accept_the_documented_arguments ... ok387test components::permission_description::tests::permission_descriptions_cover_each_grant_distinctly ... ok388test components::sidebar::tests::clients_link_follows_client_read_and_fails_closed ... ok389test auth::oidc::tests::linking::simultaneous_logins_with_the_same_subject_are_allowed ... ok390test config::tests::dev_login_is_allowed_on_loopback ... ok391test config::tests::dev_login_is_refused_off_loopback ... ok392test config::tests::environment::environment_probe ... ok393test config::tests::environment::empty_environment_has_no_authentication_or_plugin_credentials ... ok394test config::tests::environment::example_environment_can_configure_all_required_oidc_and_harvest_fields ... ok395test cli::tests::default_command_rejects_invalid_environment_ports ... ok396test cli::tests::default_command_uses_the_same_defaults_and_environment_as_serve ... ok397test config::tests::environment::obsolete_authentication_variables_do_not_configure_the_server ... ok398test config::tests::environment::partial_oidc_configuration_remains_disabled_without_a_callback ... ok399test config::tests::environment::mail_environment_requires_a_complete_valid_configuration ... ok400test config::tests::without_dev_login_any_bind_is_fine ... ok401test auth::oidc::tests::linking::existing_subject_wins_over_another_accounts_email ... ok402test db::tests::pool_connections_force_custom_plans ... ok403test config::tests::environment::job_attempt_limit_uses_the_documented_environment_variable ... ok404test config::tests::environment::invalid_job_attempt_limits_reject_startup ... ok405test config::tests::environment::secure_cookies_use_the_documented_prefixed_variable ... ok406test cli::imports::tests::wait_deadline_caps_a_pending_request_without_cancelling_the_job ... ok407test cli::imports::tests::small_csv_upload_preserves_immediate_authorization_rejections ... ok408test cli::imports::tests::small_csv_upload_preserves_immediate_authorization_rejections_across_threads ... ok409test harvest::pagination_tests::client_permissions::client_api_allows_read_only_grants_without_legacy_management ... ok410test db::tests::reset_empties_the_database_and_reapplies_migrations ... ok411test harvest::pagination_tests::harvest_pagination_catalog_links_preserve_filters_and_break_name_ties ... ok412test harvest::pagination_tests::client_permissions::client_api_observes_revocation_after_waiting_for_current_authority ... ok413test harvest::pagination_tests::harvest_pagination_empty_and_out_of_range_pages_keep_the_contract ... ok414test harvest::pagination_tests::client_permissions::client_api_preserves_filters_counts_and_foreign_id_denial ... ok415test harvest::pagination_tests::harvest_own_time_omits_private_project_budget_metadata ... ok416test harvest::pagination_tests::harvest_pagination_total_pages_does_not_overflow ... ok417test harvest::pagination_tests::client_permissions::client_api_rechecks_activity_after_session_authentication ... ok418test harvest::pagination_tests::client_permissions::client_api_does_not_inherit_legacy_role_or_related_workflow_authority ... ok419test harvest::pagination_tests::harvest_project_progress_permissions_cover_counts_pages_and_details ... ok420test harvest::pagination_tests::harvest_task_access_filters_counts_and_preserves_rate_free_history ... ok421test harvest::pagination_tests::project_permissions::canonical_project_api_excludes_foreign_projects_and_foreign_client_parents ... ok422test harvest::pagination_tests::client_permissions::client_api_rejects_unavailable_policy_and_inactive_sessions ... ok423test harvest::pagination_tests::project_permissions::canonical_project_api_rechecks_financial_only_revocation ... ok424test harvest::pagination_tests::harvest_pagination_router_preserves_session_and_tenant_guards ... ok425test harvest::pagination_tests::project_permissions::canonical_project_api_retains_filtered_total_past_last_page ... ok426test harvest::pagination_tests::harvest_pagination_malformed_filters_are_client_errors ... ok427test harvest::pagination_tests::harvest_pagination_time_entries_keep_the_filtered_set_and_date_ties ... ok428test harvest::pagination_tests::project_permissions::canonical_project_api_does_not_inherit_legacy_administrator_scope ... ok429test harvest::pagination_tests::project_permissions::canonical_project_api_shared_member_keeps_hours_but_not_money ... ok430test harvest::pagination_tests::harvest_pagination_rejects_invalid_windows_on_every_collection ... ok431test harvest::pagination_tests::task_permissions::task_api_does_not_inherit_legacy_admin_or_tracking_identity ... ok432test harvest::pagination_tests::harvest_project_cost_overrides_require_admin_without_fabricated_fallback ... ok433test harvest::pagination_tests::project_permissions::canonical_project_api_rejects_malformed_state_even_without_visible_rows ... ok434test harvest::pagination_tests::task_permissions::task_api_rechecks_global_rate_access_independently_of_catalog ... ok435test harvest::pagination_tests::project_permissions::concurrency::project_api_refreshes_scope_and_money_after_authority_wait ... ok436test harvest::pagination_tests::project_permissions::canonical_project_api_managed_scope_requires_current_designation ... ok437test harvest::pagination_tests::task_permissions::task_api_filters_archived_tasks_and_preserves_total_past_last_page ... ok438test harvest::tests::a_manager_lists_users_with_their_rates ... ok439test harvest::pagination_tests::task_permissions::task_api_rechecks_catalog_and_financial_grants_after_authority_wait ... ok440test harvest::tests::a_manager_sees_the_whole_org ... ok441test harvest::pagination_tests::task_permissions::task_api_uses_canonical_catalog_scope_for_count_list_and_direct_id ... ok442test harvest::tests::a_member_cannot_filter_to_a_colleague ... ok443test harvest::tests::a_member_cannot_fetch_a_colleagues_entry ... ok444test harvest::tests::a_member_cannot_list_users ... ok445test harvest::pagination_tests::task_permissions::task_api_rejects_malformed_canonical_state_without_legacy_fallback ... ok446test harvest::tests::a_member_sees_only_their_own_time_entries ... ok447test harvest::pagination_tests::task_permissions::task_api_rejects_unknown_policy_before_empty_or_direct_results ... ok448test harvest::tests::harvest_marks_unbilled_non_billable_contexts_consistently ... ok449test harvest::tests::harvest_effective_minutes_match_sql_for_open_and_frozen_time ... ok450test harvest::tests::page_window_defaults_and_checked_offsets ... ok451test harvest::tests::harvest_entry_rates_follow_the_cascade_and_frozen_invoice_line ... ok452test harvest::tests::harvest_entry_rates_respect_selected_project_mode ... ok453test harvest::tests::members_cannot_read_own_project_rates_or_cost_overrides ... ok454test harvest::pagination_tests::project_permissions::canonical_project_reader_uses_list_count_and_detail_without_legacy_role ... ok455test importers::harvest::account_switch::tests::change_preserves_terminal_history_and_rejects_stale_confirmation ... ok456test importers::harvest::account_switch::tests::a_b_a_keeps_old_callbacks_requests_and_retries_fenced ... ok457test importers::harvest::account_switch::tests::disconnect_and_reconnect_fence_callbacks_but_not_same_account_work ... ok458test harvest::pagination_tests::project_permissions::concurrency::project_api_rejects_actor_deactivated_after_session_lookup ... ok459test importers::harvest::account_switch::tests::queued_work_and_provenance_block_without_changing_binding ... ok460test importers::harvest::account_switch::tests::competing_callbacks_and_confirmations_have_one_winner ... ok461test importers::harvest::api_source::http::tests::cancelled_backoff_does_not_wait_or_retry ... ok462test importers::harvest::api_source::http::tests::cursor_links_are_authoritative_even_with_null_or_stale_page_numbers ... ok463test importers::harvest::account_switch::tests::queue_acceptance_does_not_wait_for_the_import_session_lock ... ok464test importers::harvest::api_source::http::tests::http_pages_follow_cursor_and_preserve_headers_and_encoded_filter ... ok465test importers::harvest::api_source::http::tests::http_retries_429_but_never_follows_redirects_or_shortens_long_backoff ... ok466test importers::harvest::api_source::http::tests::missing_next_cursor_is_not_silently_treated_as_completed ... ok467test importers::harvest::api_source::http::tests::pagination_cycle_detection_survives_restarting_after_every_page ... ok468test importers::harvest::api_source::http::tests::persisted_cursor_resumes_with_a_new_client_and_stays_complete_at_eof ... ok469test importers::harvest::api_source::http::tests::rejected_page_does_not_advance_the_cursor ... ok470test importers::harvest::api_source::http::tests::rejects_pagination_outside_the_authenticated_endpoint ... ok471test importers::harvest::api_source::http::tests::resumed_cursor_rejects_untrusted_destinations_and_invalid_state_before_http ... ok472test importers::harvest::api_source::http::tests::http_rejects_oversized_malformed_and_cyclic_pages ... ok473test importers::harvest::api_source::tests::assembled_rows_convert_to_exact_minutes ... ok474test importers::harvest::api_source::tests::assembles_rows_joining_parents_by_id ... ok475test importers::harvest::api_source::tests::hours_render_as_exact_decimals ... ok476test importers::harvest::api_source::tests::http_page_preserves_decimal_values_before_integer_conversion ... ok477test importers::harvest::api_source::tests::json_exponents_expand_exactly_with_bounded_output ... ok478test importers::harvest::account_switch::tests::competing_change_and_submission_cannot_both_succeed ... ok479test importers::harvest::account_switch::tests::successful_change_preserves_business_rows_and_failure_rolls_back_secrets ... ok480test importers::harvest::account_switch::tests::running_jobs_block_change_and_old_execution_never_reaches_http ... ok481test importers::harvest::account_switch::tests::retry_and_change_are_serialized ... ok482test importers::harvest::api_source::http::tests::slow_consumer_backpressures_http_and_cancellation_stops_further_pages ... ok483test harvest::tests::imported_legacy_rates_survive_retry_in_harvest_list_and_detail ... ok484test harvest::pagination_tests::task_permissions::task_api_rechecks_deactivation_after_session_lookup ... ok485test importers::harvest::credentials::tests::another_account_cannot_replace_credentials_or_watermarks ... ok486test importers::harvest::credentials::tests::bad_key_length_is_rejected ... ok487test importers::harvest::credentials::authority_tests::connection_changes_recheck_authority_after_organization_wait ... ok488test importers::harvest::credentials::tests::concurrent_first_connections_cannot_bind_different_accounts ... ok489test importers::harvest::credentials::authority_tests::connection_changes_hold_authority_until_commit ... ok490test importers::harvest::credentials::authority_tests::disconnected_noop_still_requires_authority ... ok491test importers::harvest::credentials::tests::decode_hex_rejects_bad_input ... ok492test importers::harvest::credentials::tests::connect_and_disconnect_share_import_exclusion_without_blocking_other_orgs ... ok493test importers::harvest::credentials::tests::encrypt_then_decrypt_round_trips ... ok494test importers::harvest::credentials::tests::connection_changes_work_with_a_single_connection_pool ... ok495test importers::harvest::credentials::tests::disconnect_preserves_identity_and_provenance_for_the_original_account ... ok496test importers::harvest::credentials::tests::nonce_makes_ciphertext_nondeterministic ... ok497test importers::harvest::credentials::tests::migration_binds_existing_connections_without_changing_secrets_or_markers ... ok498test importers::harvest::credentials::tests::failed_credential_write_does_not_leave_an_account_binding ... ok499test importers::harvest::credentials::tests::wrong_key_fails_to_decrypt ... ok500test importers::harvest::csv_source::tests::bad_date_becomes_a_row_error_not_a_rejection ... ok501test importers::harvest::csv_source::tests::conflicting_email_aliases_error_only_the_affected_row ... ok502test importers::harvest::csv_source::tests::csv_records_preserve_multiline_unicode_across_single_byte_reads ... ok503test importers::harvest::csv_source::tests::cursor_beyond_upload_is_rejected_without_parsing_rows ... ok504test importers::harvest::csv_source::tests::cursor_resumes_after_multiline_unicode_and_preserves_error_locations ... ok505test importers::harvest::csv_source::tests::delivers_a_row_before_reading_the_rest_of_the_file ... ok506test importers::harvest::csv_source::tests::empty_file_is_rejected ... ok507test importers::harvest::csv_source::tests::identity_columns_are_required_and_cannot_repeat ... ok508test importers::harvest::csv_source::tests::invalid_utf8_errors_one_record_and_continues ... ok509test importers::harvest::csv_source::tests::missing_required_columns_is_rejected ... ok510test importers::harvest::csv_source::tests::names_stay_separate_from_optional_email ... ok511test importers::harvest::csv_source::tests::parse_bool_accepts_yes_variants ... ok512test importers::harvest::csv_source::tests::parses_rows_case_insensitively ... ok513test importers::harvest::credentials::authority_tests::denied_first_connection_creates_no_binding_credentials_or_generation ... ok514test importers::harvest::credentials::tests::same_account_reconnect_rotates_encryption_without_resetting_watermarks ... ok515test importers::harvest::credentials::tests::completed_credential_changes_allow_immediate_retries ... ok516test importers::harvest::engine_tests::api_and_csv_share_the_lock_but_other_organizations_can_import ... ok517test importers::harvest::engine_tests::api_connection_checks_work_with_a_single_connection_pool ... ok518test importers::harvest::engine_tests::api_sync_adopts_entries_from_a_prior_csv_import ... ok519test importers::harvest::credentials::tests::unidentified_legacy_provenance_requires_operator_review ... ok520test importers::harvest::engine_tests::cancellation_rolls_back_rows_and_releases_the_import_session ... ok521test importers::harvest::engine_tests::bad_records_are_reported_and_run_continues ... ok522test importers::harvest::credentials::authority_tests::connection_changes_recheck_authority_after_actor_only_wait ... ok523test importers::harvest::engine_tests::cancelled_http_waiter_keeps_the_lock_until_its_worker_exits ... ok524test importers::harvest::engine_tests::csv_ambiguous_names_include_inactive_users_but_unique_email_disambiguates ... ok525test importers::harvest::engine_tests::concurrent_imports_reject_overlap_without_collapsing_repeated_entries ... ok526test importers::harvest::engine_tests::csv_import_populates_and_is_idempotent ... ok527test importers::harvest::engine_tests::csv_malformed_file_is_rejected_with_no_writes ... ok528test importers::harvest::credentials::authority_tests::failed_connection_changes_roll_back_and_release_authority_and_reservation ... ok529test importers::harvest::engine_tests::csv_name_fallback_requires_a_full_unique_name_and_never_overrides_email ... ok530test importers::harvest::engine_tests::csv_name_only_dry_run_and_duplicate_occurrences_preserve_history ... ok531test importers::harvest::engine_tests::csv_name_only_matches_one_org_user_and_reimports_without_duplicates ... ok532test importers::harvest::engine_tests::csv_streaming::cancelling_a_csv_waiting_for_more_bytes_releases_its_session ... ok533test importers::harvest::engine_tests::csv_streaming::csv_applies_before_eof_but_transport_failure_rolls_back_everything ... ok534test importers::harvest::engine_tests::completed_imports_allow_immediate_retries ... ok535test importers::harvest::engine_tests::csv_streaming::csv_preview_errors_and_repeated_rows_match_commit_and_reimport ... ok536test importers::harvest::credentials::authority_tests::connection_changes_require_current_tenant_bound_administrator ... ok537test importers::harvest::engine_tests::csv_streaming::csv_sql_backpressure_stops_reading_later_input_rows ... ok538test importers::harvest::engine_tests::csv_streaming::durable_csv_preview_crosses_batch_boundaries_without_committing_domain_data ... ok539test importers::harvest::engine_tests::csv_streaming::durable_csv_cancel_joins_parser_and_preserves_committed_rows ... ok540test importers::harvest::engine_tests::csv_streaming::durable_csv_discards_incomplete_preparation_and_resumes_its_checkpoint ... ok541test importers::harvest::engine_tests::csv_streaming::durable_csv_cancel_preserves_its_completed_batches_for_manual_retry ... ok542test importers::harvest::engine_tests::csv_streaming::durable_csv_report_metadata_is_bounded_after_recovery ... ok543test importers::harvest::engine_tests::csv_streaming::durable_csv_preview_resumes_after_a_crash_without_recounting_rows ... ok544test importers::harvest::engine_tests::csv_streaming::durable_csv_preview_rejects_a_stale_next_batch ... ok545test importers::harvest::engine_tests::csv_streaming::measure_csv_durable_100k ... ignored, 100,000-row durable CSV measurement; run explicitly with --release --nocapture546test importers::harvest::engine_tests::csv_streaming::measure_csv_durable_large_catalog_100k ... ignored, 100,000-row durable CSV with 5,000 parent sets; run explicitly with --release --nocapture547test importers::harvest::engine_tests::csv_streaming::measure_csv_streaming_100k ... ignored, 100,000-row CSV measurement; run explicitly with --release --nocapture548test importers::harvest::engine_tests::csv_streaming::measure_csv_streaming_large_catalog_100k ... ignored, 100,000-row CSV with 5,000 parent sets; run explicitly with --release --nocapture549test importers::harvest::engine_tests::csv_streaming::durable_csv_preview_cancel_preserves_simulation_for_manual_retry ... ok550test importers::harvest::engine_tests::csv_streaming::durable_csv_stale_commit_is_fenced_without_a_heartbeat ... ok551test importers::harvest::engine_tests::distinct_harvest_ids_with_identical_fields_import_as_two ... ok552test importers::harvest::engine_tests::edited_entry_still_matched_by_provenance ... ok553test importers::harvest::engine_tests::dry_run_writes_nothing_and_matches_commit ... ok554test importers::harvest::engine_tests::csv_streaming::durable_csv_resumes_committed_batches_without_recounting_duplicate_rows ... ok555test importers::harvest::engine_tests::failed_source_releases_the_session_and_rolls_back_partial_rows ... ok556test importers::harvest::engine_tests::import_cleanup_does_not_hide_a_backend_failure ... ok557test importers::harvest::engine_tests::full_import_creates_all_levels_with_exact_minutes ... ok558test importers::harvest::engine_tests::csv_streaming::durable_csv_waits_for_input_without_an_open_transaction ... ok559test importers::harvest::engine_tests::import_cleanup_recovers_unacknowledged_savepoint_release ... ok560test importers::harvest::engine_tests::import_cleanup_rolls_back_an_untracked_server_transaction ... ok561test importers::harvest::engine_tests::csv_streaming::durable_csv_reclaimed_lease_cannot_commit_the_next_batch ... ok562test importers::harvest::engine_tests::lookup_cache::cold_query_callsite_on_untraced_thread_is_still_captured ... ok563test importers::harvest::engine_tests::import_rejects_ambiguous_normalized_email_without_partial_writes ... ok564test importers::harvest::engine_tests::imported_project_task_activity_preserves_archival_and_legacy_links ... ok565test importers::harvest::engine_tests::lookup_cache::cached_email_and_full_name_do_not_share_a_namespace ... ok566test importers::harvest::engine_tests::lookup_cache::cached_project_task_still_validates_each_rows_rate ... ok567test importers::harvest::engine_tests::lookup_cache::lookup_index_migration_preserves_existing_ambiguous_identities ... ok568test importers::harvest::engine_tests::lookup_cache::new_run_rechecks_previously_cached_user_for_ambiguity ... ok569test importers::harvest::engine_tests::lookup_cache::project_task_cache_distinguishes_both_sides_of_the_link ... ok570test importers::harvest::engine_tests::lookup_cache::rolled_back_row_does_not_cache_user_or_project_task ... ok571test importers::harvest::engine_tests::natural_key_reimport_normalizes_whitespace_and_ascii_case ... ok572test importers::harvest::engine_tests::overflowing_decimals_fail_only_their_rows ... ok573test importers::harvest::engine_tests::submission_barrier_blocks_imported_time_entries ... ok574test importers::harvest::engine_tests::reimporting_identical_csv_rows_is_idempotent ... ok575test importers::harvest::oauth::tests::authorize_url_carries_state_and_encoded_redirect ... ok576test importers::harvest::oauth::tests::authorize_url_preserves_query_values_without_injecting_parameters ... ok577test importers::harvest::oauth_callback_tests::account_policy_failures_return_safe_actionable_conflicts ... ok578test importers::harvest::oauth_callback_tests::mismatched_state_is_rejected_without_a_code ... ok579test importers::harvest::oauth_callback_tests::missing_returned_state_is_rejected ... ok580test importers::harvest::oauth_callback_tests::missing_stored_state_is_rejected ... ok581test importers::harvest::engine_tests::csv_streaming::csv_measurement_recovers_a_complete_batch_without_recounting ... ok582test importers::harvest::oauth_callback_tests::provider_error_is_rejected_before_exchange ... ok583test importers::harvest::oauth_callback_tests::revoked_callback_authority_returns_only_a_safe_forbidden_message ... ok584test importers::harvest::oauth_callback_tests::valid_state_but_missing_code_is_rejected ... ok585test importers::harvest::report::tests::archive_metadata_cannot_masquerade_as_a_legacy_or_inconsistent_report ... ok586test importers::harvest::oauth_callback_tests::valid_matching_state_yields_the_code ... ok587test importers::harvest::report::tests::archived_report_round_trips_without_losing_error_accounting ... ok588test importers::harvest::report::tests::legacy_report_preserves_its_counts_and_error_details ... ok589test importers::harvest::report::tests::report_rejects_unsupported_and_invalid_versions ... ok590test importers::harvest::resolve::checkpoint_tests::run_cache_round_trip_preserves_identity_namespaces_and_occurrences ... ok591test importers::harvest::report::tests::serialized_report_has_a_supported_schema_version ... ok592test importers::harvest::engine_tests::second_identical_run_creates_nothing ... ok593test importers::harvest::engine_tests::watermark_advances_only_on_commit ... ok594test importers::harvest::engine_tests::two_identical_csv_rows_import_as_two_entries ... ok595test importers::harvest::engine_tests::lookup_cache::repeated_rows_resolve_each_user_and_project_task_once ... ok596test importers::harvest::resolve::preview::tests::checkpoint_retains_link_activity_and_derives_missing_legacy_field ... ok597test importers::harvest::streaming::tests::api_planning_policy_ends_with_the_transaction ... ok598test importers::harvest::resolve::preview::tests::checkpoint_restores_known_task_currency_and_keeps_old_currency_unknown ... ok599test importers::harvest::streaming::durable::preview::tests::restoration_omits_unneeded_virtual_entries ... ok600test importers::harvest::resolve::preview::tests::rejects_foreign_parent_snapshots_before_restoring_any_rows ... ok601test importers::harvest::streaming::tests::import_batches_join_the_access_gate_before_resource_locks ... ok602test importers::harvest::sync_tests::api_requires_email_even_when_full_name_matches ... ok603test importers::harvest::sync_tests::api_rejects_ambiguous_email_without_advancing_watermark ... ok604test importers::harvest::sync_tests::checkpoints::durable_api_cancellation_preserves_confirmed_pages_for_manual_retry ... ok605test importers::harvest::sync_tests::checkpoints::durable_api_finalization_retry_does_not_repeat_completed_downloads ... ok606test importers::harvest::engine_tests::csv_streaming::durable_csv_preview_matches_existing_and_new_rows_with_one_connection ... ok607test importers::harvest::sync_tests::checkpoints::durable_api_preview_cancellation_preserves_confirmed_pages_for_manual_retry ... ok608test importers::harvest::engine_tests::large_run_reuses_parents_and_reconciles_totals ... ok609test importers::harvest::sync_tests::checkpoints::durable_api_preview_finalization_retry_does_not_repeat_completed_downloads ... ok610test importers::harvest::sync_tests::checkpoints::durable_api_preview_reclaimed_worker_cannot_checkpoint_its_next_page ... ok611test importers::harvest::sync_tests::checkpoints::durable_api_preview_resumes_catalog_download ... ok612test importers::harvest::sync_tests::checkpoints::durable_api_preview_resume_preserves_row_errors ... ok613test importers::harvest::sync_tests::checkpoints::durable_api_resume_keeps_earlier_errors_and_does_not_advance_watermark ... ok614test importers::harvest::sync_tests::checkpoints::durable_api_resume_remembers_an_earlier_missing_timestamp ... ok615test importers::harvest::sync_tests::checkpoints::durable_api_resumes_a_partially_downloaded_catalog ... ok616test importers::harvest::sync_tests::checkpoints::durable_api_preview_preserves_adoptions_and_repeated_ids_across_recovery ... ok617test importers::harvest::sync_tests::checkpoints::durable_api_preview_resumes_after_a_confirmed_parent_batch ... ok618test importers::harvest::sync_tests::checkpoints::durable_api_resumes_committed_pages_and_preserves_the_high_watermark ... ok619test importers::harvest::sync_tests::checkpoints::failed_api_preview_publishes_its_last_confirmed_page_report ... ok620test importers::harvest::sync_tests::checkpoints::durable_api_preview_resumes_pages_without_publishing_domain_data ... ok621test importers::harvest::sync_tests::disconnect_and_reconnect_preserves_imported_records_and_exact_identity ... ok622test importers::harvest::sync_tests::checkpoints::failed_api_commit_publishes_its_last_confirmed_page_report ... ok623test importers::harvest::sync_tests::checkpoints::durable_api_reclaimed_worker_cannot_commit_its_next_page ... ok624test importers::harvest::sync_tests::dry_run_leaves_data_provenance_and_watermark_unchanged ... ok625test importers::harvest::sync_tests::checkpoints::durable_api_resumes_after_a_confirmed_parent_batch ... ok626test importers::harvest::sync_tests::missing_source_timestamp_keeps_the_previous_watermark ... ok627test importers::harvest::sync_tests::invalid_parent_blocks_dependent_time_but_other_catalog_records_survive ... ok628test importers::harvest::sync_tests::empty_sync_does_not_invent_a_watermark ... ok629test importers::harvest::sync_tests::failed_rows_are_available_to_the_next_incremental_retry ... ok630test importers::harvest::sync_tests::failed_client_propagates_to_project_and_entry_without_placeholder_records ... ok631test importers::harvest::sync_tests::missing_client_fallback_and_failed_project_savepoints_do_not_poison_cache ... ok632test importers::harvest::sync_tests::exact_api_decimals_survive_preview_commit_and_reimport ... ok633test importers::harvest::sync_tests::paging::durable_api_stale_commit_cannot_advance_data_or_watermark ... ok634test importers::harvest::sync_tests::paging::cancelled_page_consumer_retains_lock_until_worker_exits_and_rolls_back ... ok635test importers::harvest::sync_tests::parent_only_api_import_creates_catalog_and_reimport_skips_it ... ok636test importers::harvest::sync_tests::scale::api_100k_commit_and_reimport ... ignored, 100,000-entry scale measurement; run explicitly with --release --nocapture637test importers::harvest::sync_tests::scale::api_100k_dry_run ... ignored, 100,000-entry scale measurement; run explicitly with --release --nocapture638test importers::harvest::sync_tests::scale::api_durable_100k_commit_and_reimport ... ignored, 100,000-entry durable API measurement; run explicitly with --release --nocapture639test importers::harvest::sync_tests::scale::api_durable_100k_dry_run ... ignored, 100,000-entry durable API measurement; run explicitly with --release --nocapture640test importers::harvest::sync_tests::parent_catalog_preserves_metadata_and_counts_each_entity_once ... ok641test importers::harvest::sync_tests::paging::later_download_failure_rolls_back_parents_rows_and_watermark ... ok642test importers::harvest::sync_tests::out_of_range_api_decimals_error_per_row_and_leave_retry_watermark ... ok643test importers::harvest::sync_tests::parent_only_dry_run_previews_without_persisting_catalog ... ok644test importers::harvest::sync_tests::refreshed_tokens_survive_a_dry_run_rollback_in_the_same_import_session ... ok645test importers::harvest::sync_tests::watermark_never_passes_the_start_of_capture ... ok646test importers::harvest::sync_tests::successful_sync_only_marks_the_incrementally_fetched_entity ... ok647test importers::harvest::sync_tests::paging::durable_api_cancel_waits_for_the_producer_before_acknowledging ... ok648test init::tests::init_creates_one_org_and_one_admin_and_nothing_else ... ok649test importers::harvest::sync_tests::watermark_write_failure_rolls_back_imported_data ... ok650test init::tests::init_refuses_when_an_organization_exists ... ok651test jobs::outbox::tests::acknowledges_confirmed_delivery_without_reclaiming_it ... ok652test importers::harvest::sync_tests::paging::invalid_and_missing_timestamp_rows_cross_page_boundaries_without_advancing ... ok653test jobs::outbox::tests::invalid_payload_is_not_delivered_and_does_not_leak_into_errors ... ok654test jobs::outbox::tests::worker_delivers_available_events_and_stops_cleanly ... ok655test importers::harvest::sync_tests::scale::durable_measurement_finishes_from_its_eof_checkpoint ... ok656test jobs::outbox::tests::plugin_failure_retries_with_the_same_event_identity ... ok657test importers::harvest::sync_tests::scale::http_pages_preview_commit_and_reimport ... ok658test jobs::report::stream_tests::download_preparation_is_tenant_bound_and_releases_failed_transactions ... ok659test jobs::report::stream_tests::download_boundaries_recheck_after_organization_and_actor_waits ... ok660test jobs::report::stream_tests::download_keeps_its_snapshot_when_later_progress_archives_the_inline_tail ... ok661test jobs::report::stream_tests::download_preparation_denies_revoked_authority ... ok662test jobs::report::stream_tests::download_rechecks_after_buffered_pages_and_before_the_captured_tail ... ok663test importers::harvest::sync_tests::scale::durable_api_report_preserves_overflow_errors_after_recovery ... ok664test jobs::report::stream_tests::download_denies_revocation_before_first_page_and_inline_tail ... ok665test jobs::report::tests::concurrent_legacy_converters_archive_each_error_once ... ok666test jobs::report::stream_tests::download_reports_missing_fragments_after_its_buffered_page ... ok667test jobs::report::tests::legacy_converter_gate_allows_a_job_locked_workers_chunk_foreign_keys ... ok668test jobs::report::stream_tests::download_reads_only_when_consumed_and_releases_its_connection ... ok669test jobs::report::tests::legacy_upgrade_preserves_job_states_and_existing_archives ... ok670test jobs::report::tests::legacy_converter_uses_replaced_payload_after_waiting ... ok671test jobs::tests::cancellation_and_retry_are_scoped_and_idempotent ... ok672test jobs::report::tests::report_fragments_survive_until_the_owning_job_expires ... ok673test jobs::tests::claims_are_atomic_and_expired_leases_recover ... ok674test jobs::tests::cancellation_survives_a_crash_before_the_worker_acknowledges ... ok675test jobs::tests::api_job_keeps_its_policy_across_duplicate_enqueue_and_manual_retry ... ok676test jobs::report::tests::legacy_converter_rediscovers_after_candidate_deletion ... ok677test jobs::tests::expired_final_attempt_fails_without_claiming_again ... ok678test jobs::report::tests::legacy_upgrade_preserves_a_concurrently_archived_workers_lease ... ok679test jobs::report::stream_tests::download_readers_retain_authority_through_their_bounded_reads ... ok680test jobs::tests::cancellation_waits_for_the_claimed_execution_before_allowing_retry ... ok681test jobs::tests::csv_job_persists_its_policy_with_the_upload ... ok682test jobs::tests::final_failure_is_retained_and_manual_retry_gets_a_new_budget ... ok683test jobs::tests::history_paginates_tied_timestamps_and_rejects_foreign_cursors ... ok684test jobs::report::tests::upgrading_legacy_reports_preserves_errors_and_fences_old_attempts ... ok685test jobs::tests::expired_lease_cannot_renew_or_commit_using_an_old_transaction_timestamp ... ok686test jobs::tests::invalid_stored_payloads_reach_a_terminal_error ... ok687test jobs::tests::invalid_policy_cannot_enqueue_a_job_or_upload ... ok688test jobs::tests::cleanup_retains_retryable_uploads_and_deletes_expired_jobs ... ok689test jobs::tests::outbox_delivery_is_idempotent ... ok690test jobs::tests::outbox_claims_only_the_requested_event_kind ... ok691test jobs::tests::outbox_same_kind_consumers_cannot_claim_the_same_lease ... ok692test jobs::tests::failed_csv_commit_retains_confirmed_report_through_history_and_retry ... ok693test jobs::tests::payload_kind_is_stable_and_round_trips ... ok694test jobs::tests::payload_versions_preserve_legacy_jobs_and_reject_unknown_versions ... ok695test jobs::tests::failed_csv_preview_retains_confirmed_report_through_history_and_retry ... ok696test jobs::tests::retry_snapshot_does_not_guess_unknown_payloads_or_sources ... ok697test jobs::tests::reclaimed_attempt_rejects_stale_results_even_with_the_same_worker_name ... ok698test jobs::tests::shutdown_deadline_drops_and_joins_in_flight_work ... ok699test jobs::tests::shutdown_waits_for_in_flight_work ... ok700test jobs::tests::retry_snapshot_matches_status_and_list_without_exposing_payload ... ok701test jobs::tests::concurrent_csv_resubmission_preserves_identity_after_upload_cleanup ... ok702test jobs::tests::stopped_worker_leaves_queued_jobs_unclaimed ... ok703test jobs::tests::synthetic_job_executes_through_claim_and_completion ... ok704test jobs::tests::synthetic_job_uses_the_same_registered_envelope ... ok705test jobs::tests::upload_organization_must_match_its_job ... ok706test models::project_creation::tests::draft_roundtrip_preserves_incomplete_input_without_demo_data ... ok707test models::project_creation::tests::legacy_project_edit_roundtrip_keeps_omitted_identity_and_intent ... ok708test models::project_creation::tests::unauthorized_catalog_cost_is_absent_from_serialized_options ... ok709test models::project_creation::tests::unknown_draft_fields_are_rejected ... ok710test models::project_managers::tests::command_preserves_durable_intent_and_strictly_decodes_its_discriminator ... ok711test models::task::tests::rate_transport_distinguishes_preserve_clear_and_zero ... ok712test models::task::tests::rate_transport_rejects_ambiguous_or_imprecise_intent ... ok713test models::time_entry::tests::time_entry_wire_does_not_accept_invoice_identity_from_input ... ok714test models::time_entry::tests::time_entry_wire_omits_invoice_identity_without_mutating_internal_record ... ok715test jobs::tests::submission_key_cannot_change_api_mode_or_scope ... ok716test jobs::tests::submission_key_cannot_change_csv_bytes_or_mode ... ok717test notifications::tests::acknowledged_email_is_never_claimed_again ... ok718test notifications::tests::authority::budget_delivery_observes_winning_activation_and_alert_enable ... ok719test jobs::tests::missing_configuration_records_error_and_requeues ... ok720test jobs::tests::outbox_stale_claims_cannot_acknowledge_or_reschedule_delivery ... ok721test notifications::tests::authority::budget_delivery_rejects_missing_settings_without_waiting_on_child_locks ... ok722test notifications::tests::authority::budget_delivery_releases_all_gates_before_blocked_transport ... ok723test notifications::tests::authority::budget_delivery_rechecks_claim_and_clock_after_final_wait ... ok724test notifications::tests::authority::budget_delivery_refreshes_after_recipient_and_project_waits ... ok725test notifications::tests::authority::budget_delivery_skips_project_drift_or_disappearance ... ok726test jobs::tests::missing_csv_upload_records_error_and_requeues ... ok727test notifications::tests::authority::budget_delivery_skips_retargeted_notification_without_terminalizing ... ok728test notifications::tests::authority::budget_delivery_terminal_rejections_preserve_existing_reasons ... ok729test notifications::tests::cancelling_delivery_kills_the_active_sender ... ok730test jobs::tests::outbox_rollback_does_not_publish_an_event ... ok731test notifications::tests::authority::budget_delivery_skips_notification_appearing_after_discovery ... ok732test notifications::tests::authority::budget_delivery_uses_current_payload_after_recipient_wait ... ok733test notifications::tests::mail_configuration_is_disabled_by_default_and_rejects_partial_values ... ok734test notifications::tests::mail_configuration_requires_an_executable_file_and_safe_sender ... ok735test notifications::tests::authority::budget_delivery_waits_for_organization_and_rechecks_recipient ... ok736test notifications::tests::recipient_injection_is_rejected_before_starting_a_process ... ok737test notifications::tests::rendered_mail_bounds_body_lines_for_long_unicode_and_control_names ... ok738test notifications::tests::authority::budget_preparation_cancellation_and_deadline_release_single_connection ... ok739test jobs::tests::import_adapters_reject_a_lease_from_another_organization ... ok740test notifications::tests::sendmail_failure_does_not_expose_program_output ... ok741test notifications::tests::sendmail_receives_fixed_arguments_and_stable_message_identity ... ok742test notifications::tests::authority::budget_preparation_overrides_read_only_without_leaking_transaction_settings ... ok743test notifications::tests::disabled_mail_worker_does_not_claim_pending_notifications ... ok744test notifications::tests::verbose_sender_output_is_discarded_without_blocking_delivery ... ok745test pages::admin::permission_editor::draft::tests::all_grants_do_not_make_an_individual_an_administrator ... ok746test pages::admin::permission_editor::draft::tests::dirty_state_includes_template_revision_and_independent_identity ... ok747test pages::admin::permission_editor::draft::tests::dirty_state_tracks_reverted_grants_and_profile_provenance ... ok748test pages::admin::permission_editor::draft::tests::editing_invalidates_preview_and_confirmation ... ok749test pages::admin::permission_editor::draft::tests::joint_losses_need_confirmation_and_retry_preserves_exact_command ... ok750test pages::admin::permission_editor::draft::tests::keeping_project_access_is_explicit_and_requires_new_effects ... ok751test pages::admin::permission_editor::draft::tests::load_keeps_exact_grants_and_explicit_edit_intent ... ok752test pages::admin::permission_editor::draft::tests::malformed_loaded_grants_are_not_normalized ... ok753test pages::admin::permission_editor::draft::tests::member_floor_and_explicit_administrator_are_not_customizable ... ok754test pages::admin::permission_editor::draft::tests::stale_or_mismatched_preview_cannot_be_confirmed ... ok755test pages::admin::permission_editor::tests::known_rejections_require_recovery_and_hide_authentication_diagnostics ... ok756test pages::admin::permission_editor::tests::no_op_preview_does_not_invent_permission_changes ... ok757test pages::admin::permission_editor::tests::review_explains_identity_loss_and_both_exact_management_sets ... ok758test pages::admin::permission_editor::tests::unknown_save_failure_is_not_treated_as_a_definite_rejection ... ok759test pages::clients::filters::tests::clearing_query_preserves_selected_currency_and_lifecycle ... ok760test pages::clients::filters::tests::lifecycle_counts_share_query_and_currency_filters ... ok761test pages::clients::filters::tests::name_search_ignores_case_and_surrounding_whitespace ... ok762test pages::clients::filters::tests::preferred_or_visible_project_currency_matches_but_query_still_applies ... ok763test pages::clients::form::tests::absent_billing_authority_never_produces_an_edit_payload ... ok764test pages::clients::form::tests::ambiguous_creation_errors_require_explicit_recovery ... ok765test pages::clients::form::tests::clearing_a_rate_is_explicit_and_needs_no_currency_confirmation ... ok766test pages::clients::form::tests::invalid_fields_are_not_rewritten_by_validation ... ok767test pages::clients::form::tests::rate_replacement_requires_confirmation_in_the_current_currency ... ok768test pages::clients::form::tests::untouched_fields_keep_zero_rate_and_original_snapshot ... ok769test pages::importers::presentation::tests::interrupted_report_is_partial_regardless_of_retry_prerequisites ... ok770test pages::importers::presentation::tests::no_selection_does_not_claim_no_import_history ... ok771test pages::importers::presentation::tests::source_labels_do_not_guess_unknown_importers ... ok772test pages::importers::presentation::tests::states_and_phases_have_readable_unknown_fallbacks ... ok773test pages::importers::presentation::tests::summaries_distinguish_zero_skipped_and_mixed_outcomes ... ok774test pages::invoices::defaults_form::tests::invoice_fields_bound_metadata_by_characters_and_reject_nul ... ok775test pages::invoices::defaults_form::tests::invoice_fields_preserve_exact_percentages_and_custom_terms ... ok776test pages::invoices::defaults_form::tests::invoice_fields_preserve_receipt_terms_and_empty_optional_percentages ... ok777test pages::invoices::defaults_form::tests::invoice_fields_reject_invalid_percentages_terms_and_second_tax ... ok778test pages::invoices::preparation::fees::tests::fee_inputs_require_exact_amounts_and_an_explicit_positive_charge ... ok779test pages::invoices::preparation::fees::tests::refresh_keeps_raw_edits_and_does_not_select_new_sources ... ok780test pages::invoices::preparation::fees::tests::refresh_preserves_missing_or_relabelled_edits_until_explicit_removal ... ok781test pages::invoices::preparation::tests::invoice_context_selects_only_the_exact_available_client ... ok782test pages::invoices::preparation::tests::invoice_review_requires_matching_sources_and_valid_values ... ok783test pages::invoices::preparation::tests::unavailable_or_malformed_invoice_context_never_uses_the_first_client ... ok784test pages::new_project::basics::tests::a_batch_that_would_exceed_the_tag_limit_is_rejected ... ok785test pages::new_project::basics::tests::a_full_tag_list_still_accepts_a_duplicate ... ok786test pages::new_project::basics::tests::overlong_tags_are_rejected_without_truncation ... ok787test notifications::tests::foreign_notification_payload_is_terminal_and_never_sent ... ok788test pages::new_project::basics::tests::tag_length_counts_characters_instead_of_bytes ... ok789test pages::new_project::basics::tests::tags_trim_and_deduplicate_without_changing_existing_spelling ... ok790test pages::new_project::draft::tests::a_mismatched_acknowledgement_does_not_lose_pending_input ... ok791test notifications::tests::retry_can_recover_without_changing_message_identity ... ok792test pages::new_project::draft::tests::a_retry_keeps_the_unacknowledged_payload_and_revision ... ok793test pages::new_project::draft::tests::an_empty_form_is_not_reported_as_saved ... ok794test pages::new_project::draft::tests::a_validation_rejection_allows_corrected_input_at_the_same_revision ... ok795test pages::new_project::draft::tests::context_prefills_only_a_new_form_without_fixing_its_currency ... ok796test pages::new_project::draft::tests::any_saved_draft_wins_over_context_including_empty_or_matching_client ... ok797test pages::new_project::billing::tests::budget_errors_target_a_control_that_can_be_corrected ... ok798test pages::new_project::team::tests::adding_everyone_deduplicates_without_replacing_project_overrides ... ok799test pages::new_project::team::tests::exceeding_the_team_limit_does_not_partially_add_people ... ok800test pages::new_project::draft::tests::resuming_preserves_the_server_identity_and_incomplete_fields ... ok801test pages::new_project::team::tests::legacy_manager_checkbox_needs_no_canonical_selection ... ok802test pages::new_project::team::tests::removing_a_member_keeps_an_empty_restricted_task_restricted ... ok803test pages::new_project::team::tests::manager_checkbox_updates_complete_selection_without_dropping_outside_managers ... ok804test pages::new_project::team::tests::tracking_removal_and_readdition_keep_independent_manager_intent ... ok805test pages::new_project::tests::a_rejected_creation_can_be_edited_but_an_uncertain_commit_must_be_retried ... ok806test pages::projects::budget_display_tests::configured_summary_does_not_recompute_totals_from_private_breakdown ... ok807test pages::new_project::tests::only_known_validation_fields_can_target_a_control ... ok808test pages::projects::budget_display_tests::display_preserves_units_sign_and_large_integer_values ... ok809test pages::projects::budget_display_tests::tag_filter_matches_identity_without_duplicates_or_name_collisions ... ok810test pages::projects::budget_display_tests::project_spend_keeps_withheld_money_distinct_from_zero_and_visible_hours ... ok811test pages::projects::budget_display_tests::unallocated_zero_and_overflow_budgets_are_not_conflated ... ok812test pages::reports::tests::mixed_currencies_are_not_added_even_when_the_numbers_would_overflow ... ok813test pages::reports::tests::cost_total_uses_organization_currency_across_billing_currencies ... ok814test pages::reports::tests::monetary_total_overflow_is_visible_instead_of_panicking ... ok815test pages::reports::tests::single_currency_totals_are_formatted_and_empty_reports_have_no_amount ... ok816test pages::reports::tests::redacted_costs_do_not_become_zero_or_partial_totals ... ok817test pages::settings::own_permissions::tests::own_permissions_view_distinguishes_authentication_forbidden_and_failure ... ok818test pages::settings::own_permissions::tests::own_permissions_view_admin_identity_is_explicit_not_derived_from_grants ... ok819test pages::settings::own_permissions::tests::own_permissions_view_does_not_disclose_internal_fields_or_offer_edits ... ok820test pages::settings::own_permissions::tests::own_permissions_view_grants_do_not_promise_unavailable_features ... ok821test pages::settings::own_permissions::tests::own_permissions_view_legacy_is_not_empty_or_a_profile ... ok822test pages::settings::own_permissions::tests::own_permissions_view_empty_grants_are_not_normalized ... ok823test pages::settings::own_permissions::tests::own_permissions_view_loading_hides_previous_snapshot ... ok824test pages::settings::own_permissions::tests::own_permissions_view_preserves_exact_grants_without_profile_inference ... ok825test pages::timesheet::data::tests::completes_pages_while_pinning_subject_requester_and_policy ... ok826test pages::settings::own_permissions::tests::own_permissions_view_unsupported_catalog_hides_uninterpretable_grants ... ok827test pages::timesheet::data::tests::empty_authorized_sheet_is_a_complete_result ... ok828test notifications::tests::mail_worker_delivers_only_its_kind_and_drains_cleanly ... ok829test notifications::tests::failed_email_retries_same_identity_and_eventually_stops ... ok830test pages::timesheet::data::tests::old_week_results_and_errors_are_not_current_even_before_restart ... ok831test pages::timesheet::data::tests::rejects_a_nonadvancing_cursor_instead_of_looping ... ok832test pages::timesheet::data::tests::refuses_a_changed_requester_subject_or_policy_between_pages ... ok833test pages::timesheet::data::tests::rejects_mixed_subjects_out_of_window_rows_and_duplicates ... ok834test pages::timesheet::data::tests::rejects_the_wrong_first_subject_or_requester ... ok835test pages::timesheet::data::tests::rejects_rows_repeated_across_pages ... ok836test pages::timesheet::data::tests::later_page_failure_does_not_return_partial_totals ... ok837test pages::timesheet::refresh_tests::discarding_a_row_removes_its_drafts_only_for_the_captured_week ... ok838test pages::timesheet::tests::cal_span_day_shows_only_the_anchor_column ... ok839test pages::timesheet::tests::cal_span_defaults_to_week ... ok840test pages::timesheet::tests::cal_span_unknown_falls_back_to_week ... ok841test pages::timesheet::tests::cal_span_week_shows_all_seven_days ... ok842test pages::timesheet::tests::cal_span_url_roundtrips ... ok843test pages::timesheet::tests::cal_span_work_week_preserves_date_order_across_weekends ... ok844test pages::timesheet::tests::cal_span_work_week_shows_monday_to_friday ... ok845test pages::timesheet::tests::day_col_class_plain_weekday ... ok846test pages::timesheet::tests::cal_span_work_week_skips_sunday_when_it_is_the_first_column ... ok847test pages::timesheet::tests::day_col_class_marks_today ... ok848test pages::timesheet::tests::invalid_duration_cannot_start_a_timer_save_or_clear_a_cell ... ok849test pages::timesheet::tests::day_col_class_marks_weekend ... ok850test pages::timesheet::tests::day_col_class_today_wins_over_weekend ... ok851test pages::timesheet::tests::legacy_historical_edits_do_not_create_new_tracking_eligibility ... ok852test pages::timesheet::tests::delegated_stop_requires_the_exact_eligible_pair_and_keeps_state_locks ... ok853test pages::timesheet::tests::only_a_blank_duration_can_start_an_eligible_timer ... ok854test pages::timesheet::tests::read_only_day_keeps_facts_but_disables_edit_and_start_buttons ... ok855test pages::timesheet::tests::terminal_stop_recovery_is_owner_only_when_tracking_is_lost ... ok856test pages::timesheet::tests::timed_lanes_still_widens_overlapping_entries ... ok857test pages::timesheet::tests::timed_lanes_terminates_on_a_zero_length_entry ... ok858test pages::timesheet::tests::today_offset_is_none_after_the_week ... ok859test pages::timesheet::tests::today_offset_is_none_before_the_week ... ok860test pages::timesheet::tests::today_offset_is_six_on_the_sunday ... ok861test pages::timesheet::tests::value_cell_class_marks_today_when_nonzero ... ok862test pages::timesheet::tests::value_cell_class_empty_wins_over_today ... ok863test pages::timesheet::tests::today_offset_is_zero_on_the_monday ... ok864test pages::timesheet::refresh_tests::typing_in_another_cell_survives_a_save_refresh ... ok865test pages::timesheet::tests::weekly_duration_edit_preserves_nine_am_start_notes_and_billability ... ok866test pages::timesheet::tests::weekend_style_follows_the_date_not_the_column_offset ... ok867test pages::timesheet::tests::visible_time_without_writable_tracking_does_not_enable_edit_controls ... ok868test pages::timesheet::tests::weekly_new_entries_are_untimed_and_explicit_clears_still_work ... ok869test notifications::tests::sendmail_timeout_kills_and_reaps_the_child ... ok870test notifications::tests::revoked_recipient_does_not_receive_a_pending_email ... ok871test plugin::database::tests::reader_accepts_optional_first_party_rounding_helper ... ok872test plugin::database::tests::reader_cannot_execute_security_definer_functions ... ok873test plugin::event::tests::active_transition_fires_only_on_a_real_flip ... ok874test plugin::event::tests::budget_and_timer_events_serialize ... ok875test plugin::event::tests::new_events_have_stable_hook_names ... ok876test plugin::event::tests::project_membership_payload_excludes_private_configuration ... ok877test plugin::event::tests::role_change_event_carries_previous_role ... ok878test plugin::event::tests::submission_event_serializes_payload ... ok879test plugin::event::tests::us2_events_have_stable_hook_names ... ok880test plugin::database::tests::application_database_owner_is_not_a_plugin_identity ... ok881test plugin::host::tests::config_lookup::a_set_key_is_returned ... ok882test plugin::host::tests::config_lookup::an_unset_key_is_none ... ok883test plugin::database::tests::dedicated_reader_is_accepted_but_new_write_grants_are_rejected ... ok884test notifications::tests::stale_email_lease_cannot_start_delivery ... ok885test plugin::database::tests::project_configuration_is_private_even_when_plugin_grants_are_misconfigured ... ok886test plugin::database::tests::reader_cannot_have_access_to_credentials ... ok887test plugin::host::tests::database_tests::unconfigured_sql_never_falls_back_to_application_state ... ok888test plugin::database::tests::reader_cannot_switch_into_another_role ... ok889test plugin::host::tests::response_shaping::error_json_wraps_the_message ... ok890test plugin::host::tests::response_shaping::http_body_accepts_the_size_limit_and_rejects_larger_responses ... ok891test plugin::host::tests::response_shaping::http_response_carries_status_and_body ... ok892test plugin::host::tests::response_shaping::invalid_http_utf8_is_an_error_not_an_empty_success ... ok893test plugin::host::tests::statement_is_read_only::a_cte_select_is_allowed ... ok894test plugin::host::tests::statement_is_read_only::a_second_statement_is_rejected ... ok895test plugin::host::tests::statement_is_read_only::a_single_trailing_semicolon_is_allowed ... ok896test plugin::host::tests::statement_is_read_only::a_write_hidden_behind_a_comment_is_rejected ... ok897test plugin::host::tests::statement_is_read_only::plain_select_is_allowed ... ok898test plugin::host::tests::statement_is_read_only::writes_are_rejected ... ok899test plugin::host::tests::wrap_select::strips_a_trailing_semicolon_before_wrapping ... ok900test plugin::host::tests::wrap_select::wraps_as_a_bounded_row_query ... ok901test plugin::manifest::tests::accepts_all_published_business_events ... ok902test plugin::manifest::tests::config_defaults_to_empty_when_absent ... ok903test plugin::manifest::tests::parse_valid_manifest ... ok904test plugin::manifest::tests::parses_optional_config_table ... ok905test plugin::manifest::tests::reject_empty_hooks ... ok906test plugin::manifest::tests::reject_unknown_hook ... ok907test plugin::database::tests::reader_rejects_unapproved_invoker_functions ... ok908test plugin::host::tests::database_tests::query_results_are_bounded_without_silent_truncation ... ok909test plugin::host::tests::database_queries_preserve_parameters_and_rollback_session_settings ... ok910test plugin::host::tests::database_tests::query_discards_session_advisory_locks ... ok911test plugin::host::tests::database_tests::select_cannot_write_or_gain_application_privileges ... ok912913running 1 test914test plugin::registry::tests::initialization::guest_initializers_have_an_engine_instruction_budget ... ok915916test result: ok. 1 passed; 0 failed; 0 ignored; 0 measured; 1503 filtered out; finished in 0.48s917918919running 1 test920test plugin::registry::tests::initialization::guest_initializers_have_an_engine_instruction_budget ... ok921922test result: ok. 1 passed; 0 failed; 0 ignored; 0 measured; 1503 filtered out; finished in 0.34s923924925running 1 test926test plugin::registry::tests::initialization::guest_initializers_have_an_engine_instruction_budget ... ok927928test result: ok. 1 passed; 0 failed; 0 ignored; 0 measured; 1503 filtered out; finished in 0.66s929930931running 1 test932test plugin::registry::tests::initialization::guest_initializers_have_an_engine_instruction_budget ... ok933934test result: ok. 1 passed; 0 failed; 0 ignored; 0 measured; 1503 filtered out; finished in 0.41s935936test plugin::registry::tests::initialization::guest_initializers_have_an_engine_instruction_budget ... ok937test plugin::registry::tests::initialization::instruction_budget_is_replenished_for_each_call ... ok938test plugin::host::tests::database_tests::wasm_host_uses_the_restricted_connection_on_a_current_thread_runtime ... ok939test plugin::registry::tests::isolation::cancelling_a_waiter_keeps_capacity_reserved_until_the_host_call_exits ... ok940test plugin::registry::tests::isolation::confirmed_dispatch_attempts_other_plugins_after_one_fails ... ok941test plugin::registry::tests::isolation::confirmed_dispatch_returns_overload_for_retry ... ok942test plugin::registry::tests::isolation::confirmed_dispatch_returns_plugin_failure_for_retry ... ok943test plugin::registry::tests::isolation::confirmed_dispatch_waits_for_the_plugin_to_finish ... ok944test plugin::registry::tests::isolation::different_plugins_share_the_running_call_limit ... ok945test plugin::registry::tests::isolation::events_execute_outside_the_async_worker ... ok946test plugin::registry::tests::isolation::loaded_plugins_cannot_grow_memory_past_the_limit ... ok947test plugin::registry::tests::isolation::loaded_plugins_cannot_start_with_excessive_memory ... ok948test plugin::registry::tests::isolation::oversized_event_payloads_are_not_queued ... ok949test plugin::registry::tests::isolation::oversized_wasm_output_is_rejected_before_copying_it ... ok950test plugin::registry::tests::isolation::pending_capacity_rejects_new_work_without_spawning_tasks ... ok951test plugin::registry::tests::isolation::widgets_execute_outside_the_async_worker ... ok952test plugin::registry::tests::load_empty_directory ... ok953test plugin::registry::tests::load_nonexistent_directory ... ok954test plugin::host::tests::a_query_cannot_disable_its_own_deadline ... ok955test render::tests::invoice_template_formats_large_minor_units_exactly ... ok956test reports::bounded::tests::cancelled_export_keeps_its_slot_until_the_renderer_exits ... ok957test reports::bounded::tests::export_admission_stays_reserved_until_the_body_is_dropped ... ok958test reports::bounded::tests::export_rendering_runs_off_the_async_worker ... ok959test reports::bounded::tests::output_budget_checks_writes_and_seeks_without_truncation ... ok960test reports::bounded::tests::rendered_output_limit_rejects_oversized_files_and_releases_admission ... ok961test reports::bounded::tests::renderer_errors_and_panics_release_admission ... ok962test plugin::registry::tests::load_test_plugins ... ok963test reports::export_params_tests::active_projects_only_filter_is_optional_and_strict ... ok964test reports::export_params_tests::billability_filter_defaults_and_serializes_without_ambiguous_booleans ... ok965test reports::export_params_tests::billability_filter_rejects_unknown_empty_and_repeated_values ... ok966test reports::export_params_tests::download_identity_is_a_complete_optional_binding_not_authority ... ok967test reports::export_params_tests::download_policy_binding_rejects_unknown_and_repeated_modes ... ok968test reports::export_params_tests::downloads_reject_cursors_and_reversed_periods ... ok969test reports::export_params_tests::legacy_scalar_and_empty_plural_filters_preserve_the_existing_scope ... ok970test reports::export_params_tests::malformed_or_ambiguous_filters_never_become_unrestricted_downloads ... ok971test reports::export_params_tests::plural_filters_preserve_every_dimension_and_deduplicate_ids ... ok972test reports::export_params_tests::projects::project_download_accepts_legacy_links_and_matching_requester ... ok973test reports::export_params_tests::projects::project_download_binding_is_not_authority_to_select_another_requester ... ok974test reports::export_params_tests::projects::project_download_rejects_partial_malformed_and_repeated_identity ... ok975test reports::groups::tests::active_projects_only_grouped_transport_is_optional_and_strict ... ok976test reports::groups::tests::billability_grouped_transport_is_optional_and_strict ... ok977test reports::groups::tests::grouped_xlsx_transport_rejects_ambiguous_or_invalid_parameters ... ok978test plugin::registry::tests::dispatch_event_with_no_subscribers ... ok979test plugin::registry::tests::collect_widgets_from_echo_plugin ... ok980test reports::bounded::tests::timed_out_export_keeps_its_slot_until_the_renderer_exits ... ok981test reports::limits::tests::authorization::materialized_exports_deny_revoked_managers ... ok982test reports::limits::tests::authorization::materialized_exports_deny_winning_legacy_revocations ... ok983test plugin::registry::tests::failing_plugin_does_not_block_caller ... ok984test plugin::registry::tests::dispatch_invoice_sent_to_echo_plugin ... ok985test plugin::registry::tests::dispatch_to_echo_plugin_succeeds ... ok986test plugin::registry::tests::isolation::a_wasm_timeout_releases_the_worker_and_instance ... ok987test reports::limits::tests::authorization::materialized_exports_recheck_after_render_without_retaining_authority ... ok988test reports::limits::tests::authorization::materialized_exports_refresh_after_access_revision_change ... ok989test reports::limits::tests::bounded_entries_reject_large_fields_and_combined_text ... ok990test reports::limits::tests::authorization::materialized_exports_release_rendered_body_when_final_check_is_interrupted ... ok991test reports::limits::tests::authorization::materialized_exports_require_same_tenant_active_actor ... ok992test reports::limits::tests::authorization::materialized_exports_keep_deadlines_and_restore_pool_defaults ... ok993test reports::limits::tests::bounded_projects_filter_archives_before_size_checks ... ok994test reports::limits::tests::authorization::materialized_exports_preserve_checked_snapshots ... ok995test reports::limits::tests::fee_exports_preserve_absent_quantities_and_render_a_real_pdf ... ok996test reports::limits::tests::measure_bounded_export_limits ... ignored, manual release export measurement; set HORAE_EXPORT_PROBE_DIR for artifacts997test reports::limits::tests::bounded_entries_enforce_the_row_limit_after_all_filters ... ok998test reports::limits::tests::project_authorization::project_exports_bound_rows_and_text_after_scope_filtering ... ok999test reports::limits::tests::bounded_exports_preserve_real_workbooks_and_deterministic_pdf ... ok1000test reports::limits::tests::bounded_invoice_limits_include_branding_and_preserve_tenant_scope ... ok1001test reports::limits::tests::authorization::materialized_exports_retain_authority_and_release_cancelled_reads ... ok1002test reports::limits::tests::export_size_checks_and_reads_share_a_repeatable_read_snapshot ... ok1003test reports::limits::tests::project_authorization::project_exports_preserve_membership_visibility_and_history_rules ... ok1004test reports::limits::tests::project_authorization::project_exports_reject_missing_foreign_and_unreadable_captured_ids ... ok1005test reports::limits::tests::invoice_exports_show_saved_adjustments_and_exact_large_amounts ... ok1006test reports::limits::tests::project_authorization::project_exports_cancel_loading_without_retaining_authority ... ok1007test reports::limits::tests::export_queries_are_read_only_and_have_a_database_deadline ... ok1008test reports::limits::tests::project_authorization::project_exports_retain_parent_authority_until_release_check_finishes ... ok1009test reports::limits::tests::project_authorization::project_exports_refresh_release_scope_after_parent_wait ... ok1010test reports::limits::tests::project_authorization::project_exports_refresh_scope_after_winning_relationship_changes ... ok1011test reports::limits::tests::project_canonical::canonical_project_export_accepts_project_reader_with_legacy_member_role ... ok1012test reports::limits::tests::project_authorization::project_exports_release_every_captured_project_without_render_locks ... ok1013test reports::limits::tests::project_authorization::project_exports_share_one_size_and_payload_snapshot ... ok1014test reports::limits::tests::project_canonical::canonical_project_export_does_not_inherit_legacy_administrator_scope ... ok1015test reports::limits::tests::project_authorization::project_exports_deny_actor_revoked_during_either_authority_wait ... ok1016test reports::limits::tests::time_authorization::grouped::grouped_xlsx_budget_includes_contexts_in_addition_to_names ... ok1017test reports::limits::tests::project_canonical::canonical_project_workbook_rejects_financial_revocation_during_render ... ok1018test reports::limits::tests::time_authorization::denied_time_export_releases_authority_before_pool_cleanup ... ok1019test reports::limits::tests::project_authorization::project_exports_require_current_tenant_bound_actor ... ok1020test reports::limits::tests::time_authorization::grouped::grouped_xlsx_rejects_partial_loss_of_a_multi_context_group ... ok1021test reports::limits::tests::time_authorization::grouped::grouped_xlsx_caps_groups_and_names_after_filters ... ok1022test reports::limits::tests::time_authorization::scoped_xlsx_deletion_keeps_recorded_scope_but_loss_of_person_access_denies ... ok1023test reports::limits::tests::project_authorization::project_exports_release_cancelled_and_timed_out_checks ... ok1024test reports::limits::tests::time_authorization::grouped::grouped_xlsx_limits_groups_not_source_entries_and_preserves_scope ... ok1025test reports::limits::tests::time_authorization::scoped_xlsx_empty_files_still_validate_state_actor_and_policy_at_release ... ok1026test reports::limits::tests::time_authorization::grouped::grouped_xlsx_all_dimensions_render_exact_hours_without_private_scope ... ok1027test reports::limits::tests::time_authorization::scoped_xlsx_member_reads_own_rows_without_financial_or_directory_access ... ok1028test reports::limits::tests::time_authorization::scoped_xlsx_legacy_manager_role_does_not_expand_canonical_scope ... ok1029test reports::limits::tests::time_authorization::scoped_xlsx_release_observes_direct_actor_update_commit_or_rollback ... ok1030test reports::limits::tests::project_canonical::canonical_project_export_withholds_ordinary_monetary_budget ... ok1031test reports::limits::tests::time_authorization::scoped_xlsx_source_refreshes_grant_gains_and_losses_after_org_wait ... ok1032test reports::limits::tests::tag_filter_applies_before_xlsx_size_checks_and_rendering ... ok1033test reports::limits::tests::time_authorization::grouped::grouped_xlsx_reauthorizes_original_pairs_after_reassignment ... ok1034test reports::limits::tests::time_authorization::scoped_xlsx_waits_for_scope_revocation_and_cancellation_releases_connection ... ok1035test reports::limits::tests::time_authorization::scoped_xlsx_rejects_paged_reversed_or_wrong_requester_queries ... ok1036test reports::limits::tests::time_authorization::grouped::grouped_xlsx_rejects_wrong_identity_legacy_policy_and_page_cursor ... ok1037test reports::limits::tests::time_authorization::scoped_xlsx_scope_union_and_multi_filters_precede_size_checks ... ok1038test reports::streaming::database_tests::a_real_database_error_interrupts_the_csv_body ... ok1039test reports::limits::tests::time_authorization::scoped_xlsx_reauthorizes_captured_project_not_reassigned_source ... ok1040test reports::streaming::database_tests::authorization::streamed_compressible_unicode_payload_bounds_native_prefetch ... ok1041test reports::limits::tests::time_authorization::scoped_xlsx_revoked_grants_after_render_deny_other_peoples_captured_rows ... ok1042test reports::streaming::database_tests::authorization::streamed_exports_refresh_after_organization_or_actor_wait ... ok1043test reports::streaming::database_tests::authorization::streamed_invoice_keeps_original_metadata_lines_and_totals_between_batches ... ok1044test reports::streaming::database_tests::authorization::streamed_exports_require_current_tenant_bound_actors_even_when_empty ... ok1045test reports::privacy_tests::project_downloads_follow_progress_visibility has been running for over 60 seconds1046test reports::privacy_tests::unauthorized_project_text_does_not_affect_export_size_limits has been running for over 60 seconds1047test reports::streaming::database_tests::authorization::streamed_authority_releases_successful_locks_and_overrides_inherited_settings has been running for over 60 seconds1048test reports::streaming::database_tests::authorization::streamed_cancelled_authorization_reclaims_its_single_connection has been running for over 60 seconds1049test reports::streaming::database_tests::authorization::streamed_cancelled_authorization_reclaims_its_single_connection ... ok1050test reports::streaming::database_tests::authorization::streamed_cancelled_fetch_reclaims_connection_without_authority_locks has been running for over 60 seconds1051test reports::privacy_tests::unauthorized_project_text_does_not_affect_export_size_limits ... ok1052test reports::streaming::database_tests::authorization::streamed_native_batches_keep_crossing_rows_and_reject_invalid_limits ... ok1053test reports::privacy_tests::project_downloads_follow_progress_visibility ... ok1054test reports::streaming::database_tests::authorization::streamed_authority_releases_successful_locks_and_overrides_inherited_settings ... ok1055test reports::streaming::database_tests::authorization::streamed_header_and_total_blocks_recheck_manager_after_capacity has been running for over 60 seconds1056test reports::streaming::database_tests::authorization::streamed_cancelled_fetch_reclaims_connection_without_authority_locks ... ok1057test reports::streaming::database_tests::authorization::streamed_native_projection_mismatch_fails_instead_of_coercing ... ok1058test reports::streaming::database_tests::measure_streaming_csv_export ... ignored, Manual release measurement of a 100,000-row CSV download1059test reports::streaming::database_tests::authorization::streamed_projects_capture_scope_gained_during_initial_wait ... ok1060test reports::streaming::database_tests::authorization::streamed_pending_project_block_checks_all_captured_ids_after_capacity ... ok1061test reports::streaming::database_tests::project_canonical::project_csv_invalid_source_state_cannot_be_repaired_before_fetch ... ok1062test reports::streaming::database_tests::authorization::streamed_project_release_refreshes_scope_after_parent_wait ... ok1063test reports::streaming::database_tests::authorization::streamed_source_stays_frozen_across_batches_while_authority_is_fresh ... ok1064test reports::streaming::database_tests::scoped_time::billability::billability_csv_uses_the_captured_source_after_entry_changes ... ok1065test reports::streaming::database_tests::dropping_streamed_timesheet_closes_its_database_connection ... ok1066test reports::streaming::database_tests::project_canonical::project_csv_canonical_empty_scope_does_not_inherit_legacy_admin ... ok1067test reports::streaming::database_tests::project_canonical::project_csv_source_masks_money_using_declare_snapshot ... ok1068test reports::streaming::database_tests::authorization::streamed_header_and_total_blocks_recheck_manager_after_capacity ... ok1069test reports::streaming::database_tests::project_canonical::project_csv_rejects_financial_revocation_after_capacity_wait ... ok1070test reports::streaming::database_tests::project_canonical::project_csv_canonical_reader_exports_project_without_monetary_budget ... ok1071test reports::streaming::database_tests::authorization::streamed_timesheet_rechecks_after_backpressure_without_retaining_locks ... ok1072test reports::streaming::database_tests::scoped_time::billability::billability_matches_effective_rows_totals_and_all_download_sources ... ok1073test reports::streaming::database_tests::scoped_time::grouped::grouped_csv_checks_last_context_before_emitting_any_group_bytes ... ok1074test reports::streaming::database_tests::scoped_time::grouped::active_projects::active_projects_only_empty_downloads_still_require_current_authority ... ok1075test reports::streaming::database_tests::scoped_time::grouped::active_projects::active_projects_only_csv_captures_activity_at_source_snapshot ... ok1076test reports::streaming::database_tests::scoped_time::grouped::grouped_csv_exports_all_four_dimensions_with_exact_rounded_hours ... ok1077test reports::streaming::database_tests::scoped_time::grouped::grouped_csv_keeps_authority_between_fragment_batches_and_releases_on_cancel ... ok1078test reports::streaming::database_tests::scoped_time::grouped::active_projects::active_projects_only_workbooks_retain_source_after_archiving ... ok1079test reports::streaming::database_tests::scoped_time::grouped::grouped_csv_bounds_native_fragments_and_preserves_large_unicode_labels ... ok1080test reports::streaming::database_tests::scoped_time::grouped::grouped_csv_invalid_source_authority_cannot_be_repaired_after_declare ... ok1081test reports::streaming::database_tests::scoped_time::scoped_csv_empty_header_rechecks_policy_and_state_after_capacity ... ok1082test reports::streaming::database_tests::scoped_time::billability::billability_empty_exports_still_require_active_authority has been running for over 60 seconds1083test reports::streaming::database_tests::scoped_time::grouped::active_projects::active_projects_only_matches_detailed_and_grouped_downloads ... ok1084test reports::streaming::database_tests::scoped_time::grouped::grouped_csv_empty_source_still_requires_canonical_authority has been running for over 60 seconds1085test reports::streaming::database_tests::scoped_time::grouped::grouped_csv_has_no_workbook_source_entry_cap has been running for over 60 seconds1086test reports::streaming::database_tests::scoped_time::grouped::grouped_csv_preserves_distinct_ids_beyond_ten_thousand_groups has been running for over 60 seconds1087test reports::streaming::database_tests::scoped_time::grouped::grouped_csv_revocation_under_backpressure_does_not_hold_gates has been running for over 60 seconds1088test reports::streaming::database_tests::scoped_time::scoped_csv_invalid_captured_state_cannot_be_repaired_before_fetch has been running for over 60 seconds1089test reports::streaming::database_tests::scoped_time::scoped_csv_legacy_manager_does_not_expand_own_scope has been running for over 60 seconds1090test reports::streaming::database_tests::scoped_time::scoped_csv_member_downloads_own_rows_without_financial_grants has been running for over 60 seconds1091test reports::streaming::database_tests::scoped_time::grouped::grouped_csv_preserves_distinct_ids_beyond_ten_thousand_groups ... FAILED1092test reports::streaming::database_tests::scoped_time::grouped::grouped_csv_has_no_workbook_source_entry_cap ... ok1093test reports::streaming::database_tests::scoped_time::scoped_csv_member_downloads_own_rows_without_financial_grants ... ok1094test reports::streaming::database_tests::scoped_time::grouped::grouped_csv_revocation_under_backpressure_does_not_hold_gates ... ok1095test reports::streaming::database_tests::scoped_time::scoped_csv_invalid_captured_state_cannot_be_repaired_before_fetch ... ok1096test reports::streaming::database_tests::scoped_time::billability::billability_empty_exports_still_require_active_authority ... ok1097test reports::streaming::database_tests::scoped_time::scoped_csv_source_uses_management_edges_at_declare ... ok1098test reports::streaming::database_tests::scoped_time::scoped_csv_source_uses_declare_authority_not_initial_or_fetch_authority ... ok1099test reports::streaming::database_tests::scoped_time::grouped::grouped_csv_empty_source_still_requires_canonical_authority ... ok1100test reports::streaming::database_tests::scoped_time::scoped_csv_revocation_under_backpressure_interrupts_body_without_holding_locks ... ok1101test reports::streaming::database_tests::scoped_time::scoped_csv_reassigned_or_deleted_entries_keep_captured_context ... ok1102test reports::streaming::database_tests::streamed_fee_invoice_has_no_fabricated_hours_or_hourly_rate ... ok1103test reports::streaming::database_tests::streamed_tag_filter_excludes_other_projects_without_duplicating_rows ... ok1104test reports::streaming::database_tests::streamed_project_exports_deny_inactive_actors ... ok1105test reports::streaming::database_tests::streamed_timesheet_preserves_csv_escaping_frozen_zero_and_all_filters ... ok1106test reports::streaming::tests::completed_csv_keeps_admission_until_body_drop ... ok1107test reports::streaming::tests::csv_backpressure_and_body_drop_bound_and_cancel_source_reads ... ok1108test reports::streaming::tests::csv_does_not_truncate_a_quoted_unicode_record_larger_than_a_chunk ... ok1109test reports::streaming::tests::csv_emits_a_chunk_before_the_source_finishes ... ok1110test reports::streaming::tests::csv_failure_or_panic_after_a_chunk_is_not_successful_eof ... ok1111test reports::streaming::tests::csv_startup_errors_are_http_errors_and_release_admission ... ok1112test reports::streaming::tests::csv_timeout_interrupts_an_already_started_body ... ok1113test reports::streaming::tests::dropping_csv_during_startup_cancels_the_producer ... ok1114test route::tests::client_detail_preserves_identity_and_highlights_only_clients ... ok1115test route::tests::client_workflow_paths_preserve_context_and_navigation_section ... ok1116test route::tests::edit_project_preserves_identity_and_highlights_only_projects ... ok1117test route::tests::existing_timesheet_links_without_a_person_still_select_own_time ... ok1118test route::tests::invalid_timesheet_person_is_not_silently_removed_from_the_route ... ok1119test route::tests::malformed_context_reaches_the_workflow_for_validation_after_recovery ... ok1120test route::tests::new_project_is_static_and_highlights_only_projects ... ok1121test route::tests::timesheet_routes_preserve_selected_person_in_every_view ... ok1122test reports::streaming::database_tests::streamed_invoice_uses_stored_exact_cents_and_tenant_scoped_metadata ... ok1123test reports::streaming::database_tests::scoped_time::scoped_csv_legacy_manager_does_not_expand_own_scope ... ok1124test reports::streaming::database_tests::scoped_time::scoped_csv_rechecks_every_pending_context_but_not_previous_blocks ... ok1125test seed::tests::concurrent_initializers_cannot_create_two_organizations ... ok1126test reports::streaming::database_tests::scoped_time::scoped_csv_missing_identity_has_invalid_sentinel_and_metadata_is_bounded ... ok1127test seed::tests::seed_leaves_an_older_or_partial_demo_unchanged ... ok1128test seed::tests::repeated_seed_preserves_every_row_and_user_edits ... ok1129test seed::tests::seed_refuses_a_second_organization_even_when_the_demo_exists ... ok1130test seed::tests::concurrent_seed_runs_create_only_one_demo ... ok1131test seed::tests::seed_refuses_an_initialized_organization_without_writes ... ok1132test server_fns::approvals::isolation_tests::foreign_reopen_is_not_found_and_preserves_pending_and_approved_work ... ok1133test seed::tests::concurrent_init_and_seed_cannot_mix_organizations ... ok1134test server_fns::approvals::isolation_tests::own_organization_can_reopen_without_unlocking_invoiced_entries ... ok1135test server_fns::approvals::submission_tests::cancelling_a_submission_releases_its_write_barrier ... ok1136test server_fns::approvals::submission_tests::submission_accepts_the_organizations_sunday_start ... ok1137test server_fns::approvals::submission_tests::admitted_submission_finishes_before_access_change ... ok1138test server_fns::approvals::submission_tests::submission_barrier_allows_shared_writers_for_the_same_user ... ok1139test server_fns::approvals::submission_tests::submission_does_not_wait_for_another_users_writer ... ok1140test server_fns::approvals::submission_tests::submission_rechecks_policy_and_activity_after_access_change ... ok1141test server_fns::approvals::submission_tests::submission_freezes_the_minutes_after_a_competing_edit ... ok1142test server_fns::approvals::submission_tests::submission_rejects_a_start_that_is_not_the_organizations_week_start ... ok1143test server_fns::approvals::isolation_tests::bulk_approval_only_returns_and_transitions_own_organization ... ok1144test server_fns::approvals::submission_tests::submission_uses_one_pool_connection ... ok1145test server_fns::approvals::tests::sees_a_running_timer_inside_the_week ... ok1146test server_fns::approvals::submission_tests::submission_waits_for_a_new_timer_before_checking_the_week ... ok1147test server_fns::approvals::tests::ignores_stopped_and_out_of_week_timers ... ok1148test reports::streaming::database_tests::streamed_timesheet_exceeds_xlsx_row_limit_without_one_large_body_chunk ... ok1149test reports::streaming::database_tests::streamed_invoice_metadata_and_lines_share_one_snapshot has been running for over 60 seconds1150test server_fns::budget_tests::concurrent_budget_checks_have_one_band_claimant ... ok1151test server_fns::budget_tests::budget_notification_schema_enforces_tenants_and_no_public_access ... ok1152test server_fns::budget_tests::configured_alert_and_outbox_roll_back_together ... ok1153test server_fns::budget_tests::configured_alerts_deduplicate_concurrent_checks_and_recrossing ... ok1154test server_fns::budget_tests::configured_alerts_require_enabled_active_project_and_authorized_recipient ... ok1155test server_fns::approvals::isolation_tests::foreign_approval_ids_do_not_change_another_organizations_week ... ok1156test server_fns::budget_tests::configured_alert_recipients_are_active_same_org_managers_and_project_leads ... ok1157test server_fns::budget_tests::configured_amount_budget_uses_resolved_rates_and_explicit_zero ... ok1158test reports::streaming::database_tests::streamed_projects_preserve_scope_budget_and_tenant_isolation has been running for over 60 seconds1159test server_fns::budget_tests::configured_budget_sweep_recovers_missed_checks_without_duplicates ... ok1160test server_fns::budget_tests::configured_budget_does_not_read_foreign_or_legacy_projects ... ok1161test server_fns::budget_tests::configured_nonbillable_projects_count_time_without_hidden_checkbox ... ok1162test server_fns::budget_tests::configured_monthly_budget_excludes_other_months_and_nonbillable_time ... ok1163test reports::streaming::database_tests::streamed_projects_preserve_scope_budget_and_tenant_isolation ... ok1164test server_fns::budget_tests::configured_monthly_budget_includes_leap_day_and_preserves_locked_rounding ... ok1165test server_fns::budget_tests::configured_task_and_person_budgets_do_not_share_consumption ... ok1166test server_fns::budget_tests::configured_task_fee_budget_respects_billability_and_alert_scope ... ok1167test server_fns::budget_tests::configured_person_budget_excludes_other_people_and_has_its_own_alert ... ok1168test seed::tests::late_seed_failure_rolls_back_all_demo_data has been running for over 60 seconds1169test server_fns::budget_tests::overview_budget_progress_includes_people_without_an_allowance ... ok1170test reports::streaming::database_tests::streamed_invoice_metadata_and_lines_share_one_snapshot ... ok1171test server_fns::budget_tests::overview_budget_progress_is_current_period_scoped_and_authorized ... ok1172test server_fns::clients::page_tests::default_rate_requires_the_global_billable_rate_grant ... ok1173test server_fns::budget_tests::overview_budget_progress_batches_projects_without_mixing_scopes ... ok1174test server_fns::clients::page_tests::legacy_workflow_readers_are_unchanged_under_policy_one ... ok1175test server_fns::clients::page_tests::foreign_missing_and_rebound_requests_fail_closed ... ok1176test seed::tests::late_seed_failure_rolls_back_all_demo_data ... ok1177test server_fns::clients::page_tests::policy_zero_keeps_legacy_catalog_billing_and_manager_affordance ... ok1178test server_fns::clients::page_tests::managed_project_counts_require_an_actual_management_link ... ok1179test server_fns::clients::page_tests::unrelated_grants_and_legacy_roles_do_not_open_the_catalog ... ok1180test server_fns::clients::page_tests::unavailable_permission_state_and_inactive_actors_fail_closed ... ok1181test server_fns::clients::page_tests::visible_default_rate_distinguishes_unset_from_zero ... ok1182test server_fns::clients::page_tests::readers_observe_revocation_after_waiting_for_current_authority ... ok1183test server_fns::clients::page_tests::project_counts_follow_the_policy_one_project_reader ... ok1184test server_fns::clients::page_tests::read_only_client_grant_shows_catalog_without_writes_rates_or_projects ... ok1185test server_fns::clients::tests::client_details_hide_foreign_missing_and_inactive_actor_records ... ok1186test server_fns::clients::tests::client_default_rate_allows_detail_edits_and_equivalent_currency ... ok1187test server_fns::clients::tests::both_activation_transitions_change_once_and_preserve_details ... ok1188test server_fns::clients::tests::client_invoices_hold_authority_until_the_read_finishes ... ok1189test server_fns::clients::tests::client_details_keep_catalog_identity_but_omit_member_billing ... ok1190test server_fns::clients::tests::client_default_rate_prevents_currency_relabelling ... ok1191test server_fns::clients::tests::client_invoices_reject_a_winning_concurrent_revocation ... ok1192test server_fns::clients::tests::client_details_distinguish_unset_zero_and_positive_manager_rates ... ok1193test server_fns::clients::tests::client_summaries_exclude_foreign_clients_and_unreadable_project_currencies ... ok1194test server_fns::clients::tests::client_summaries_reject_a_foreign_actor_even_when_client_org_is_known ... ok1195test server_fns::clients::tests::client_invoices_keep_exact_client_scope_statuses_and_currencies ... ok1196test server_fns::clients::tests::client_invoices_require_manager_authority_even_without_invoices ... ok1197test server_fns::clients::tests::currency_edit_rechecks_a_concurrently_added_client_default_rate ... ok1198test server_fns::clients::tests::concurrent_deletion_is_not_an_unchanged_mutation ... ok1199test server_fns::clients::tests::client_summaries_follow_existing_progress_visibility_and_revoke_inactive_users ... ok1200test server_fns::clients::tests::profile_create_persists_normalized_identity_and_exact_optional_rate ... ok1201test server_fns::clients::tests::each_field_changes_once_and_preserves_inactive_status ... ok1202test server_fns::clients::tests::client_summaries_keep_catalog_without_projects_and_count_archived_projects ... ok1203test server_fns::clients::tests::missing_and_foreign_clients_are_not_noops ... ok1204test server_fns::clients::tests::profile_saves_reject_invalid_input_without_partial_writes ... ok1205test server_fns::clients::tests::profile_noop_preserves_row_and_returns_no_update_event_signal ... ok1206test server_fns::clients::tests::profile_update_rejects_stale_rate_even_when_the_target_currency_is_unchanged ... ok1207test server_fns::clients::tests::profile_update_preserves_historical_rows_and_inactive_status ... ok1208test server_fns::clients::tests::profile_currency_change_without_a_rate_keeps_it_unset ... ok1209test server_fns::clients::tests::profile_update_rejects_stale_currency_even_when_the_rate_is_still_unset ... ok1210test server_fns::clients::tests::profile_update_rechecks_authority_after_waiting_for_a_concurrent_demotion ... ok1211test server_fns::clients::tests::profile_update_requires_explicit_rate_intent_for_currency_changes ... ok1212test server_fns::clients::tests::profile_update_rechecks_financial_snapshot_after_waiting_for_a_concurrent_edit ... ok1213test server_fns::importers::authorization_tests::cli_job_endpoints_have_stable_registered_paths ... ok1214test server_fns::clients::tests::profile_saves_recheck_manager_org_and_active_actor ... ok1215test server_fns::importers::authorization_tests::report_stress::large_report_streams_over_http_without_buffering_the_archive ... ignored, isolated Linux HTTP/memory stress; run with --release --exact --ignored --nocapture1216test server_fns::importers::authorization_tests::request_bound_import_endpoints_are_not_registered ... ok1217test server_fns::clients::tests::repeating_a_competing_deactivation_does_not_report_a_transition ... ok1218test server_fns::clients::tests::repeating_a_competing_edit_does_not_report_a_change ... ok1219test server_fns::clients::tests::unchanged_edit_preserves_the_row ... ok1220test server_fns::clients::tests::restoring_values_after_a_competing_edit_reports_a_change ... ok1221test server_fns::clients::tests::unchanged_activation_preserves_the_row ... ok1222test server_fns::clients::tests::restoring_a_competing_deactivation_reports_reactivation ... ok1223test server_fns::importers::authorization_tests::job_endpoints_enforce_session_role_and_organization has been running for over 60 seconds1224test server_fns::importers::commands::tests::authorized_job_lifecycle_and_duplicate_retention_work_with_one_connection has been running for over 60 seconds1225test server_fns::importers::commands::tests::authorized_submissions_do_not_wait_for_the_running_import_reservation has been running for over 60 seconds1226test server_fns::importers::commands::tests::commands_and_status_require_current_active_tenant_administrator has been running for over 60 seconds1227test server_fns::importers::commands::tests::conflicting_and_stale_commands_preserve_payload_policy_and_retained_state has been running for over 60 seconds1228test server_fns::importers::commands::tests::duplicate_submission_and_noop_cancellation_do_not_bypass_revocation has been running for over 60 seconds1229test server_fns::importers::commands::tests::failed_upload_insert_rolls_back_the_job_and_releases_authority has been running for over 60 seconds1230test server_fns::importers::commands::tests::foreign_and_missing_jobs_never_reveal_or_change_another_tenant has been running for over 60 seconds1231test server_fns::importers::authorization_tests::job_endpoints_enforce_session_role_and_organization ... ok1232test server_fns::importers::commands::tests::authorized_submissions_do_not_wait_for_the_running_import_reservation ... ok1233test server_fns::importers::commands::tests::import_commands_and_results_hold_actor_authority_until_commit ... ok1234test server_fns::importers::commands::tests::commands_and_status_require_current_active_tenant_administrator ... ok1235test server_fns::importers::commands::tests::requester::duplicates_and_job_lifecycle_never_replace_or_invent_the_original_requester ... ok1236test server_fns::importers::commands::tests::failed_upload_insert_rolls_back_the_job_and_releases_authority ... ok1237test server_fns::importers::commands::tests::authorized_job_lifecycle_and_duplicate_retention_work_with_one_connection ... FAILED1238test server_fns::importers::commands::tests::duplicate_submission_and_noop_cancellation_do_not_bypass_revocation ... ok1239test server_fns::importers::csv_upload::tests::csv_upload_extractor_preserves_raw_bytes ... ok1240test server_fns::importers::csv_upload::tests::csv_upload_requires_its_header_without_reading_the_body ... ok1241test server_fns::importers::tests::concurrent_api_import_returns_a_retryable_conflict ... ok1242test server_fns::importers::tests::csv_route_rejects_invalid_modes_and_headers_without_reading_uploads ... ok1243test server_fns::importers::tests::revoked_connection_authority_maps_to_forbidden_without_private_context ... ok1244test server_fns::importers::tests::submission_identity_rejects_expired_future_and_non_v7_keys ... ok1245test server_fns::importers::commands::tests::import_access_rechecks_revocation_after_organization_and_actor_waits has been running for over 60 seconds1246test server_fns::importers::commands::tests::requester::requester_migration_preserves_unknown_authors_in_all_job_states ... ok1247test server_fns::invoices::fee_tests::concurrent_invoices_claim_a_single_fee_once ... ok1248test server_fns::importers::commands::tests::requester::new_import_jobs_record_the_authorized_original_requester has been running for over 60 seconds1249test server_fns::importers::commands::tests::conflicting_and_stale_commands_preserve_payload_policy_and_retained_state ... ok1250test server_fns::importers::commands::tests::requester::original_requester_foreign_key_preserves_tenant_and_known_identity has been running for over 60 seconds1251test server_fns::invoices::fee_tests::draft_fee_edit_rejects_invalid_lines_and_current_unauthorized_actors ... ok1252test server_fns::invoices::fee_tests::draft_fee_edit_replaces_amount_and_preserves_source_and_retry_identity ... ok1253test server_fns::importers::commands::tests::requester::new_import_jobs_record_the_authorized_original_requester ... ok1254test server_fns::importers::commands::tests::requester::waiting_duplicate_keeps_the_first_committed_requester has been running for over 60 seconds1255test server_fns::invoices::fee_tests::concurrent_discounted_invoice_retries_return_one_invoice ... ok1256test server_fns::importers::commands::tests::requester::original_requester_foreign_key_preserves_tenant_and_known_identity ... ok1257test server_fns::invoices::fee_tests::fee_invoice_does_not_claim_hours_or_another_clients_fee ... ok1258test server_fns::importers::commands::tests::foreign_and_missing_jobs_never_reveal_or_change_another_tenant ... ok1259test server_fns::invoices::fee_tests::fee_occurrence_rejects_cross_organization_project ... ok1260test server_fns::invoices::fee_tests::discounted_fee_leaves_a_balance_and_void_releases_only_its_contribution has been running for over 60 seconds1261test server_fns::importers::commands::tests::import_access_rechecks_revocation_after_organization_and_actor_waits ... ok1262test server_fns::invoices::fee_tests::fee_total_overflow_rolls_back_occurrences_and_invoice ... ok1263test server_fns::invoices::fee_tests::fee_preview_discount_ties_follow_source_keys_not_display_dates ... ok1264test server_fns::invoices::fee_tests::invoice_line_sources_reject_mixed_sources_and_invented_fee_quantities ... ok1265test server_fns::invoices::fee_tests::draft_fee_edit_serializes_retries_and_rejects_stale_revisions ... ok1266test server_fns::importers::commands::tests::requester::waiting_duplicate_keeps_the_first_committed_requester ... ok1267test server_fns::invoices::fee_tests::invoice_preview_does_not_materialize_fees_and_preserves_released_snapshots ... ok1268test server_fns::invoices::fee_tests::milestones_include_unbilled_overdue_fees_but_not_future_fees ... ok1269test server_fns::invoices::fee_tests::monthly_fees_use_calendar_dates_and_skip_already_claimed_months ... ok1270test server_fns::invoices::fee_tests::fee_balance_migration_allocates_discount_without_rewriting_invoice_snapshots ... ok1271test server_fns::invoices::fee_tests::monthly_first_and_fifteenth_respect_partial_period_and_project_end ... ok1272test server_fns::invoices::fee_tests::invoice_status_rechecks_authority_after_waiting_for_the_invoice_lock ... ok1273test server_fns::invoices::fee_tests::draft_fee_edit_requires_current_balance_and_exact_excess_confirmation has been running for over 60 seconds1274test server_fns::invoices::fee_tests::prepared_fee_selection_rejects_invalid_values_and_empty_generation ... ok1275test server_fns::invoices::fee_tests::invoice_defaults_apply_to_selected_fees_without_claiming_other_projects ... ok1276test server_fns::invoices::fee_tests::project_fee_context_matches_invoice_balances_and_current_authority ... ok1277test server_fns::invoices::fee_tests::removing_discount_and_billing_the_remainder_cannot_both_succeed ... ok1278test server_fns::invoices::fee_tests::fee_preview_keeps_source_identity_and_reports_discounted_draft_balances has been running for over 60 seconds1279test server_fns::invoices::fee_tests::project_fee_context_keeps_monthly_balances_separate ... ok1280test server_fns::invoices::fee_tests::reviewed_generation_requires_exact_excess_and_current_authority ... ok1281test server_fns::invoices::fee_tests::mixed_time_and_fee_discount_conserves_cents_without_reopening_time has been running for over 60 seconds1282test server_fns::invoices::fee_tests::draft_fee_edit_requires_current_balance_and_exact_excess_confirmation ... ok1283test server_fns::invoices::fee_tests::single_fee_can_be_invoiced_without_time ... ok1284test server_fns::invoices::fee_tests::void_releases_fee_identity_without_rewriting_the_original_line ... ok1285test server_fns::invoices::fee_tests::mixed_time_and_fee_discount_conserves_cents_without_reopening_time ... ok1286test server_fns::invoices::preview::tests::excess_rejects_an_unrepresentable_total_even_when_the_remainder_fits ... ok1287test server_fns::invoices::preview::tests::unselected_fee_currencies_do_not_relabel_or_block_selected_charges ... ok1288test server_fns::invoices::fee_tests::discounted_fee_leaves_a_balance_and_void_releases_only_its_contribution ... ok1289test server_fns::invoices::snapshot_tests::editor::editor_snapshots_deny_winning_legacy_revocation ... ok1290test server_fns::invoices::snapshot_tests::editor::editor_snapshots_keep_invoice_metadata_revision_and_lines_together ... ok1291test server_fns::invoices::fee_tests::reviewed_generation_bills_partial_fees_and_rejects_stale_balances has been running for over 60 seconds1292test server_fns::invoices::fee_tests::reviewed_generation_does_not_materialize_unselected_months has been running for over 60 seconds1293test server_fns::invoices::fee_tests::settled_fee_sources_remain_reviewable_without_automatic_charges ... ok1294test server_fns::invoices::fee_tests::reviewed_generation_rejects_changed_time_before_claiming_it has been running for over 60 seconds1295test server_fns::invoices::fee_tests::fee_preview_keeps_source_identity_and_reports_discounted_draft_balances ... ok1296test server_fns::invoices::snapshot_tests::editor::editor_snapshots_refresh_after_organization_row_change_without_rebasing_edits ... ok1297test server_fns::invoices::snapshot_tests::races::financial_snapshots_deny_winning_actor_revocation_without_organization_change ... ok1298test server_fns::invoices::snapshot_tests::editor::editor_snapshots_retain_authority_and_release_cancelled_reads ... ok1299test server_fns::invoices::fee_tests::reviewed_generation_does_not_materialize_unselected_months ... ok1300test server_fns::invoices::fee_tests::zero_fee_is_invoiced_once_until_voided has been running for over 60 seconds1301test server_fns::invoices::fee_tests::zero_fee_is_invoiced_once_until_voided ... ok1302test server_fns::invoices::snapshot_tests::editor::editor_snapshots_preserve_rows_and_override_inherited_read_only has been running for over 60 seconds1303test server_fns::invoices::snapshot_tests::financial_snapshots_require_current_same_tenant_manager ... ok1304test server_fns::invoices::snapshot_tests::races::financial_snapshots_release_cancelled_reads_for_one_connection ... ok1305test server_fns::invoices::fee_tests::reviewed_generation_rejects_changed_time_before_claiming_it ... ok1306test server_fns::invoices::snapshot_tests::settings::financial_snapshots_retry_only_serialization_failures_and_stop_after_three ... ok1307test server_fns::invoices::snapshot_tests::settings::financial_snapshots_override_isolation_but_restore_connection_settings ... ok1308test server_fns::invoices::tests::assignment_gate_allows_inflight_invoice_organization_fks_to_finish ... ok1309test server_fns::invoices::snapshot_tests::settings::financial_snapshots_honor_stricter_lock_timeout_during_authorization ... ok1310test server_fns::invoices::snapshot_tests::races::financial_snapshots_hold_authority_until_materialization has been running for over 60 seconds1311test server_fns::invoices::snapshot_tests::races::financial_snapshots_keep_fee_values_from_their_initial_snapshot has been running for over 60 seconds1312test server_fns::invoices::tests::authority::invoice_generation_and_user_revocation_commit_in_gate_order ... ok1313test server_fns::invoices::snapshot_tests::races::financial_snapshots_keep_fee_values_from_their_initial_snapshot ... ok1314test server_fns::invoices::tests::authority::invoice_writers_override_readonly_defaults_without_changing_the_session ... ok1315test server_fns::invoices::fee_tests::reviewed_generation_bills_partial_fees_and_rejects_stale_balances ... ok1316test server_fns::invoices::snapshot_tests::races::financial_snapshots_retry_organization_row_change_and_refresh_amounts has been running for over 60 seconds1317test server_fns::invoices::tests::billing_cascade_agrees_across_all_four_levels_including_zero ... ok1318test server_fns::invoices::tests::configured_fixed_fee_hours_are_not_invoiced_but_legacy_fees_are_unchanged ... ok1319test server_fns::invoices::tests::configured_project_currency_and_cost_override_keep_their_denominations ... ok1320test server_fns::invoices::tests::effective_minutes_migration_preserves_historical_invoice_quantities ... ok1321test server_fns::invoices::snapshot_tests::editor::editor_snapshots_preserve_rows_and_override_inherited_read_only ... ok1322test server_fns::invoices::tests::effective_minutes_sql_matches_domain_rounding ... ok1323test server_fns::invoices::snapshot_tests::races::financial_snapshots_hold_authority_until_materialization ... ok1324test server_fns::invoices::tests::authority::invoice_edit_and_transition_observe_user_revocation_order ... ok1325test server_fns::invoices::tests::authority::cancelled_invoice_writers_roll_back_and_release_single_connection has been running for over 60 seconds1326test server_fns::invoices::tests::invoice_defaults_are_invoice_owned_and_only_drafts_are_editable ... ok1327test server_fns::invoices::tests::imported_rates::rejected_import_rate_does_not_poison_the_next_row_or_its_catalog_rate ... ok1328test server_fns::invoices::tests::imported_rates::imported_legacy_project_keeps_exact_rates_and_totals_on_retry ... ok1329test server_fns::invoices::tests::invoice_defaults_edit_rechecks_status_after_waiting_for_a_concurrent_send ... FAILED1330test server_fns::invoices::tests::invoice_defaults_validate_all_override_fields ... ok1331test server_fns::invoices::tests::invoice_line_overflow_leaves_time_unbilled ... ok1332test server_fns::invoices::tests::invoice_defaults_selection_rejects_unavailable_projects_before_claiming ... ok1333test server_fns::invoices::tests::imported_rates::imported_task_rates_require_matching_currency_only_for_new_configured_links has been running for over 60 seconds1334test server_fns::invoices::tests::invoice_defaults_conflict_rolls_back_all_claims ... ok1335test server_fns::invoices::tests::invoice_defaults_apply_exact_adjustments_and_payment_terms has been running for over 60 seconds1336test server_fns::invoices::tests::invoice_preview_keeps_time_rates_and_defaults_in_one_snapshot ... ok1337test server_fns::invoices::tests::imported_rates::imported_task_rates_require_matching_currency_only_for_new_configured_links ... ok1338test server_fns::invoices::tests::authority::cancelled_invoice_writers_roll_back_and_release_single_connection ... ok1339test server_fns::invoices::tests::invoice_total_overflow_leaves_all_time_unbilled ... ok1340test server_fns::invoices::tests::invoice_transitions_reject_invalid_states_and_foreign_organizations ... ok1341test server_fns::invoices::tests::invoice_defaults_apply_exact_adjustments_and_payment_terms ... ok1342test server_fns::invoices::tests::invoiced_amounts_survive_rate_changes_and_void_uses_current_rates ... ok1343test server_fns::invoices::tests::invoiced_billability_survives_later_project_changes ... ok1344test server_fns::invoices::tests::invoicing_leaves_running_time_open ... ok1345test server_fns::invoices::snapshot_tests::races::financial_snapshots_retry_organization_row_change_and_refresh_amounts ... ok1346test server_fns::invoices::tests::invoicing_uses_and_freezes_effective_minutes ... ok1347test server_fns::invoices::tests::large_invoice_and_reports_agree_without_intermediate_overflow ... ok1348test server_fns::invoices::tests::mixed_project_currencies_cannot_partially_create_an_invoice ... ok1349test server_fns::invoices::tests::only_running_time_does_not_create_an_invoice ... ok1350test server_fns::invoices::tests::non_billable_context_produces_no_unbilled_amount_on_any_report ... ok1351test server_fns::invoices::tests::invoice_preview_matches_generation_without_claiming_time ... ok1352test server_fns::invoices::tests::project_rate_is_used_by_invoices_reports_and_spend ... ok1353test server_fns::invoices::tests::invoice_defaults_legacy_insert_preserves_dates_and_exact_total has been running for over 60 seconds1354test server_fns::invoices::tests::void_waits_for_a_concurrent_payment_and_then_refuses ... ok1355test server_fns::invoices::tests::void_reopens_time_without_stale_rounding ... ok1356test server_fns::invoices::tests::selected_project_rate_modes_agree_across_billing_consumers ... ok1357test server_fns::invoices::tests::invoice_defaults_legacy_insert_preserves_dates_and_exact_total ... ok1358test server_fns::organization::tests::branding_rechecks_authority_after_the_organization_wait ... ok1359test server_fns::organization::tests::missing_organization_is_not_an_unchanged_update ... ok1360test server_fns::organization::tests::each_branding_field_changes_once_including_null_and_empty ... ok1361test server_fns::organization::tests::failed_branding_write_rolls_back_and_releases_authority ... ok1362test server_fns::organization::tests::unchanged_branding_preserves_the_row ... ok1363test server_fns::organization::tests::branding_requires_current_tenant_bound_authority_even_for_noops ... ok1364test server_fns::organization::tests::repeating_a_competing_branding_edit_does_not_report_a_change ... ok1365test server_fns::organization::tests::restoring_branding_after_a_competing_edit_reports_a_change ... ok1366test server_fns::invoices::tests::invoice_preview_rejects_large_results_instead_of_truncating_them ... ok1367test server_fns::permissions::audit_tests::audit_reader_overrides_transaction_defaults_without_changing_connection ... ok1368test server_fns::permissions::audit_tests::administrator_reads_historical_template_without_intent_or_replay_result ... ok1369test server_fns::invoices::tests::invoice_preview_requires_explicit_resolution_and_scopes_selected_projects has been running for over 60 seconds1370test server_fns::permissions::audit_tests::browsing::admitted_history_page_finishes_before_revocation_at_each_gate ... ok1371test server_fns::organization::tests::branding_holds_actor_authority_until_its_write_commits ... ok1372test server_fns::permissions::audit_tests::audit_reader_holds_requester_until_materialization_finishes ... ok1373test server_fns::invoices::tests::invoice_preview_requires_explicit_resolution_and_scopes_selected_projects ... ok1374test server_fns::organization::tests::branding_rechecks_authority_after_an_actor_only_wait has been running for over 60 seconds1375test server_fns::permissions::audit_tests::browsing::history_pages_scope_before_limit_and_use_stable_exclusive_timestamp_id_bounds ... ok1376test server_fns::permissions::audit_tests::browsing::history_page_reauthorizes_empty_and_continuation_requests_and_binds_requester ... ok1377test server_fns::permissions::audit_tests::browsing::cancelling_history_page_releases_both_authority_gates ... ok1378test server_fns::permissions::audit_tests::audit_timeout_preserves_stricter_limits_and_releases_locks has been running for over 60 seconds1379test server_fns::permissions::audit_tests::browsing::history_page_rejects_malformed_history_without_partial_success ... ok1380test server_fns::permissions::audit_tests::historical_decoder_distinguishes_missing_change_from_explicit_noop ... ok1381test server_fns::permissions::audit_tests::historical_decoder_rejects_missing_template_snapshots_and_invalid_grants ... ok1382test server_fns::permissions::audit_tests::historical_decoder_rejects_unknown_mixed_fields_and_invalid_revision_steps ... ok1383test server_fns::permissions::audit_tests::historical_person_snapshot_validates_provenance_without_inferring_admin_identity ... ok1384test server_fns::permissions::audit_tests::current_administrator_reads_inactive_authors_history_without_live_state ... ok1385test server_fns::permissions::audit_tests::direct_deactivation_winning_user_lock_denies_audit_read ... ok1386test server_fns::permissions::audit_tests::browsing::history_page_waits_for_revocation_commit_or_rollback_at_each_gate has been running for over 60 seconds1387test server_fns::permissions::audit_tests::legacy_admin_and_all_grants_without_explicit_identity_cannot_read_audit ... ok1388test server_fns::permissions::audit_tests::audit_timeout_preserves_stricter_limits_and_releases_locks ... ok1389test server_fns::permissions::audit_tests::cancelled_audit_read_releases_both_gates_and_single_connection ... ok1390test server_fns::permissions::audit_tests::browsing::history_page_waits_for_revocation_commit_or_rollback_at_each_gate ... ok1391test server_fns::permissions::audit_tests::reader_winning_gate_finishes_before_revocation_and_later_reads_fail ... ok1392test server_fns::organization::tests::branding_rechecks_authority_after_an_actor_only_wait ... ok1393test server_fns::permissions::audit_tests::failed_mutation_has_no_success_audit_and_reads_do_not_write has been running for over 60 seconds1394test server_fns::permissions::own_tests::own_permissions_deny_invalid_identity_policy_and_state ... ok1395test server_fns::permissions::audit_tests::revocation_winning_gate_denies_waiting_historical_reader ... ok1396test server_fns::permissions::audit_tests::operator_attribution_is_not_a_user_and_excludes_private_replay_payload has been running for over 60 seconds1397test server_fns::permissions::audit_tests::tenant_activity_and_policy_checks_precede_receipt_existence_and_decode ... ok1398test server_fns::permissions::own_tests::own_permissions_preserve_exact_grants_and_independent_identity ... ok1399test server_fns::permissions::audit_tests::operator_attribution_is_not_a_user_and_excludes_private_replay_payload ... ok1400test server_fns::permissions::audit_tests::profile_and_project_history_decode_exact_changes_and_noops has been running for over 60 seconds1401test server_fns::permissions::audit_tests::profile_history_keeps_removed_relationships_after_grants_change_again has been running for over 60 seconds1402test server_fns::permissions::audit_tests::template_detachment_history_preserves_exact_grants_and_provenance has been running for over 60 seconds1403test server_fns::permissions::audit_tests::profile_history_keeps_removed_relationships_after_grants_change_again ... ok1404test server_fns::permissions::own_tests::own_permissions_wait_for_current_actor_deactivation ... ok1405test server_fns::permissions::own_tests::own_permissions_scope_is_sorted_and_excludes_membership_and_other_managers ... ok1406test server_fns::permissions::own_tests::own_permissions_legacy_mode_never_discloses_staging has been running for over 60 seconds1407test server_fns::permissions::own_tests::own_permissions_reload_after_winning_gate_under_repeatable_read_defaults ... ok1408test server_fns::permissions::own_tests::own_permissions_reader_retains_actor_activity_until_snapshot_is_loaded has been running for over 60 seconds1409test server_fns::permissions::audit_tests::profile_and_project_history_decode_exact_changes_and_noops ... ok1410test server_fns::permissions::own_tests::own_permissions_reader_retains_actor_activity_until_snapshot_is_loaded ... ok1411test server_fns::permissions::preflight_tests::preflight_rechecks_revocation_after_organization_and_actor_waits ... ok1412test server_fns::permissions::audit_tests::failed_mutation_has_no_success_audit_and_reads_do_not_write ... ok1413test server_fns::permissions::preflight_tests::preflight_lock_failure_releases_organization_without_mutating_data ... ok1414test server_fns::permissions::preflight_tests::preflight_cancellation_releases_organization_and_single_connection ... ok1415test server_fns::permissions::preflight_tests::preflight_counts_cross_tenant_memberships_from_both_ends ... ok1416test server_fns::permissions::audit_tests::template_detachment_history_preserves_exact_grants_and_provenance ... ok1417test server_fns::permissions::preflight_tests::preflight_approval_diagnostics_preserve_stored_history has been running for over 60 seconds1418test server_fns::permissions::preflight_tests::preflight_requires_current_legacy_administrator_not_staged_grants ... ok1419test server_fns::permissions::profile_tests::audit_failure_rolls_back_profile_and_both_relationship_sets ... ok1420test server_fns::permissions::preflight_tests::preflight_separates_unknown_import_requesters_without_changing_artifacts ... ok1421test server_fns::permissions::profile_tests::concurrent_self_demotions_leave_one_active_explicit_administrator ... ok1422test server_fns::permissions::own_tests::own_permissions_legacy_mode_never_discloses_staging ... ok1423test server_fns::permissions::profile_tests::directory_tests::directory_cancellation_releases_connection_and_preserves_pool_defaults ... ok1424test server_fns::permissions::preflight_tests::preflight_approval_diagnostics_preserve_stored_history ... ok1425test server_fns::permissions::profile_tests::adjusted_template_reset_and_replay_after_deletion_use_explicit_intent has been running for over 60 seconds1426test server_fns::permissions::profile_tests::all_grant_template_cannot_confer_identity_and_cross_command_keys_conflict has been running for over 60 seconds1427test server_fns::permissions::profile_tests::canonical_actor_policy_tenant_and_target_checks_precede_mutation ... ok1428test server_fns::permissions::profile_tests::directory_tests::directory_denies_legacy_foreign_inactive_and_invalid_authority_even_for_empty_pages ... ok1429test server_fns::permissions::profile_tests::cancelled_profile_save_rolls_back_effects_and_releases_single_connection has been running for over 60 seconds1430test server_fns::permissions::profile_tests::cancelled_profile_save_rolls_back_effects_and_releases_single_connection ... ok1431test server_fns::permissions::profile_tests::editor_tests::editor_denies_wrong_authority_policy_and_foreign_targets ... ok1432test server_fns::permissions::profile_tests::directory_tests::directory_orders_by_name_then_id_and_accepts_deleted_cursor_without_extra_page ... ok1433test server_fns::permissions::profile_tests::directory_tests::directory_does_not_use_project_management_and_rechecks_relationship_removal has been running for over 60 seconds1434test server_fns::permissions::profile_tests::directory_tests::directory_rechecks_grant_revocation_and_direct_deactivation_after_wait ... ok1435test server_fns::permissions::profile_tests::adjusted_template_reset_and_replay_after_deletion_use_explicit_intent ... ok1436test server_fns::permissions::profile_tests::directory_tests::directory_scopes_before_activity_pagination_and_only_returns_basic_identity has been running for over 60 seconds1437test server_fns::permissions::profile_tests::editor_tests::editor_direct_actor_deactivation_wins_preview_and_load ... ok1438test server_fns::permissions::profile_tests::directory_tests::directory_uses_each_profiles_people_grants_not_legacy_role_or_other_scope has been running for over 60 seconds1439test server_fns::permissions::profile_tests::editor_tests::editor_noop_and_last_admin_proposals_are_truthful ... ok1440test server_fns::permissions::profile_tests::editor_tests::editor_preview_matches_saved_effects_without_writing ... ok1441test server_fns::permissions::profile_tests::directory_tests::directory_scopes_before_activity_pagination_and_only_returns_basic_identity ... ok1442test server_fns::permissions::profile_tests::editor_tests::editor_loss_names_cover_only_current_outgoing_effects has been running for over 60 seconds1443test server_fns::permissions::profile_tests::editor_tests::template_deletion_preview_preserves_people_and_fences_its_affected_set ... ok1444test server_fns::permissions::profile_tests::explicit_identity_changes_and_inactive_targets_do_not_change_activation ... ok1445test server_fns::permissions::profile_tests::invalid_confirmations_and_noncanonical_grants_are_not_silently_repaired ... ok1446test server_fns::permissions::profile_tests::all_grant_template_cannot_confer_identity_and_cross_command_keys_conflict ... ok1447test server_fns::permissions::profile_tests::editor_tests::every_builtin_preview_matches_its_actual_save has been running for over 60 seconds1448test server_fns::permissions::profile_tests::directory_tests::directory_does_not_use_project_management_and_rechecks_relationship_removal ... ok1449test server_fns::permissions::profile_tests::malformed_person_or_remaining_administrator_state_fails_closed ... ok1450test server_fns::permissions::profile_tests::profile_command_overrides_readonly_defaults_locally ... ok1451test server_fns::permissions::profile_tests::directory_tests::directory_uses_each_profiles_people_grants_not_legacy_role_or_other_scope ... ok1452test server_fns::permissions::profile_tests::management_schema_rejects_foreign_parents_self_links_and_duplicate_pairs ... ok1453test server_fns::permissions::profile_tests::editor_tests::editor_loss_names_cover_only_current_outgoing_effects ... ok1454test server_fns::permissions::profile_tests::existing_user_share_lock_does_not_block_profile_command has been running for over 60 seconds1455test server_fns::permissions::profile_tests::profile_command_rechecks_target_activation_before_demotion ... ok1456test server_fns::permissions::profile_tests::profile_command_retains_target_activity_through_receipt_insert ... ok1457test server_fns::permissions::profile_tests::editor_tests::every_builtin_preview_matches_its_actual_save ... ok1458test server_fns::permissions::profile_tests::explicit_application_and_adjustments_preserve_confirmed_grants has been running for over 60 seconds1459test server_fns::permissions::profile_tests::project_people_tests::project_people_accepts_unconfigured_targets_and_exact_page_without_more ... ok1460test server_fns::permissions::profile_tests::explicit_application_and_adjustments_preserve_confirmed_grants ... ok1461test server_fns::permissions::profile_tests::profile_command_rechecks_remaining_administrator_after_deactivation_wait ... ok1462test server_fns::permissions::profile_tests::profile_demotion_retains_surviving_administrator_until_commit ... ok1463test server_fns::permissions::profile_tests::last_active_administrator_cannot_be_demoted_or_replaced_by_equivalent_grants has been running for over 60 seconds1464test server_fns::permissions::profile_tests::existing_user_share_lock_does_not_block_profile_command ... ok1465test server_fns::permissions::profile_tests::project_people_tests::project_people_holds_authority_until_read_finishes ... ok1466test server_fns::permissions::profile_tests::project_people_tests::project_people_cancellation_releases_connection_and_preserves_pool_defaults ... ok1467test server_fns::permissions::profile_tests::project_people_tests::project_people_filters_before_paging_and_resolves_outside_the_search ... ok1468test server_fns::permissions::profile_tests::read_only_retention_and_explicit_keep_project_access_preserve_independent_person_losses ... ok1469test server_fns::permissions::profile_tests::profile_command_waits_for_direct_actor_deactivation_even_on_replay ... ok1470test server_fns::permissions::profile_tests::project_people_tests::project_people_authorizes_the_operation_not_the_directory_or_legacy_role has been running for over 60 seconds1471test server_fns::permissions::profile_tests::project_people_tests::project_people_denies_invalid_authority_even_for_empty_resolution ... ok1472test server_fns::permissions::profile_tests::project_people_tests::project_people_authorizes_the_operation_not_the_directory_or_legacy_role ... ok1473test server_fns::permissions::profile_tests::project_people_tests::project_people_rechecks_designation_after_waiting_for_revocation ... ok1474test server_fns::permissions::profile_tests::simultaneous_losses_require_exact_confirmation_preserve_history_and_never_restore_links ... ok1475test server_fns::permissions::profile_tests::last_active_administrator_cannot_be_demoted_or_replaced_by_equivalent_grants ... ok1476test server_fns::permissions::profile_tests::project_people_tests::project_people_rechecks_grants_and_direct_deactivation_after_wait ... ok1477test server_fns::permissions::profile_tests::stale_template_and_org_revision_and_exhausted_revisions_roll_back ... ok1478test server_fns::permissions::profile_tests::project_people_tests::project_people_validates_bounded_input_only_after_authorization has been running for over 60 seconds1479test server_fns::permissions::profile_tests::reduced_administrator_and_stale_person_proposals_are_rejected ... ok1480test server_fns::permissions::profile_tests::revocation_winning_gate_denies_new_and_replayed_changes ... ok1481test server_fns::permissions::profile_tests::subjects_tests::subject_cursor_is_only_a_bound_and_exact_page_has_no_continuation ... ok1482test server_fns::permissions::profile_tests::recreated_relationship_invalidates_waiting_confirmation_without_partial_removal has been running for over 60 seconds1483test server_fns::permissions::profile_tests::time_entries_tests::time_reads_cancel_without_leaking_locks_or_changing_pool_defaults ... ok1484test server_fns::permissions::profile_tests::project_people_tests::project_people_validates_bounded_input_only_after_authorization ... ok1485test server_fns::permissions::profile_tests::time_entries_tests::time_reads_distinguish_project_management_from_membership_and_people_scope ... ok1486test server_fns::permissions::profile_tests::subjects_tests::subject_discovery_cancellation_releases_connection_and_preserves_pool_defaults has been running for over 60 seconds1487test server_fns::permissions::profile_tests::subjects_tests::subject_discovery_rechecks_direct_deactivation has been running for over 60 seconds1488test server_fns::permissions::profile_tests::recreated_relationship_invalidates_waiting_confirmation_without_partial_removal ... ok1489test server_fns::permissions::profile_tests::subjects_tests::subject_discovery_rechecks_revocation_after_gate_wait_and_between_pages has been running for over 60 seconds1490test server_fns::permissions::profile_tests::subjects_tests::subject_discovery_requires_current_explicit_identity_and_supported_policy has been running for over 60 seconds1491test server_fns::permissions::profile_tests::subjects_tests::subject_discovery_rechecks_direct_deactivation ... ok1492test server_fns::permissions::profile_tests::subjects_tests::subject_pages_preserve_all_local_identities_with_only_display_fields has been running for over 60 seconds1493test server_fns::permissions::profile_tests::subjects_tests::subject_discovery_cancellation_releases_connection_and_preserves_pool_defaults ... ok1494test server_fns::permissions::profile_tests::time_entries_tests::time_reads_exclude_foreign_parents_but_preserve_archived_history has been running for over 60 seconds1495test server_fns::permissions::profile_tests::subjects_tests::subject_discovery_requires_current_explicit_identity_and_supported_policy ... ok1496test server_fns::permissions::profile_tests::time_entries_tests::time_reads_fail_closed_for_policy_identity_and_invalid_state has been running for over 60 seconds1497test server_fns::permissions::profile_tests::time_entries_tests::time_reads_recheck_grants_relationships_and_activity_after_wait ... ok1498test server_fns::permissions::profile_tests::subjects_tests::subject_discovery_rechecks_revocation_after_gate_wait_and_between_pages ... ok1499test server_fns::permissions::profile_tests::time_entries_tests::time_reads_finish_before_competing_revocation_when_read_admitted_first has been running for over 60 seconds1500test server_fns::permissions::profile_tests::time_entries_tests::time_reads_page_ties_without_loss_and_filters_never_expand_scope ... ok1501test server_fns::permissions::profile_tests::time_entries_tests::time_reads_finish_before_competing_revocation_when_read_admitted_first ... ok1502test server_fns::permissions::profile_tests::time_entries_tests::time_reads_use_effective_profile_scope_and_union_without_duplicates has been running for over 60 seconds1503test server_fns::permissions::profile_tests::time_report_groups_tests::active_projects_only_narrows_every_grouping_before_totals has been running for over 60 seconds1504test server_fns::permissions::profile_tests::time_entries_tests::time_reads_use_effective_profile_scope_and_union_without_duplicates ... ok1505test server_fns::permissions::profile_tests::subjects_tests::subject_pages_preserve_all_local_identities_with_only_display_fields ... ok1506test server_fns::permissions::profile_tests::time_report_groups_tests::billability_narrows_every_grouping_before_totals_and_cursor has been running for over 60 seconds1507test server_fns::permissions::profile_tests::time_report_groups_tests::grouped_reports_apply_scope_union_before_every_group has been running for over 60 seconds1508test server_fns::permissions::profile_tests::time_report_groups_tests::grouped_reports_keep_duplicate_names_distinct_across_pages ... ok1509test server_fns::permissions::profile_tests::time_report_groups_tests::grouped_reports_filter_before_aggregation_and_keep_empty_totals has been running for over 60 seconds1510test server_fns::permissions::profile_tests::time_report_groups_tests::active_projects_only_narrows_every_grouping_before_totals ... ok1511test server_fns::permissions::profile_tests::time_report_groups_tests::grouped_reports_keep_history_but_exclude_foreign_parent_records has been running for over 60 seconds1512test server_fns::permissions::profile_tests::time_entries_tests::time_reads_fail_closed_for_policy_identity_and_invalid_state ... ok1513test server_fns::permissions::profile_tests::time_report_groups_tests::grouped_reports_apply_scope_union_before_every_group ... ok1514test server_fns::permissions::profile_tests::time_report_groups_tests::billability_narrows_every_grouping_before_totals_and_cursor ... ok1515test server_fns::permissions::profile_tests::time_entries_tests::time_reads_exclude_foreign_parents_but_preserve_archived_history ... ok1516test server_fns::permissions::profile_tests::time_report_groups_tests::grouped_reports_observe_revocation_after_wait_and_release_on_cancel has been running for over 60 seconds1517test server_fns::permissions::profile_tests::time_report_groups_tests::grouped_reports_observe_revocation_after_wait_and_release_on_cancel ... ok1518test server_fns::permissions::profile_tests::time_report_groups_tests::grouped_reports_preserve_dimensions_own_scope_and_rounding has been running for over 60 seconds1519test server_fns::permissions::profile_tests::time_report_groups_tests::grouped_reports_preserve_dimensions_own_scope_and_rounding ... ok1520test server_fns::permissions::profile_tests::time_report_groups_tests::grouped_reports_keep_history_but_exclude_foreign_parent_records ... ok1521test server_fns::permissions::profile_tests::time_report_groups_tests::grouped_reports_recheck_actor_deactivation_after_wait has been running for over 60 seconds1522test server_fns::permissions::profile_tests::time_report_groups_tests::grouped_reports_use_the_same_c_order_for_labels_and_cursor ... ok1523test server_fns::permissions::profile_tests::time_report_groups_tests::grouped_reports_reject_wrong_requesters_cursors_and_policy has been running for over 60 seconds1524test server_fns::permissions::profile_tests::time_report_groups_tests::grouped_reports_reject_wrong_requesters_cursors_and_policy ... ok1525test server_fns::permissions::profile_tests::time_report_groups_tests::grouped_reports_round_each_entry_before_summing_a_group has been running for over 60 seconds1526test server_fns::permissions::profile_tests::time_reports_tests::active_projects_only_narrows_detailed_rows_and_period_totals ... ok1527test server_fns::permissions::profile_tests::time_report_groups_tests::grouped_reports_sum_frozen_minutes_beyond_integer_column_range has been running for over 60 seconds1528test server_fns::permissions::profile_tests::time_report_groups_tests::grouped_reports_round_each_entry_before_summing_a_group ... ok1529test server_fns::permissions::profile_tests::time_report_groups_tests::grouped_reports_filter_before_aggregation_and_keep_empty_totals ... ok1530test server_fns::permissions::profile_tests::time_reports_tests::detailed_report_keyset_exhausts_ties_without_repeating_rows ... ok1531test server_fns::permissions::profile_tests::time_reports_tests::detailed_report_observes_revocation_after_wait_and_releases_on_cancel ... ok1532test server_fns::permissions::profile_tests::time_reports_tests::detailed_report_profiles_and_custom_scope_union_do_not_duplicate_rows ... ok1533test server_fns::permissions::profile_tests::time_reports_tests::detailed_report_billability_preserves_billed_status_and_frozen_minutes_after_configuration_changes has been running for over 60 seconds1534test server_fns::permissions::profile_tests::time_reports_tests::detailed_report_excludes_malformed_tenant_parents has been running for over 60 seconds1535test server_fns::permissions::profile_tests::time_reports_tests::detailed_report_excludes_malformed_tenant_parents ... ok1536test server_fns::permissions::profile_tests::time_report_groups_tests::grouped_reports_recheck_actor_deactivation_after_wait ... ok1537test server_fns::permissions::profile_tests::time_reports_tests::detailed_report_rechecks_direct_actor_deactivation_after_wait ... ok1538test server_fns::permissions::profile_tests::time_reports_tests::detailed_report_uses_own_scope_without_directory_or_financial_grants ... ok1539test server_fns::permissions::profile_tests::time_reports_tests::detailed_report_filters_are_any_within_and_between_dimensions has been running for over 60 seconds1540test server_fns::permissions::profile_tests::time_reports_tests::detailed_report_keeps_archived_history_and_report_rounding has been running for over 60 seconds1541test server_fns::permissions::profile_tests::time_reports_tests::detailed_report_totals_round_each_entry_before_summing_billable_time ... ok1542test server_fns::permissions::profile_tests::time_reports_tests::detailed_report_keeps_archived_history_and_report_rounding ... ok1543test server_fns::permissions::profile_tests::time_reports_tests::detailed_report_rejects_invalid_queries_requesters_and_policy_without_fallback ... ok1544test server_fns::permissions::profile_tests::timesheet_context_tests::sheet_rechecks_selected_activity_after_waiting_for_archive ... ok1545test server_fns::permissions::profile_tests::timesheet_context_tests::sheet_holds_selected_activity_through_entry_delivery_and_releases_on_cancel ... ok1546test server_fns::permissions::profile_tests::timesheet_context_tests::sheet_rejects_changed_requester_or_policy_and_inaccessible_subject ... ok1547test server_fns::permissions::profile_tests::timesheet_context_tests::sheet_exhausts_pages_and_does_not_reuse_scope_or_silently_change_policy ... ok1548test server_fns::permissions::profile_tests::time_report_groups_tests::grouped_reports_sum_frozen_minutes_beyond_integer_column_range ... ok1549test server_fns::permissions::profile_tests::time_reports_tests::detailed_report_totals_use_bigint_and_count_zero_duration_entries has been running for over 60 seconds1550test server_fns::permissions::profile_tests::time_reports_tests::detailed_report_filters_are_any_within_and_between_dimensions ... ok1551test server_fns::permissions::profile_tests::timesheet_context_tests::sheet_selects_empty_managed_participant_without_widening_record_scope ... ok1552test server_fns::permissions::profile_tests::timesheet_people_tests::discovery_fails_closed_for_policy_identity_and_invalid_state ... ok1553test server_fns::permissions::profile_tests::timesheet_people_tests::discovery_rechecks_revocation_and_actor_activity_after_waiting ... ok1554test server_fns::permissions::profile_tests::timesheet_people_tests::history_keeps_archived_context_but_excludes_inactive_people_and_foreign_parents ... ok1555test server_fns::permissions::profile_tests::timesheet_context_tests::sheet_resolves_legacy_own_context_without_canonical_state has been running for over 60 seconds1556test server_fns::permissions::profile_tests::timesheet_people_tests::candidates_include_empty_project_members_and_retained_history_without_directory_access ... ok1557test server_fns::permissions::profile_tests::timesheet_people_tests::admitted_discovery_finishes_before_competing_revocation has been running for over 60 seconds1558test server_fns::permissions::profile_tests::time_reports_tests::detailed_report_billability_preserves_billed_status_and_frozen_minutes_after_configuration_changes ... ok1559test server_fns::permissions::profile_tests::timesheet_people_tests::paging_search_and_identity_filters_only_narrow_current_scope ... ok1560test server_fns::permissions::profile_tests::timesheet_people_tests::admitted_discovery_finishes_before_competing_revocation ... ok1561test server_fns::permissions::profile_tests::timesheet_people_tests::cancellation_releases_discovery_locks_and_keeps_pool_defaults has been running for over 60 seconds1562test server_fns::permissions::profile_tests::unchanged_and_unrelated_edits_do_not_clean_up_preexisting_incompatible_links ... ok1563test server_fns::permissions::profile_tests::unchanged_edit_preserves_identity_source_timestamp_and_revisions ... ok1564test server_fns::permissions::project_management_tests::cancelled_project_delegation_rolls_back_and_releases_single_connection ... ok1565test server_fns::permissions::profile_tests::time_reports_tests::detailed_report_totals_use_bigint_and_count_zero_duration_entries ... ok1566test server_fns::permissions::profile_tests::timesheet_people_tests::profiles_and_custom_grants_use_time_scope_not_legacy_role_or_directory ... ok1567test server_fns::permissions::project_management_tests::concurrent_replacements_commit_only_one_current_revision ... ok1568test server_fns::permissions::project_management_tests::foreign_missing_inactive_and_malformed_additions_fail_without_disclosure ... ok1569test server_fns::permissions::project_management_tests::designation_is_required_before_managed_editor_can_delegate ... ok1570test server_fns::permissions::project_management_tests::audit_failure_rolls_back_removal_addition_and_revision ... ok1571test server_fns::permissions::project_management_tests::managed_scope_never_uses_another_project_or_legacy_membership ... ok1572test server_fns::permissions::profile_tests::timesheet_people_tests::cancellation_releases_discovery_locks_and_keeps_pool_defaults ... ok1573test server_fns::permissions::project_management_tests::actual_template_command_receipt_cannot_be_reused_for_project_delegation has been running for over 60 seconds1574test server_fns::permissions::project_management_tests::actual_template_command_receipt_cannot_be_reused_for_project_delegation ... ok1575test server_fns::permissions::project_management_tests::project_delegation_denies_actor_deactivated_before_check ... ok1576test server_fns::permissions::project_management_tests::historical_replay_does_not_reapply_removed_or_now_ineligible_designations ... ok1577test server_fns::permissions::profile_tests::timesheet_context_tests::sheet_resolves_legacy_own_context_without_canonical_state ... ok1578test server_fns::permissions::project_management_tests::canonical_actor_grants_activity_tenant_and_policy_are_required has been running for over 60 seconds1579test server_fns::permissions::project_management_tests::mixed_invalid_addition_preserves_entire_previous_set ... ok1580test server_fns::permissions::project_management_tests::project_delegation_denies_manager_deactivated_before_check ... ok1581test server_fns::permissions::project_management_tests::project_delegation_retains_added_manager_activity_until_commit ... ok1582test server_fns::permissions::project_management_tests::project_delegation_retains_actor_activity_until_commit ... ok1583test server_fns::permissions::project_management_tests::reader_tests::manager_reader_holds_authority_and_cancellation_releases_it ... ok1584test server_fns::permissions::project_management_tests::reader_tests::manager_reader_materializes_before_a_waiting_actor_deactivation ... ok1585test server_fns::permissions::project_management_tests::legacy_project_lock_returns_busy_instead_of_forming_an_org_fk_cycle has been running for over 60 seconds1586test server_fns::permissions::project_management_tests::legacy_user_share_locks_allow_manager_and_receipt_foreign_keys has been running for over 60 seconds1587test server_fns::permissions::project_management_tests::reader_tests::manager_reader_preserves_the_complete_retained_set_without_private_fields ... ok1588test server_fns::permissions::project_management_tests::reader_tests::manager_reader_observes_direct_deactivation_before_its_actor_lock ... ok1589test server_fns::permissions::project_management_tests::legacy_user_share_locks_allow_manager_and_receipt_foreign_keys ... ok1590test server_fns::permissions::project_management_tests::reader_tests::manager_reader_requires_current_project_edit_scope_not_identity_or_membership ... ok1591test server_fns::permissions::project_management_tests::project_delegation_overrides_readonly_defaults_locally has been running for over 60 seconds1592test server_fns::permissions::project_management_tests::legacy_project_lock_returns_busy_instead_of_forming_an_org_fk_cycle ... ok1593test server_fns::permissions::project_management_tests::revocation_winning_gate_denies_waiting_delegation ... ok1594test server_fns::permissions::project_management_tests::stale_duplicate_and_exhausted_revisions_never_replace_the_set ... ok1595test server_fns::permissions::project_management_tests::project_editor_delegates_existing_read_grants_without_promotion has been running for over 60 seconds1596test server_fns::permissions::project_management_tests::retained_ineligible_managers_and_archived_projects_allow_noop_and_removal ... ok1597test server_fns::permissions::project_management_tests::canonical_actor_grants_activity_tenant_and_policy_are_required ... ok1598test server_fns::permissions::project_management_tests::transaction_tests::project_and_manager_changes_commit_with_the_same_receipt ... ok1599test server_fns::permissions::storage_tests::additive_migration_preserves_populated_legacy_records ... ok1600test server_fns::permissions::project_management_tests::reader_tests::manager_reader_rechecks_revocation_after_the_organization_wait ... ok1601test server_fns::permissions::project_management_tests::replacement_audits_exact_delta_and_preserves_membership_history_and_other_scopes ... ok1602test server_fns::permissions::project_management_tests::project_delegation_overrides_readonly_defaults_locally ... ok1603test server_fns::permissions::storage_tests::concurrent_equivalent_names_create_only_one_template ... ok1604test server_fns::permissions::project_management_tests::project_editor_delegates_existing_read_grants_without_promotion ... ok1605test server_fns::permissions::storage_tests::person_state_rejects_duplicates_and_foreign_users_and_templates ... ok1606test server_fns::permissions::project_management_tests::transaction_tests::delegation_reuses_editor_gate_without_upgrading_past_foreign_keys ... ok1607test server_fns::permissions::storage_tests::storage_does_not_activate_or_infer_legacy_roles ... ok1608test server_fns::permissions::storage_tests::template_names_are_case_insensitive_and_tenant_local ... ok1609test server_fns::permissions::project_management_tests::receipt_conflicts_precede_decoding_and_replay_requires_current_authority has been running for over 60 seconds1610test server_fns::permissions::storage_tests::person_grants_and_identity_round_trip_independently_of_source ... ok1611test server_fns::permissions::storage_tests::referenced_template_deletion_requires_detaching_without_grant_or_identity_loss ... ok1612test server_fns::permissions::project_management_tests::transaction_tests::project_rollback_discards_managers_revision_and_receipt ... ok1613test server_fns::permissions::project_management_tests::receipt_conflicts_precede_decoding_and_replay_requires_current_authority ... ok1614test server_fns::permissions::template_tests::command_receipts_are_not_shared_between_administrators ... ok1615test server_fns::permissions::template_tests::concurrent_creators_never_exceed_fifty_profiles ... ok1616test server_fns::permissions::storage_tests::malformed_stored_grants_fail_without_repair ... ok1617test server_fns::permissions::storage_tests::source_shape_and_revision_constraints_reject_invalid_rows ... ok1618test server_fns::permissions::template_tests::delete_replay_does_not_touch_a_same_name_replacement ... ok1619test server_fns::permissions::storage_tests::unicode_name_migration_preserves_existing_templates ... ok1620test server_fns::permissions::template_tests::concurrent_exact_retry_creates_one_receipt_without_changing_people ... ok1621test server_fns::permissions::template_tests::create_canonical_retry_returns_one_historical_change ... ok1622test server_fns::permissions::template_tests::delete_preserves_adjusted_grants_identity_and_business_rows ... ok1623test server_fns::permissions::storage_tests::unicode_name_collision_rolls_back_migration_without_changing_profiles has been running for over 60 seconds1624test server_fns::permissions::template_tests::malformed_assignee_aborts_all_detachments ... ok1625test server_fns::permissions::template_tests::equivalent_names_and_invalid_confirmed_selections_roll_back ... ok1626test server_fns::permissions::template_tests::actor_share_lock_does_not_block_template_command has been running for over 60 seconds1627test server_fns::permissions::template_tests::revocation_winning_org_gate_denies_pending_replay_and_new_command ... ok1628test server_fns::permissions::template_tests::stale_foreign_and_exhausted_revisions_never_partially_delete ... ok1629test server_fns::permissions::template_tests::template_command_overrides_readonly_defaults_and_keeps_stricter_timeouts ... ok1630test server_fns::permissions::template_tests::unknown_grants_and_authority_fields_cannot_deserialize_as_commands ... ok1631test server_fns::permissions::template_tests::legacy_future_missing_foreign_and_non_admin_authority_deny ... ok1632test server_fns::permissions::template_tests::failed_audit_insert_rolls_back_creation_and_detachment ... ok1633test server_fns::project_creation::assignment_tests::finalization_reuses_catalog_and_keeps_lead_overrides_local_on_retry ... ok1634test server_fns::project_creation::assignment_tests::invalid_assignment_graphs_leave_no_partial_creation_or_draft_change ... ok1635test server_fns::permissions::storage_tests::unicode_name_collision_rolls_back_migration_without_changing_profiles ... ok1636test server_fns::permissions::template_tests::invalid_stored_authority_and_template_grants_fail_closed has been running for over 60 seconds1637test server_fns::permissions::template_tests::actor_share_lock_does_not_block_template_command ... ok1638test server_fns::permissions::template_tests::template_command_waits_for_direct_actor_deactivation_on_replay ... ok1639test server_fns::permissions::template_tests::unsupported_receipt_version_fails_without_repeating_the_change ... ok1640test server_fns::project_creation::editing::tests::canonical_concurrency::canonical_read_discards_snapshot_after_concurrent_revocation ... ok1641test server_fns::permissions::template_tests::receipts_enforce_tenant_exclusive_principal_and_request_uniqueness ... ok1642test server_fns::project_creation::editing::tests::canonical_concurrency::canonical_replay_rechecks_recorded_effects_after_concurrent_revocation ... ok1643test server_fns::project_creation::editing::tests::canonical_fields::canonical_editor_managed_rates_require_designation_and_withhold_catalog_defaults ... ok1644test server_fns::project_creation::editing::tests::canonical_fields::canonical_editor_cannot_save_after_switching_to_another_authorized_person ... ok1645test server_fns::permissions::template_tests::invalid_stored_authority_and_template_grants_fail_closed ... ok1646test server_fns::project_creation::editing::tests::canonical_fields::canonical_editor_never_projects_stale_task_money_as_hours ... ok1647test server_fns::project_creation::editing::tests::canonical_fields::canonical_editor_without_rate_read_withholds_stored_task_rate ... ok1648test server_fns::project_creation::editing::tests::canonical_fields::canonical_editor_withholds_monetary_settings_without_billable_read ... ok1649test server_fns::project_creation::editing::tests::canonical_fields::canonical_cost_reader_does_not_require_legacy_administrator ... ok1650test server_fns::project_creation::editing::tests::canonical_fields::canonical_fee_to_hours_requires_financial_authority_on_save_and_replay ... ok1651test server_fns::project_creation::editing::tests::canonical_concurrency::canonical_editor_operations_finish_before_waiting_designation_revocation has been running for over 60 seconds1652test server_fns::project_creation::editing::tests::canonical_fields::canonical_financial_grants_do_not_replace_project_editing_authority ... ok1653test server_fns::project_creation::editing::tests::canonical_concurrency::canonical_save_rechecks_authority_after_concurrent_revocation ... ok1654test server_fns::project_creation::editing::tests::canonical_fields::canonical_blank_task_removal_preserves_stale_fee_total_without_financial_writes ... ok1655test server_fns::project_creation::editing::tests::canonical_fields::canonical_project_editor_is_not_rejected_by_legacy_member_role ... ok1656test server_fns::project_creation::editing::tests::canonical_fields::canonical_managed_editor_requires_the_project_designation ... ok1657test server_fns::project_creation::editing::tests::canonical_fields::canonical_save_preserves_withheld_fields_and_original_retry_intent ... ok1658test server_fns::project_creation::editing::tests::canonical_fields::canonical_editor_keeps_hour_budgets_without_financial_grants has been running for over 60 seconds1659test server_fns::project_creation::editing::tests::canonical_fields::canonical_new_task_alias_cannot_bypass_billable_write_authority ... ok1660test server_fns::project_creation::editing::tests::canonical_fields::canonical_save_rejects_equal_value_edit_without_write_authority ... ok1661test server_fns::project_creation::editing::tests::canonical_fields::canonical_editor_keeps_hour_budgets_without_financial_grants ... ok1662test server_fns::project_creation::editing::tests::canonical_fields::canonical_editor_uses_designations_instead_of_legacy_team_roles ... ok1663test server_fns::project_creation::editing::tests::canonical_fields::canonical_read_only_billable_grant_rejects_task_rate_update ... ok1664test server_fns::project_creation::editing::tests::canonical_fields::canonical_task_removal_recomputes_fee_budget_with_financial_authority ... ok1665test server_fns::project_creation::editing::tests::canonical_fields::canonical_save_requires_the_requester_that_opened_the_editor ... ok1666test server_fns::project_creation::editing::tests::canonical_fields::canonical_task_removal_recomputes_hour_budget_without_financial_writes ... ok1667test server_fns::project_creation::editing::tests::canonical_fields::canonical_hour_budget_edits_preserve_inactive_parent_money has been running for over 60 seconds1668test server_fns::project_creation::editing::tests::canonical_fields::canonical_member_removal_recomputes_hour_budget_without_financial_writes has been running for over 60 seconds1669test server_fns::project_creation::editing::tests::canonical_fields::canonical_hour_budget_edits_preserve_inactive_parent_money ... ok1670test server_fns::project_creation::editing::tests::canonical_managers::canonical_form_manager_only_change_and_historical_replay_do_not_need_team_changes ... ok1671test server_fns::project_creation::editing::tests::canonical_managers::canonical_form_receipt_failure_rolls_back_delegation_and_project ... ok1672test server_fns::project_creation::editing::tests::canonical_managers::canonical_form_cannot_reuse_an_independent_delegation_receipt ... ok1673test server_fns::project_creation::editing::tests::canonical_fields::canonical_task_rate_zero_reset_and_revoked_retry_remain_distinct has been running for over 60 seconds1674test server_fns::project_creation::editing::tests::canonical_fields::canonical_member_removal_recomputes_hour_budget_without_financial_writes ... ok1675test server_fns::project_creation::editing::tests::canonical_fields::project_editor_explicit_hour_budget_change_clears_inactive_member_budget has been running for over 60 seconds1676test server_fns::project_creation::editing::tests::canonical_managers::canonical_form_saves_managers_without_changing_legacy_membership_roles ... ok1677test server_fns::project_creation::editing::tests::canonical_fields::project_editor_keeps_inactive_member_budgets_on_name_save_and_replay has been running for over 60 seconds1678test server_fns::project_creation::editing::tests::canonical_fields::project_editor_explicit_hour_budget_change_clears_inactive_member_budget ... ok1679test server_fns::project_creation::editing::tests::canonical_managers::canonical_form_rejects_invalid_or_stale_manager_selection_atomically ... ok1680test server_fns::project_creation::editing::tests::canonical_concurrency::canonical_editor_operations_finish_before_waiting_designation_revocation ... ok1681test server_fns::project_creation::editing::tests::catalog::editor_catalog_filters_candidates_before_bounded_literal_search_pages ... ok1682test server_fns::project_creation::editing::tests::canonical_fields::project_editor_keeps_inactive_member_budgets_on_name_save_and_replay ... ok1683test server_fns::project_creation::editing::tests::canonical_fields::canonical_task_rate_zero_reset_and_revoked_retry_remain_distinct ... ok1684test server_fns::project_creation::editing::tests::canonical_managers::canonical_form_retains_archived_manager_with_different_legacy_role has been running for over 60 seconds1685test server_fns::project_creation::editing::tests::catalog::editor_catalog_managed_scope_needs_designation_but_never_opens_global_rates ... ok1686test server_fns::project_creation::editing::tests::catalog::editor_catalog_rejects_switched_requesters_and_out_of_scope_projects ... ok1687test server_fns::project_creation::editing::tests::concurrent_edits_have_one_winner_and_association_writes_invalidate_open_forms ... ok1688test server_fns::project_creation::editing::tests::catalog::editor_catalog_has_no_implicit_legacy_policy_fallback ... ok1689test server_fns::project_creation::editing::tests::editing_milestones_keeps_invoice_snapshots_and_fee_identities_immutable ... ok1690test server_fns::project_creation::editing::tests::editor_keeps_archived_selected_identities_and_nullable_overrides ... ok1691test server_fns::project_creation::editing::tests::catalog::editor_catalog_withholds_defaults_without_their_financial_authority ... ok1692test server_fns::project_creation::editing::tests::editor_loads_legacy_values_without_fabricating_a_billing_mode_or_draft ... ok1693test server_fns::project_creation::editing::tests::canonical_managers::canonical_form_self_removal_commits_but_cannot_replay_without_authority has been running for over 60 seconds1694test server_fns::project_creation::editing::tests::editor_preserves_fee_schedule_and_operational_milestone_ids ... ok1695test server_fns::project_creation::editing::tests::editor_rechecks_tenant_role_and_active_status ... ok1696test server_fns::project_creation::editing::tests::canonical_managers::canonical_form_self_removal_commits_but_cannot_replay_without_authority ... ok1697test server_fns::project_creation::editing::tests::foreign_actor_cannot_save_or_retry_another_organizations_edit ... ok1698test server_fns::project_creation::editing::tests::canonical_managers::canonical_form_retains_archived_manager_with_different_legacy_role ... ok1699test server_fns::project_creation::editing::tests::editor_recovers_each_budget_scope_without_turning_absence_into_zero ... ok1700test server_fns::project_creation::editing::tests::save_edits_the_same_legacy_project_and_never_creates_a_draft_or_configuration ... ok1701test server_fns::project_creation::editing::tests::catalog::editor_catalog_rechecks_revocation_after_waiting_for_the_organization ... ok1702test server_fns::project_creation::editing::tests::manager_edit_preserves_private_settings_and_cannot_remove_them_indirectly ... ok1703test server_fns::project_creation::editing::tests::editor_recovers_full_configuration_and_redacts_private_values_after_role_change ... ok1704test server_fns::project_creation::editing::tests::save_updates_configured_sections_atomically_and_rejects_stale_or_invalid_edits ... ok1705test server_fns::project_creation::editing::tests::cost_edits_distinguish_zero_override_from_reset_without_changing_person_default ... ok1706test server_fns::project_creation::editing::tests::save_preserves_recorded_time_and_rejects_removing_its_task_or_person ... ok1707test server_fns::project_creation::editing::tests::saves_recheck_current_authority_and_do_not_repeat_noops ... ok1708test server_fns::project_creation::editing::tests::task_catalog_and_graph_changes_roll_back_together_on_duplicate_resolution ... ok1709test server_fns::project_creation::editing::tests::task_activity::project_task_archive_restore_preserves_hidden_configuration_history_and_replays ... ok1710test server_fns::project_creation::tests::billing_schema_rejects_partial_fee_schedules ... ok1711test server_fns::project_creation::editing::tests::catalog::editor_catalog_requires_operation_authority_not_legacy_role_or_rate_grant ... ok1712test server_fns::project_creation::tests::client_dialog_validates_details_and_persists_an_explicit_zero_rate ... ok1713test server_fns::project_creation::tests::creation_client_must_be_active_and_in_the_same_organization ... ok1714test server_fns::project_creation::tests::creation_actor_is_revalidated_inside_the_transaction ... ok1715test server_fns::project_creation::editing::tests::task_activity::invalid_task_activity_targets_and_global_restore_order_rollback_the_whole_edit ... ok1716test server_fns::project_creation::tests::draft_ownership_discard_and_role_changes_are_enforced ... ok1717test server_fns::project_creation::tests::draft_save_retries_do_not_overwrite_a_newer_revision ... ok1718test server_fns::project_creation::tests::creation_options_are_scoped_bounded_and_redact_manager_costs ... ok1719test server_fns::project_creation::tests::draft_schema_enforces_one_current_draft_per_creator ... ok1720test server_fns::project_creation::tests::draft_validation_preserves_incomplete_input_but_bounds_its_size ... ok1721test server_fns::project_creation::tests::draft_schema_rejects_oversize_payload_and_invalid_revision ... ok1722test server_fns::project_creation::tests::final_validation_checks_invoice_defaults_and_scoped_budget_totals ... ok1723test server_fns::project_creation::tests::final_validation_preserves_exact_budgets_and_rejects_unavailable_email ... ok1724test server_fns::project_creation::tests::draft_schema_rejects_foreign_creator_and_completed_project ... ok1725test server_fns::project_creation::tests::final_validation_requires_real_details_and_ignores_hidden_type_settings ... ok1726test server_fns::project_creation::editing::tests::task_activity::project_settings_save_without_activity_intent_does_not_restore_archived_links ... ok1727test server_fns::project_creation::tests::final_validation_requires_complete_fee_schedules_and_distinct_entities ... ok1728test server_fns::project_creation::tests::finalization_rechecks_client_role_revision_and_rate_currency ... ok1729test server_fns::project_creation::tests::existing_projects_have_no_implicit_new_billing_configuration ... ok1730test server_fns::project_creation::tests::managers_cannot_store_administrator_notes_or_costs_in_a_draft ... ok1731test server_fns::project_creation::tests::finalization_persists_task_access_and_project_only_financial_overrides ... ok1732test server_fns::project_creation::editing::tests::editor_load_uses_current_role_across_all_billing_configurations has been running for over 60 seconds1733test server_fns::project_creation::tests::finalize_is_atomic_and_repeated_submission_returns_one_project ... ok1734test server_fns::project_creation::tests::selected_catalog_bounds_requests_and_excludes_inactive_people ... ok1735test server_fns::project_creation::tests::selected_catalog_is_scoped_deduplicated_and_redacts_manager_costs ... ok1736test server_fns::project_creation::tests::missing_draft_responses_do_not_disclose_foreign_ownership ... ok1737test server_fns::project_creation::validation::tests::assignment_rejections_identify_the_invalid_row ... ok1738test server_fns::project_creation::validation::tests::basic_rejections_identify_the_field_without_echoing_input ... ok1739test server_fns::project_creation::validation::tests::billing_rejections_identify_the_active_control ... ok1740test server_fns::project_creation::validation::tests::inactive_billing_inputs_remain_in_the_draft_without_blocking_creation ... ok1741test server_fns::project_creation::validation::tests::invoice_rejections_identify_the_field_without_echoing_input ... ok1742test server_fns::project_creation::validation::tests::milestone_rejections_target_the_invalid_row_by_identity ... ok1743test server_fns::project_creation::validation::tests::non_billable_projects_ignore_hidden_invoice_inputs ... ok1744test server_fns::project_creation::validation::tests::task_name_and_access_rejections_identify_the_invalid_row ... ok1745test server_fns::project_creation::tests::invalid_task_rolls_back_project_and_keeps_the_draft ... ok1746test server_fns::project_creation::locking_tests::every_project_entry_gates_before_actor_and_rechecks_revocation ... ok1747test server_fns::project_creation::tests::selected_client_lookup_is_scoped_and_keeps_archived_identity ... ok1748test server_fns::projects::assignment_tests::own_assignment_lifecycle_preserves_role_and_duplicate_behavior ... ok1749test server_fns::project_creation::tests::simultaneous_draft_updates_have_one_winner ... ok1750test server_fns::project_creation::import_tests::imported_catalog_rate_cannot_be_relabelled_as_workspace_currency has been running for over 60 seconds1751test server_fns::project_creation::import_tests::imports_preserve_finalized_project_configuration_and_restricted_access has been running for over 60 seconds1752test server_fns::project_creation::import_tests::imports_preserve_finalized_project_configuration_and_restricted_access ... ok1753test server_fns::projects::assignment_tests::creation_rejects_foreign_and_unknown_project_or_person ... ok1754test server_fns::projects::bulk_tests::bulk_accepts_one_hundred_projects_and_mixed_status_noops ... ok1755test server_fns::projects::bulk_tests::bulk_database_failure_rolls_back_earlier_changes ... ok1756test server_fns::projects::bulk_tests::bulk_ids_validate_before_writes_and_normalize_duplicates ... ok1757test server_fns::projects::bulk_tests::bulk_missing_or_foreign_project_rolls_back_earlier_changes ... ok1758test server_fns::projects::bulk_tests::bulk_preserves_invoiced_history_assignments_and_spend ... ok1759test server_fns::project_creation::editing::tests::editor_load_uses_current_role_across_all_billing_configurations ... ok1760test server_fns::projects::assignment_tests::project_membership_and_task_callers_wait_before_authorizing ... ok1761test server_fns::projects::bulk_tests::bulk_reversed_overlapping_batches_finish_without_deadlock ... ok1762test server_fns::projects::assignment_tests::assignment_mutations_wait_for_revocation_and_recheck_authority ... ok1763test server_fns::projects::bulk_tests::bulk_status_preserves_details_history_and_noop_versions ... ok1764test server_fns::projects::assignment_tests::stale_administrator_cannot_create_or_remove_after_revocation ... ok1765test server_fns::projects::canonical_read_tests::budgets::canonical_budget_financial_revocation_withholds_allowance_and_consumption ... ok1766test server_fns::project_creation::import_tests::imported_catalog_rate_cannot_be_relabelled_as_workspace_currency ... ok1767test server_fns::projects::canonical_read_tests::budgets::canonical_budget_summaries_exclude_unallocated_hours_and_money_but_not_zero ... ok1768test server_fns::projects::assignment_tests::removal_preserves_foreign_and_malformed_assignments has been running for over 60 seconds1769test server_fns::projects::canonical_read_tests::budgets::canonical_shared_budget_does_not_disclose_other_person_allocations ... ok1770test server_fns::projects::canonical_read_tests::budgets::canonical_budget_managed_financial_scope_is_independent_of_project_read_all ... ok1771test server_fns::projects::canonical_read_tests::budgets::canonical_budget_reader_does_not_require_legacy_management ... ok1772test server_fns::projects::canonical_read_tests::budgets::canonical_budget_managed_scope_requires_current_designation ... ok1773test server_fns::projects::canonical_read_tests::canonical_project_details_withhold_legacy_admin_notes_and_rate_controls ... ok1774test server_fns::projects::canonical_read_tests::budgets::canonical_shared_budget_does_not_disclose_individual_task_allocations ... ok1775test server_fns::projects::canonical_read_tests::canonical_own_only_member_does_not_inherit_legacy_manager_project_details ... ok1776test server_fns::projects::canonical_read_tests::canonical_own_only_member_does_not_inherit_legacy_manager_project_list ... ok1777test server_fns::projects::canonical_read_tests::canonical_project_reads_exclude_foreign_client_parent_links ... ok1778test server_fns::projects::canonical_read_tests::canonical_project_reads_reject_unknown_policy_and_invalid_grants ... ok1779test server_fns::projects::canonical_read_tests::canonical_project_read_does_not_inherit_legacy_admin_financial_fields ... ok1780test server_fns::projects::canonical_read_tests::canonical_project_reader_opens_without_legacy_management_or_tracking ... ok1781test server_fns::projects::canonical_read_tests::budgets::canonical_budget_skips_hidden_monetary_overflow has been running for over 60 seconds1782test server_fns::projects::canonical_read_tests::canonical_tags_follow_project_reads_and_revocation ... ok1783test server_fns::projects::canonical_read_tests::budgets::canonical_budget_skips_hidden_monetary_overflow ... ok1784test server_fns::projects::canonical_read_tests::canonical_shared_report_and_historical_tracking_are_distinct ... ok1785test server_fns::projects::canonical_read_tests::canonical_managed_project_reads_require_current_designation has been running for over 60 seconds1786test server_fns::projects::canonical_read_tests::concurrency::cancelling_project_readers_releases_organization_and_actor_fences ... ok1787test server_fns::projects::canonical_read_tests::detail::detail_view_contains_only_scoped_workflow_labels_and_current_edit_authority ... ok1788test server_fns::projects::canonical_read_tests::canonical_project_reader_lists_without_legacy_management_or_tracking ... ok1789test server_fns::projects::canonical_read_tests::canonical_project_financial_projection_matches_owning_project_evaluator has been running for over 60 seconds1790test server_fns::projects::canonical_read_tests::detail::detail_view_rejects_changed_requester_and_current_resource_denial ... ok1791test server_fns::projects::canonical_read_tests::canonical_project_financial_projection_matches_owning_project_evaluator ... ok1792test server_fns::projects::canonical_read_tests::overview::legacy_overview_uses_current_role_not_the_captured_user_role ... ok1793test server_fns::projects::assignment_tests::removal_preserves_foreign_and_malformed_assignments ... ok1794test server_fns::projects::canonical_read_tests::concurrency::project_readers_observe_grant_revocation_after_waiting_for_organization ... ok1795test server_fns::projects::canonical_read_tests::overview::overview_denies_unavailable_actor_instead_of_binding_an_empty_success ... ok1796test server_fns::projects::canonical_read_tests::overview::overview_resolves_only_visible_client_identity_without_directory_or_rates ... ok1797test server_fns::projects::canonical_read_tests::concurrency::project_readers_observe_deactivation_after_waiting_for_actor ... ok1798test server_fns::projects::canonical_read_tests::concurrency::project_readers_hold_authority_until_materialization_before_deactivation has been running for over 60 seconds1799test server_fns::projects::canonical_read_tests::overview::overview_edit_affordance_requires_current_project_write_scope ... ok1800test server_fns::projects::canonical_read_tests::spend::canonical_spend_excludes_entries_with_foreign_person_parents ... ok1801test server_fns::projects::canonical_read_tests::spend::canonical_shared_progress_and_report_permissions_do_not_open_ordinary_money ... ok1802test server_fns::projects::canonical_read_tests::canonical_managed_project_reads_require_current_designation ... ok1803test server_fns::projects::canonical_read_tests::spend::canonical_spend_reads_do_not_require_a_legacy_manager_role ... ok1804test server_fns::projects::canonical_read_tests::detail::detail_view_shared_member_gets_own_identity_not_other_people_or_legacy_actions ... ok1805test server_fns::projects::canonical_read_tests::spend::hidden_spend_overflow_does_not_prevent_authorized_hour_totals ... ok1806test server_fns::projects::canonical_read_tests::spend::canonical_spend_zero_and_withheld_money_remain_distinct_without_entries ... ok1807test server_fns::projects::canonical_read_tests::concurrency::project_readers_hold_authority_until_materialization_before_deactivation ... ok1808test server_fns::projects::canonical_read_tests::tasks::project_task_labels_require_project_scope_not_global_task_scope ... ok1809test server_fns::projects::canonical_read_tests::overview::overview_observes_edit_revocation_after_waiting_for_organization has been running for over 60 seconds1810test server_fns::projects::canonical_read_tests::overview::overview_observes_edit_revocation_after_waiting_for_organization ... ok1811test server_fns::projects::canonical_read_tests::tasks::assigned_tracking_task_survives_private_progress_without_catalog_grant ... ok1812test server_fns::projects::canonical_read_tests::overview::overview_rejects_changed_requester_including_empty_results has been running for over 60 seconds1813test server_fns::projects::canonical_read_tests::spend::canonical_spend_managed_scope_requires_current_project_designation ... ok1814test server_fns::projects::canonical_read_tests::tasks::project_task_reader_requires_current_manager_designation ... ok1815test server_fns::projects::canonical_read_tests::tasks::task_catalog_refreshes_permissions_after_organization_wait ... ok1816test server_fns::projects::canonical_read_tests::spend::canonical_spend_withholds_money_after_financial_revocation has been running for over 60 seconds1817test server_fns::projects::canonical_read_tests::tasks::task_catalog_uses_current_actor_and_never_foreign_tasks ... ok1818test server_fns::projects::canonical_read_tests::spend::spend_rechecks_financial_only_revocation_after_organization_wait has been running for over 60 seconds1819test server_fns::projects::canonical_read_tests::spend::canonical_spend_withholds_money_after_financial_revocation ... ok1820test server_fns::projects::canonical_read_tests::tasks::task_catalog_all_rate_grant_is_independent_of_legacy_role ... ok1821test server_fns::projects::canonical_read_tests::overview::overview_rejects_changed_requester_including_empty_results ... ok1822test server_fns::projects::canonical_read_tests::tasks::task_catalog_accepts_current_read_grant_without_legacy_role has been running for over 60 seconds1823test server_fns::projects::canonical_read_tests::tasks::task_workflow_identity_rejects_foreign_client_parents ... ok1824test server_fns::projects::canonical_read_tests::tasks::task_reader_rejects_unknown_policy_even_with_legacy_admin ... ok1825test server_fns::projects::canonical_read_tests::tasks::task_reads_do_not_inherit_legacy_administrator_catalog ... ok1826test server_fns::projects::canonical_read_tests::tasks::tracking_history_is_not_task_catalog_authority ... ok1827test server_fns::projects::canonical_read_tests::team::team_reader_denies_foreign_projects_and_unavailable_actors ... ok1828test server_fns::projects::canonical_read_tests::tasks::task_catalog_withholds_global_rates_without_all_rate_read has been running for over 60 seconds1829test server_fns::projects::canonical_read_tests::spend::spend_rechecks_financial_only_revocation_after_organization_wait ... ok1830test server_fns::projects::canonical_read_tests::tasks::task_catalog_accepts_current_read_grant_without_legacy_role ... ok1831test server_fns::projects::canonical_read_tests::team::team_reader_rejects_malformed_canonical_state_including_empty_projects ... ok1832test server_fns::projects::details_tests::project_details_and_tags_follow_current_progress_and_private_permissions ... ok1833test server_fns::projects::canonical_read_tests::team::project_team_and_override_rates_follow_independent_current_project_scope ... ok1834test server_fns::projects::mutation_tests::project::both_activation_transitions_preserve_details_and_change_once ... ok1835test server_fns::projects::canonical_read_tests::team::team_reader_does_not_disclose_cross_tenant_assignment_targets ... ok1836test server_fns::projects::mutation_tests::project::concurrent_deletion_is_rejected_by_both_mutations ... ok1837test server_fns::projects::mutation_tests::project::budgets_and_rates_distinguish_null_zero_and_normalized_values ... ok1838test server_fns::projects::canonical_read_tests::team::canonical_member_does_not_inherit_legacy_admin_team_or_rates has been running for over 60 seconds1839test server_fns::projects::mutation_tests::project::configured_edits_recheck_settings_after_waiting_for_the_project ... ok1840test server_fns::projects::details_tests::project_details_only_offer_task_rate_currency_to_current_managers ... ok1841test server_fns::projects::canonical_read_tests::team::project_reader_can_read_retained_team_without_people_directory_or_rates has been running for over 60 seconds1842test server_fns::projects::mutation_tests::project::configured_edits_preserve_compatible_changes_and_idempotence ... ok1843test server_fns::projects::mutation_tests::project::configured_edits_preserve_non_hourly_billing ... ok1844test server_fns::projects::mutation_tests::project::inactive_project_edits_preserve_identity_and_reject_implicit_migrations ... ok1845test server_fns::projects::mutation_tests::project::configured_edits_reject_incompatible_financial_changes_atomically ... ok1846test server_fns::projects::canonical_read_tests::team::canonical_member_does_not_inherit_legacy_admin_team_or_rates ... ok1847test server_fns::projects::mutation_tests::project::invalid_project_fields_leave_the_row_unchanged ... ok1848test server_fns::projects::mutation_tests::project::repeating_a_competing_edit_requires_a_fresh_revision ... ok1849test server_fns::projects::mutation_tests::project::restoring_a_competing_deactivation_reports_reactivation ... ok1850test server_fns::projects::mutation_tests::project::repeating_a_competing_deactivation_reports_no_transition ... ok1851test server_fns::projects::details_tests::unlinked_and_private_project_tags_do_not_leak_into_filters ... ok1852test server_fns::projects::mutation_tests::project::missing_and_foreign_rows_are_not_noops ... ok1853test server_fns::projects::mutation_tests::project::unchanged_activation_preserves_the_row ... ok1854test server_fns::projects::mutation_tests::task::both_activation_transitions_preserve_details_and_change_once ... ok1855test server_fns::projects::canonical_read_tests::tasks::task_catalog_withholds_global_rates_without_all_rate_read ... ok1856test server_fns::projects::mutation_tests::task::concurrent_deletion_returns_not_found_for_both_mutations ... ok1857test server_fns::projects::mutation_tests::project::unchanged_edit_preserves_the_row ... ok1858test server_fns::projects::mutation_tests::task::each_detail_field_changes_once_and_preserves_inactive_status ... ok1859test server_fns::projects::mutation_tests::task::missing_and_foreign_rows_are_not_noops ... ok1860test server_fns::projects::mutation_tests::project::restoring_a_competing_edit_does_not_overwrite_the_other_session ... ok1861test server_fns::projects::canonical_read_tests::team::project_reader_can_read_retained_team_without_people_directory_or_rates ... ok1862test server_fns::projects::mutation_tests::task::repeating_a_competing_deactivation_reports_no_transition ... ok1863test server_fns::projects::mutation_tests::task::rate_edits_set_currency_without_relabelling_renames_or_noops ... ok1864test server_fns::projects::mutation_tests::task::restoring_a_competing_deactivation_reports_reactivation ... ok1865test server_fns::projects::mutation_tests::task::restoring_a_competing_edit_reports_a_change ... ok1866test server_fns::projects::mutation_tests::task::unchanged_activation_preserves_the_row ... ok1867test server_fns::projects::mutation_tests::task::repeating_a_competing_edit_does_not_report_a_change ... ok1868test server_fns::projects::privacy_tests::outsiders_and_inactive_viewers_have_no_project_reads ... ok1869test server_fns::projects::mutation_tests::task::unchanged_edit_preserves_the_row ... ok1870test server_fns::projects::privacy_tests::client_project_filter_preserves_progress_access_and_rate_redaction ... ok1871test server_fns::projects::privacy_tests::project_members_and_leads_receive_progress_without_rates ... ok1872test server_fns::projects::privacy_tests::legacy_members_retain_progress_without_new_settings ... ok1873test server_fns::projects::privacy_tests::private_progress_does_not_prevent_tracking_or_reveal_financial_fields ... ok1874test server_fns::projects::privacy_tests::revoked_membership_preserves_only_own_historical_tracking_identity ... ok1875test server_fns::projects::privacy_tests::project_reads_use_current_authority_and_reject_foreign_scope ... ok1876test server_fns::projects::task_activity_tests::activity_observes_revocation_after_organization_wait ... ok1877test server_fns::projects::task_activity_tests::global_restore_does_not_restore_project_tracking_and_archive_invalidates_editor ... ok1878test server_fns::projects::task_activity_tests::activity_rejects_unavailable_authority_even_for_noops ... ok1879test server_fns::projects::task_activity_tests::project_task_activity_migration_preserves_legacy_and_archives_canonical_links ... ok1880test server_fns::projects::task_activity_tests::archive_excludes_new_tracking_writers_before_task_lock_and_commit ... ok1881test server_fns::projects::task_edit_tests::task_edit_observes_task_and_rate_revocation_after_organization_wait ... ok1882test server_fns::projects::task_activity_tests::activity_separates_session_rates_from_events_and_preserves_noops ... ok1883test server_fns::projects::task_edit_tests::task_edit_holds_authority_while_waiting_for_task_and_commit ... ok1884test server_fns::projects::task_edit_tests::explicit_task_rate_noops_still_require_global_write_authority ... ok1885test server_fns::projects::task_activity_tests::archive_waits_for_existing_time_writer_and_observes_committed_timer ... ok1886test server_fns::projects::task_edit_tests::task_name_editor_preserves_unknown_currency_and_hides_rate_even_on_noop ... ok1887test server_fns::projects::task_catalog::tests::catalog_observes_revocation_after_waiting_for_current_authority ... ok1888test server_fns::projects::task_edit_tests::task_edit_rejects_actor_deactivated_after_waiting_for_actor_lock ... ok1889test server_fns::projects::task_edit_tests::task_rate_edit_refuses_stale_currency_after_organization_wait ... ok1890test server_fns::projects::task_link_tests::link_holds_authority_while_waiting_for_task ... ok1891test server_fns::projects::task_edit_tests::task_rate_edit_does_not_rewrite_project_overrides_or_time_history ... ok1892test server_fns::projects::task_catalog::tests::catalog_pages_keep_duplicate_names_and_filter_activity_without_foreign_rows has been running for over 60 seconds1893test server_fns::projects::task_edit_tests::task_edit_validates_currency_amount_name_and_foreign_targets_atomically ... ok1894test server_fns::projects::task_write_tests::global_task_creation_rejects_unknown_policy_without_inserting ... ok1895test server_fns::projects::task_link_tests::link_does_not_restore_archived_associations_or_touch_foreign_records has been running for over 60 seconds1896test server_fns::projects::task_link_tests::link_requires_matching_default_currency_even_without_project_settings ... ok1897test server_fns::projects::task_write_tests::global_task_creation_accepts_current_grant_without_legacy_manager ... ok1898test server_fns::projects::task_write_tests::initial_task_rate_requires_global_financial_and_task_authority ... ok1899test server_fns::projects::task_link_tests::link_noops_reject_unavailable_authority_without_changing_storage has been running for over 60 seconds1900test server_fns::projects::task_link_tests::link_does_not_restore_archived_associations_or_touch_foreign_records ... ok1901test server_fns::projects::task_write_tests::new_task_link_obeys_nonbillable_project_without_changing_catalog_default ... ok1902test server_fns::projects::task_link_tests::link_rechecks_project_rate_and_designation_after_organization_wait has been running for over 60 seconds1903test server_fns::projects::task_link_tests::link_rechecks_project_rate_and_designation_after_organization_wait ... ok1904test server_fns::projects::task_write_tests::initial_task_rate_rechecks_financial_authority_and_currency_after_wait ... ok1905test server_fns::projects::task_write_tests::global_task_creation_does_not_inherit_legacy_administrator_authority ... ok1906test server_fns::projects::task_write_tests::initial_task_rate_and_project_link_commit_together_with_service_payload ... ok1907test server_fns::projects::task_link_tests::link_noops_reject_unavailable_authority_without_changing_storage ... ok1908test server_fns::projects::task_write_tests::task_creation_rechecks_revoked_project_designation_after_wait ... ok1909test server_fns::projects::tests::assignments_are_scoped_to_the_viewers_organization ... ok1910test server_fns::projects::task_write_tests::project_edit_authority_does_not_create_global_tasks ... ok1911test server_fns::projects::tests::enabling_is_tenant_scoped_even_for_existing_links_and_preserves_overrides ... ok1912test server_fns::projects::tests::creating_a_project_task_enables_it_with_its_defaults ... ok1913test server_fns::projects::task_write_tests::task_creation_fails_closed_for_unavailable_actor_permissions ... ok1914test server_fns::projects::tests::enabling_tasks_accepts_exact_project_currency_rates_and_preserves_existing_links ... ok1915test server_fns::projects::tests::enabling_tasks_rejects_explicit_rates_unused_by_the_project ... ok1916test server_fns::projects::tests::enabling_tasks_only_inherits_rates_used_by_configured_projects ... ok1917test server_fns::projects::task_write_tests::task_creation_cannot_link_with_global_task_authority_alone ... ok1918test server_fns::projects::tests::enabling_tasks_rejects_incompatible_catalog_currency ... ok1919test server_fns::projects::tests::managers_and_admins_can_read_assignment_rates ... ok1920test server_fns::projects::tests::project_rate_distinguishes_inheritance_zero_and_exact_amounts ... ok1921test server_fns::projects::tests::enabling_tasks_rejects_invalid_or_wrong_currency_explicit_rates_without_linking ... ok1922test server_fns::projects::tests::failed_project_task_creation_leaves_no_orphan_task ... ok1923test server_fns::projects::tests::members_can_list_identities_but_not_assignment_rates ... ok1924test server_fns::projects::tests::project_rate_helper_has_no_public_execute_grant ... ok1925test server_fns::projects::tests::unknown_catalog_currency_requires_explicit_configured_rates_but_preserves_legacy ... ok1926test server_fns::projects::tests::project_rate_sql_matches_rust_for_missing_zero_and_present_sources ... ok1927test server_fns::projects::task_catalog::tests::catalog_pages_keep_duplicate_names_and_filter_activity_without_foreign_rows ... ok1928test server_fns::projects::task_write_tests::linked_task_creation_requires_both_current_grants_and_managed_scope has been running for over 60 seconds1929test server_fns::reports::tests::manager_report_omits_groups_containing_private_project_costs ... ok1930test server_fns::reports::tests::filters_and_renames_keep_report_identity_and_totals ... ok1931test server_fns::reports::tests::shared_person_and_task_are_partitioned_by_currency ... ok1932test server_fns::reports::tests::report_uses_current_active_actor_and_tenant_for_every_filter ... ok1933test server_fns::projects::task_write_tests::task_creation_rechecks_revoked_grants_after_organization_wait has been running for over 60 seconds1934test server_fns::projects::task_write_tests::unavailable_project_rolls_back_new_catalog_task has been running for over 60 seconds1935test server_fns::snapshot::reader_tests::legacy_readers_deny_writer_first_revocation ... ok1936test server_fns::projects::task_write_tests::task_creation_rechecks_revoked_grants_after_organization_wait ... ok1937test server_fns::reports::tests::tag_filters_keep_report_dimensions_and_details_in_sync ... ok1938test server_fns::snapshot::reader_tests::legacy_readers_preserve_inherited_connection_settings ... ok1939test server_fns::snapshot::reader_tests::legacy_readers_preserve_actor_tenant_filters_and_missing_resources ... ok1940test server_fns::snapshot::reader_tests::legacy_readers_cancel_without_retaining_authority_or_pool_connection ... ok1941test server_fns::time_entries::activity_tests::admitted_time_writer_finishes_before_account_deactivation ... ok1942test server_fns::reports::tests::same_names_keep_separate_groups_for_every_dimension has been running for over 60 seconds1943test server_fns::snapshot::reader_tests::legacy_readers_hold_reader_first_authority_until_materialized ... ok1944test server_fns::time_entries::activity_tests::every_time_mutation_denies_inactive_and_missing_owners_without_changes ... ok1945test server_fns::time_entries::activity_tests::cancelled_time_writer_releases_fences_and_preserves_pool_defaults ... ok1946test server_fns::snapshot::reader_tests::legacy_invoice_detail_keeps_metadata_and_lines_in_one_snapshot ... ok1947test server_fns::time_entries::activity_tests::waiting_time_writer_rechecks_committed_or_rolled_back_deactivation ... ok1948test server_fns::time_entries::commands::tests::guards::all_intents_reject_read_only_inactive_and_stale_identities_atomically ... ok1949test server_fns::time_entries::commands::tests::delegated_commands_keep_owner_and_apply_each_ordinary_intent ... ok1950test server_fns::time_entries::commands::tests::guards::coverage_conflicts_are_explicit_pending_submitted_editing_integration ... ok1951test server_fns::time_entries::commands::tests::guards::legacy_own_history_is_editable_without_becoming_new_tracking_authority ... ok1952test server_fns::time_entries::commands::tests::guards::bulk_sets_do_not_partially_modify_foreign_locked_or_duplicate_entries ... ok1953test server_fns::projects::task_write_tests::linked_task_creation_requires_both_current_grants_and_managed_scope ... ok1954test server_fns::time_entries::commands::tests::guards::delegated_stop_requires_restored_tracking_but_owner_keeps_terminal_recovery ... ok1955test server_fns::time_entries::commands::tests::guards::task_grants_archives_and_canonical_admin_role_do_not_bypass_tracking ... ok1956test server_fns::reports::tests::same_names_keep_separate_groups_for_every_dimension ... ok1957test server_fns::time_entries::commands::tests::guards::no_op_emits_no_effects_and_changed_payload_uses_normalized_effective_values ... ok1958test server_fns::time_entries::commands::tests::guards::project_management_covers_only_its_project_and_checks_both_move_ends ... ok1959test server_fns::time_entries::tests::a_limit_bounds_a_listing_on_its_own ... ok1960test server_fns::time_entries::tests::a_reorder_rejects_foreign_missing_timed_and_duplicate_ids ... ok1961test server_fns::time_entries::commands::tests::tracking_is_subject_eligible_and_actor_writable_without_financial_fields ... ok1962test server_fns::time_entries::commands::tests::revocation::admitted_delegated_stop_finishes_before_assignment_revocation ... ok1963test server_fns::time_entries::commands::tests::revocation::cancelling_waiting_command_releases_authority_and_subject_barriers ... ok1964test server_fns::time_entries::tests::an_unlimited_listing_needs_both_ends_of_the_range ... ok1965test server_fns::snapshot::reader_tests::legacy_readers_reject_revoked_session_identity ... ok1966test server_fns::time_entries::tests::clamps_duration_against_the_snapped_start ... ok1967test server_fns::time_entries::commands::tests::revocation::delegated_stop_waits_for_revocation_and_observes_commit_or_rollback ... ok1968test server_fns::time_entries::tests::a_running_timer_cannot_be_moved_to_another_day ... ok1969test server_fns::time_entries::tests::concurrent_timer_starts_insert_exactly_one_entry ... ok1970test server_fns::time_entries::tests::assigned_member_may_log_time ... ok1971test server_fns::time_entries::tests::admin_may_log_time_without_assignment ... ok1972test server_fns::time_entries::tests::an_open_entry_can_move_into_a_day_with_locked_time ... ok1973test server_fns::time_entries::tests::moving_locked_time_rejects_the_entire_reorder ... ok1974test server_fns::time_entries::tests::rejects_out_of_range_start ... ok1975test server_fns::time_entries::tests::snaps_unaligned_start_to_the_grid ... ok1976test server_fns::projects::task_write_tests::unavailable_project_rolls_back_new_catalog_task ... ok1977test server_fns::time_entries::tests::new_time_and_picker_require_a_project_task_link ... ok1978test server_fns::time_entries::tests::edits_preserve_archived_time_but_cannot_override_non_billability ... ok1979test server_fns::time_entries::tests::untimed_start_is_left_untouched ... ok1980test server_fns::time_entries::tests::inactive_project_cannot_accept_new_time_even_for_admin ... ok1981test server_fns::time_entries::tests::unassigned_member_is_forbidden ... ok1982test server_fns::time_entries::tests::new_time_and_picker_reject_inactive_or_foreign_contexts ... ok1983test server_fns::time_entries::tests::new_time_uses_effective_billability_for_manual_entries_and_timers ... ok1984test server_fns::time_entries::tests::submission_barrier_blocks_manual_entries_and_timer_starts ... ok1985test server_fns::time_entries::tests::submission_barrier_blocks_edits_and_cross_week_reorders ... ok1986test server_fns::time_entries::update_tests::competing_identical_edit_is_a_noop_after_the_first_commit ... ok1987test server_fns::time_entries::commands::tests::archived_project_task_excludes_choices_and_new_time_without_changing_global_task ... ok1988test server_fns::time_entries::update_tests::competing_edit_that_restores_old_values_still_reports_a_change ... ok1989test server_fns::time_entries::update_tests::concurrent_lock_or_delete_is_rechecked_before_editing ... ok1990test server_fns::time_entries::update_tests::each_editable_field_changes_once_including_nulls ... ok1991test server_fns::time_entries::update_tests::inactive_owner_cannot_edit_time_after_session_lookup ... ok1992test server_fns::time_entries::update_tests::missing_foreign_and_locked_entries_are_not_noops ... ok1993test server_fns::time_entries::update_tests::effective_billability_noop_preserves_the_row ... ok1994test server_fns::time_entries::update_tests::normalized_noop_preserves_the_row_and_updated_at ... ok1995test server_fns::time_entries::update_tests::restricted_empty_task_rejects_picker_manual_and_timer_starts ... ok1996test server_fns::time_entries::update_tests::restricted_reordering_rejects_the_whole_batch ... ok1997test server_fns::time_entries::update_tests::assignment_cascade_allows_an_inflight_entry_project_fk_to_finish ... ok1998test server_fns::time_entries::update_tests::restricted_empty_task_rejects_changes_and_noop_edits ... ok1999test server_fns::time_entries::update_tests::restricted_task_rejects_reschedule_and_delete ... ok2000test server_fns::time_entries::update_tests::restriction_changes_are_rechecked_before_manual_or_timer_insertion ... ok2001test server_fns::time_entries::update_tests::revoked_grant_does_not_trap_an_own_running_timer ... ok2002test server_fns::time_entries::update_tests::revoked_timer_stop_preserves_the_open_state_guard ... ok2003test server_fns::users::tests::authority::access_transaction_holds_actor_authority_until_commit ... ok2004test server_fns::time_entries::update_tests::task_grant_revocation_committed_during_an_edit_is_rechecked ... ok2005test server_fns::time_entries::update_tests::task_grants_allow_tracking_and_archived_history_for_every_role ... ok2006test server_fns::users::tests::authority::project_editor_and_user_revocation_commit_in_gate_order ... ok2007test server_fns::users::tests::concurrency::access_changes_cannot_target_another_organization ... ok2008test server_fns::users::tests::authority::revoked_administrator_cannot_create_change_roles_or_deactivate ... ok2009test server_fns::users::tests::concurrency::concurrent_deactivations_keep_an_active_admin ... ok2010test server_fns::users::tests::concurrency::concurrent_demotions_keep_an_active_admin ... ok2011test server_fns::users::tests::authority::user_mutations_recheck_revocation_after_waiting_for_organization_lock ... ok2012test server_fns::users::tests::concurrency::deactivation_and_demotion_keep_an_active_admin ... ok2013test server_fns::users::tests::concurrency::demotion_and_deactivation_keep_an_active_admin ... ok2014test server_fns::users::tests::authority::user_mutations_wait_for_actor_revocation_and_recheck_after_commit ... ok2015test server_fns::users::tests::concurrency::the_last_admin_cannot_be_demoted_or_deactivated ... ok2016test server_fns::users::tests::concurrency::unchanged_admin_access_is_allowed ... ok2017test server_fns::users::tests::authority::active_administrator_can_create_change_roles_and_deactivate ... ok2018test server_fns::users::tests::concurrency::repeatable_read_default_cannot_remove_every_administrator ... ok2019test server_fns::users::tests::authority::duplicate_creation_rolls_back_and_leaves_access_changes_usable ... ok2020test server_fns::users::tests::authority::foreign_and_unknown_actors_cannot_change_local_user_access ... ok20212022failures:20232024---- reports::streaming::database_tests::scoped_time::grouped::grouped_csv_preserves_distinct_ids_beyond_ten_thousand_groups stdout ----20252026thread 'reports::streaming::database_tests::scoped_time::grouped::grouped_csv_preserves_distinct_ids_beyond_ten_thousand_groups' (6110) panicked at crates/horae/src/reports/streaming/database_tests.rs:46:10:2027called `Result::unwrap()` on an `Err` value: Error { inner: Error { inner: Error { inner: Custom { kind: Other, error: "CSV download failed: 504 Gateway Timeout" } } } }20282029---- server_fns::importers::commands::tests::authorized_job_lifecycle_and_duplicate_retention_work_with_one_connection stdout ----20302031thread 'server_fns::importers::commands::tests::authorized_job_lifecycle_and_duplicate_retention_work_with_one_connection' (6971) panicked at crates/horae/src/server_fns/importers/commands/tests.rs:503:6:2032authorized commands must not acquire a second connection: Elapsed(())20332034---- server_fns::invoices::tests::invoice_defaults_edit_rechecks_status_after_waiting_for_a_concurrent_send stdout ----20352036thread 'server_fns::invoices::tests::invoice_defaults_edit_rechecks_status_after_waiting_for_a_concurrent_send' (7834) panicked at crates/horae/src/server_fns/test_seed.rs:31:14:2037operation must wait for the competing transaction: Elapsed(())203820392040failures:2041 reports::streaming::database_tests::scoped_time::grouped::grouped_csv_preserves_distinct_ids_beyond_ten_thousand_groups2042 server_fns::importers::commands::tests::authorized_job_lifecycle_and_duplicate_retention_work_with_one_connection2043 server_fns::invoices::tests::invoice_defaults_edit_rechecks_status_after_waiting_for_a_concurrent_send20442045test result: FAILED. 1490 passed; 3 failed; 11 ignored; 0 measured; 0 filtered out; finished in 3219.46s20462047error: test failed, to rerun pass `-p horae --bin horae`