numtide/horae build #657 failed ← #656 #658 →
eval warnings
2 kinds
· 2 occurrences
- warn setting 'accept-flake-config' is ignored: iets never applies a flake's nixConfig, so a flake that sets extra-substituters or allow-import-from-derivation there runs without them; put the settings in nix.conf ×1
- warn setting 'plugin-files' is ignored: iets loads no plugins ×1
2 failed
| status | attribute | duration |
|---|---|---|
checks.x86_64-linux.browser
|
49m 11s | |
horae-browser-checks: 2026-10-12 21:35:52.735 UTC [19] LOG: checkpoint complete: wrote 76 buffers (0.5%); 0 WAL file(s) added, 0 removed, 0 recycled; write=7.7 …horae-browser-checks: 2026-10-12 21:35:52.735 UTC [19] LOG: checkpoint complete: wrote 76 buffers (0.5%); 0 WAL file(s) added, 0 removed, 0 recycled; write=7.787 s, sync=0.001 s, total=7.812 s; sync files=0, longest=0.000 s, average=0.000 s; distance=307 kB, estimate=5578 kB; lsn=0/1C5A580, redo lsn=0/1C4B320 2026-10-12 21:40:42.782 UTC [18] LOG: received fast shutdown request 2026-10-12 21:40:42.793 UTC [18] LOG: aborting any active transactions 2026-10-12 21:40:42.849 UTC [18] LOG: background worker "logical replication launcher" (PID 24) exited with exit code 1 2026-10-12 21:40:42.851 UTC [19] LOG: shutting down 2026-10-12 21:40:42.860 UTC [19] LOG: checkpoint starting: shutdown immediate 2026-10-12 21:40:42.959 UTC [19] LOG: checkpoint complete: wrote 29 buffers (0.2%); 0 WAL file(s) added, 0 removed, 0 recycled; write=0.079 s, sync=0.001 s, total=0.108 s; sync files=0, longest=0.000 s, average=0.000 s; distance=153 kB, estimate=5036 kB; lsn=0/1C71870, redo lsn=0/1C71870 2026-10-12 21:40:43.270 UTC [18] LOG: database system is shut down |
||
checks.x86_64-linux.tests
|
1h 1m | |
horae-tests-0.1.0: thread 'server_fns::invoices::tests::invoice_defaults_edit_rechecks_status_after_waiting_for_a_concurrent_send' (7834) panicked at crates/hor …horae-tests-0.1.0:
thread 'server_fns::invoices::tests::invoice_defaults_edit_rechecks_status_after_waiting_for_a_concurrent_send' (7834) panicked at crates/horae/src/server_fns/test_seed.rs:31:14:
operation must wait for the competing transaction: Elapsed(())
failures:
reports::streaming::database_tests::scoped_time::grouped::grouped_csv_preserves_distinct_ids_beyond_ten_thousand_groups
server_fns::importers::commands::tests::authorized_job_lifecycle_and_duplicate_retention_work_with_one_connection
server_fns::invoices::tests::invoice_defaults_edit_rechecks_status_after_waiting_for_a_concurrent_send
test result: FAILED. 1490 passed; 3 failed; 11 ignored; 0 measured; 0 filtered out; finished in 3219.46s
error: test failed, to rerun pass `-p horae --bin horae`
|
||
14 succeeded
| status | attribute | duration |
|---|---|---|
| loading… | ||
6 already built
| status | attribute | duration |
|---|---|---|
| loading… | ||