nixbot

builds

succeeded setup checks.x86_64-linux.tests · build #657 · raw

1this derivation will be built:2 /nix/store/m7b0h2gl698zy3s15ppka3c390785xva-horae-tests-0.1.0.drv3error: Cannot build '/nix/store/m7b0h2gl698zy3s15ppka3c390785xva-horae-tests-0.1.0.drv'.4 Reason: builder failed with exit code 101.5 Output paths:6 /nix/store/zm1x2nk35wcz4dcxbmgkwxaf9wvbqh8l-horae-tests-0.1.07 Last 25 log lines:8 >9 > ---- reports::streaming::database_tests::scoped_time::grouped::grouped_csv_preserves_distinct_ids_beyond_ten_thousand_groups stdout ----10 >11 > thread 'reports::streaming::database_tests::scoped_time::grouped::grouped_csv_preserves_distinct_ids_beyond_ten_thousand_groups' (6110) panicked at crates/horae/src/reports/streaming/database_tests.rs:46:10:12 > called `Result::unwrap()` on an `Err` value: Error { inner: Error { inner: Error { inner: Custom { kind: Other, error: "CSV download failed: 504 Gateway Timeout" } } } }13 >14 > ---- server_fns::importers::commands::tests::authorized_job_lifecycle_and_duplicate_retention_work_with_one_connection stdout ----15 >16 > thread 'server_fns::importers::commands::tests::authorized_job_lifecycle_and_duplicate_retention_work_with_one_connection' (6971) panicked at crates/horae/src/server_fns/importers/commands/tests.rs:503:6:17 > authorized commands must not acquire a second connection: Elapsed(())18 >19 > ---- server_fns::invoices::tests::invoice_defaults_edit_rechecks_status_after_waiting_for_a_concurrent_send stdout ----20 >21 > thread 'server_fns::invoices::tests::invoice_defaults_edit_rechecks_status_after_waiting_for_a_concurrent_send' (7834) panicked at crates/horae/src/server_fns/test_seed.rs:31:14:22 > operation must wait for the competing transaction: Elapsed(())23 >24 >25 > failures:26 > reports::streaming::database_tests::scoped_time::grouped::grouped_csv_preserves_distinct_ids_beyond_ten_thousand_groups27 > server_fns::importers::commands::tests::authorized_job_lifecycle_and_duplicate_retention_work_with_one_connection28 > server_fns::invoices::tests::invoice_defaults_edit_rechecks_status_after_waiting_for_a_concurrent_send29 >30 > test result: FAILED. 1490 passed; 3 failed; 11 ignored; 0 measured; 0 filtered out; finished in 3219.46s31 >32 > error: test failed, to rerun pass `-p horae --bin horae`33 For full logs, run:34 nix log /nix/store/m7b0h2gl698zy3s15ppka3c390785xva-horae-tests-0.1.0.drv