setup
checks.aarch64-darwin.tests
· build #50
· raw
1this derivation will be built:2 /nix/store/xd5af0fxq25fawfxh6lafqh058indagq-horae-tests-0.1.0.drv3error: build of '/nix/store/xd5af0fxq25fawfxh6lafqh058indagq-horae-tests-0.1.0.drv' on 'grpc://farm.numtide.com:50051?client-cert=/run/secrets/vars/per-machine/bld1/nix-farm-ci/crt&client-key=/run/secrets/vars/per-machine/bld1/nix-farm-ci/key&connect-timeout=20&system=aarch64-darwin' failed: Cannot build '/nix/store/xd5af0fxq25fawfxh6lafqh058indagq-horae-tests-0.1.0.drv'.4 Reason: builder failed with exit code 101.5 Output paths:6 /nix/store/3093wjfzjcgq4hp7jlxlmv0lkrwfmjq5-horae-tests-0.1.07 Last 25 log lines:8 > ---- importers::harvest::engine_tests::completed_imports_allow_immediate_retries stdout ----9 >10 > thread 'importers::harvest::engine_tests::completed_imports_allow_immediate_retries' (89260905) panicked at crates/horae/src/importers/harvest/engine_tests.rs:133:14:11 > called `Result::unwrap()` on an `Err` value: error communicating with database: Socket is not connected (os error 57)12 >13 > Caused by:14 > Socket is not connected (os error 57)15 > note: run with `RUST_BACKTRACE=1` environment variable to display a backtrace16 >17 > ---- server_fns::importers::authorization_tests::job_endpoints_enforce_session_role_and_organization stdout ----18 >19 > thread 'server_fns::importers::authorization_tests::job_endpoints_enforce_session_role_and_organization' (89264325) panicked at crates/horae/src/server_fns/importers/authorization_tests.rs:438:6:20 > called `Result::unwrap()` on an `Err` value: error communicating with database: Socket is not connected (os error 57)21 >22 > Caused by:23 > Socket is not connected (os error 57)24 >25 >26 > failures:27 > importers::harvest::engine_tests::completed_imports_allow_immediate_retries28 > server_fns::importers::authorization_tests::job_endpoints_enforce_session_role_and_organization29 >30 > test result: FAILED. 860 passed; 2 failed; 10 ignored; 0 measured; 0 filtered out; finished in 75.89s31 >32 > error: test failed, to rerun pass `-p horae --bin horae`33 For full logs, run:34 nix log /nix/store/xd5af0fxq25fawfxh6lafqh058indagq-horae-tests-0.1.0.drv35error: Cannot build '/nix/store/xd5af0fxq25fawfxh6lafqh058indagq-horae-tests-0.1.0.drv'.36 Reason: builder failed with exit code 1.37 Output paths:38 /nix/store/3093wjfzjcgq4hp7jlxlmv0lkrwfmjq5-horae-tests-0.1.0