failed attributes
| status |
attribute |
duration |
| failed |
checks.aarch64-darwin.e2e
|
13m 50s |
setup:
/nix/store/m5fgs9fpb4iy7wdafl1zhickdrcrhf0f-closure-info.drv
/nix/store/5jbxpm608gysgjr4yal4j5b96y69r7bs-run-nixos-vm.drv
/nix/store/dhhfmzqyy2s5dz …
setup:
/nix/store/m5fgs9fpb4iy7wdafl1zhickdrcrhf0f-closure-info.drv
/nix/store/5jbxpm608gysgjr4yal4j5b96y69r7bs-run-nixos-vm.drv
/nix/store/dhhfmzqyy2s5dzg4bpdr712lz4q99dh1-nixos-vm.drv
/nix/store/7gg15y36pva5h8mh4f6qj70xk6xpp7jd-driverConfiguration.json.drv
/nix/store/8zw17il74fp47vnm31scdiwshx4qrv91-nixos-test-driver-horae-e2e.drv
/nix/store/h2d5i0g8pgdxr0nh14gwmc4j8xrbcm4c-vm-test-run-horae-e2e.drv
Failed to find a machine for remote build!
derivation: h2d5i0g8pgdxr0nh14gwmc4j8xrbcm4c-vm-test-run-horae-e2e.drv
required (system, features): (aarch64-darwin, [apple-virt, nixos-test])
12 available machines:
(systems, maxjobs, supportedFeatures, mandatoryFeatures)
([aarch64-darwin], 8, [big-parallel, kvm, nixos-test, uid-range], [])
([aarch64-darwin], 8, [big-parallel, kvm, nixos-test, uid-range], [])
([aarch64-darwin], 8, [big-parallel, kvm, nixos-test, uid-range], [])
([aarch64-darwin], 8, [big-parallel, kvm, nixos-test, uid-range], [])
([aarch64-linux], 8, [big-parallel, kvm, nixos-test, uid-range], [])
([aarch64-linux], 8, [big-parallel…
error: Cannot build '/nix/store/h2d5i0g8pgdxr0nh14gwmc4j8xrbcm4c-vm-test-run-horae-e2e.drv'.
Reason: platform mismatch
Required system: 'aarch64-darwin'
Current system: 'x86_64-linux'
Reason: missing system features
Required features: {apple-virt, nixos-test}
Available features: {benchmark, big-parallel, ca-derivations, kvm, nixos-test, recursive-nix, uid-range}
|
| failed |
checks.aarch64-darwin.e2e-oidc
|
12m 21s |
setup:
/nix/store/hynqmzrj1ipdgs5idz6fplhl0kava6ap-closure-info.drv
/nix/store/wb4zcdg364vcra0h1vsdajgpryqjb1ql-run-nixos-vm.drv
/nix/store/xlh9zmsyqaqsmw …
setup:
/nix/store/hynqmzrj1ipdgs5idz6fplhl0kava6ap-closure-info.drv
/nix/store/wb4zcdg364vcra0h1vsdajgpryqjb1ql-run-nixos-vm.drv
/nix/store/xlh9zmsyqaqsmwcjvwdnqsg2z1s6qqf8-nixos-vm.drv
/nix/store/yi10ja51pv7pc28wa62fbmmmwawn61fg-driverConfiguration.json.drv
/nix/store/5f461ffmlj26qj5knf9gr9whrbjc9s7q-nixos-test-driver-horae-e2e-oidc.drv
/nix/store/yfs081jm5qnkj2blmjj3m4736vlngj2x-vm-test-run-horae-e2e-oidc.drv
Failed to find a machine for remote build!
derivation: yfs081jm5qnkj2blmjj3m4736vlngj2x-vm-test-run-horae-e2e-oidc.drv
required (system, features): (aarch64-darwin, [apple-virt, nixos-test])
12 available machines:
(systems, maxjobs, supportedFeatures, mandatoryFeatures)
([aarch64-darwin], 8, [big-parallel, kvm, nixos-test, uid-range], [])
([aarch64-darwin], 8, [big-parallel, kvm, nixos-test, uid-range], [])
([aarch64-darwin], 8, [big-parallel, kvm, nixos-test, uid-range], [])
([aarch64-darwin], 8, [big-parallel, kvm, nixos-test, uid-range], [])
([aarch64-linux], 8, [big-parallel, kvm, nixos-test, uid-range], [])
([aarch64-linux], 8, [big-par…
error: Cannot build '/nix/store/yfs081jm5qnkj2blmjj3m4736vlngj2x-vm-test-run-horae-e2e-oidc.drv'.
Reason: platform mismatch
Required system: 'aarch64-darwin'
Current system: 'x86_64-linux'
Reason: missing system features
Required features: {apple-virt, nixos-test}
Available features: {benchmark, big-parallel, ca-derivations, kvm, nixos-test, recursive-nix, uid-range}
|
| failed |
checks.aarch64-darwin.tests
|
29m 7s |
horae-tests-0.1.0:
called `Result::unwrap()` on an `Err` value: error communicating with database: Socket is not connected (os error 57)
Caused by:
Socket i …
horae-tests-0.1.0:
called `Result::unwrap()` on an `Err` value: error communicating with database: Socket is not connected (os error 57)
Caused by:
Socket is not connected (os error 57)
failures:
importers::harvest::engine_tests::completed_imports_allow_immediate_retries
server_fns::importers::authorization_tests::job_endpoints_enforce_session_role_and_organization
test result: FAILED. 860 passed; 2 failed; 10 ignored; 0 measured; 0 filtered out; finished in 75.89s
error: test failed, to rerun pass `-p horae --bin horae`
|
| failed |
checks.aarch64-linux.e2e
|
8m 23s |
vm-test-run-horae-e2e:
)
^
File "/nix/store/yv2q67grjgrymd498bgdfzlhyaj04cqv-nixos-test-driver-1.1/lib/python3.13/site-packages/test_driver/machine/__ …
vm-test-run-horae-e2e:
)
^
File "/nix/store/yv2q67grjgrymd498bgdfzlhyaj04cqv-nixos-test-driver-1.1/lib/python3.13/site-packages/test_driver/machine/__init__.py", line 878, in _execute
self.connect()
~~~~~~~~~~~~^^
File "/nix/store/yv2q67grjgrymd498bgdfzlhyaj04cqv-nixos-test-driver-1.1/lib/python3.13/site-packages/test_driver/machine/__init__.py", line 1057, in connect
raise RuntimeError("Shell did not start in time")
RuntimeError: Shell did not start in time
|
| failed |
checks.aarch64-linux.e2e-oidc
|
7m 46s |
vm-test-run-horae-e2e-oidc:
)
^
File "/nix/store/yv2q67grjgrymd498bgdfzlhyaj04cqv-nixos-test-driver-1.1/lib/python3.13/site-packages/test_driver/machi …
vm-test-run-horae-e2e-oidc:
)
^
File "/nix/store/yv2q67grjgrymd498bgdfzlhyaj04cqv-nixos-test-driver-1.1/lib/python3.13/site-packages/test_driver/machine/__init__.py", line 878, in _execute
self.connect()
~~~~~~~~~~~~^^
File "/nix/store/yv2q67grjgrymd498bgdfzlhyaj04cqv-nixos-test-driver-1.1/lib/python3.13/site-packages/test_driver/machine/__init__.py", line 1057, in connect
raise RuntimeError("Shell did not start in time")
RuntimeError: Shell did not start in time
|
| failed |
checks.aarch64-linux.tests
|
18m 52s |
horae-tests-0.1.0:
thread 'server_fns::importers::authorization_tests::job_endpoints_enforce_session_role_and_organization' (21227) panicked at crates/horae/src …
horae-tests-0.1.0:
thread 'server_fns::importers::authorization_tests::job_endpoints_enforce_session_role_and_organization' (21227) panicked at crates/horae/src/server_fns/importers/authorization_tests/cli.rs:75:13:
assertion `left == right` failed: ["import", "harvest-csv", "/build/.tmpHKK0D0/source.csv", "--dry-run"]: {"error":{"category":"indeterminate_submission","message":"Submission acknowledgement unavailable; resubmit identical input with the same request ID"},"operation":"import.harvest-csv","outcome":"error","request_id":"01a11256-2e48-7272-bfd6-261ee8d38cb0","version":1}
left: 6
right: 1
failures:
server_fns::importers::authorization_tests::job_endpoints_enforce_session_role_and_organization
test result: FAILED. 861 passed; 1 failed; 11 ignored; 0 measured; 0 filtered out; finished in 146.01s
error: test failed, to rerun pass `-p horae --bin horae`
|