setup
checks.aarch64-linux.tests
· build #377
· raw
1this derivation will be built:2 /nix/store/6lk4ik3scdalh7ggk22dqnpi1x61s5sq-horae-tests-0.1.0.drv3error: build of '/nix/store/6lk4ik3scdalh7ggk22dqnpi1x61s5sq-horae-tests-0.1.0.drv' on 'grpc://farm.numtide.com:50051?client-cert=/run/secrets/vars/per-machine/bld1/nix-farm-ci/crt&client-key=/run/secrets/vars/per-machine/bld1/nix-farm-ci/key&connect-timeout=22&system=aarch64-linux' failed: Cannot build '/nix/store/6lk4ik3scdalh7ggk22dqnpi1x61s5sq-horae-tests-0.1.0.drv'.4 Reason: builder failed with exit code 101.5 Output paths:6 /nix/store/z2qcyn6sd0c0zf6spvj6vashnaik5c1q-horae-tests-0.1.07 Last 25 log lines:8 > ---- server_fns::importers::authorization_tests::job_endpoints_enforce_session_role_and_organization stdout ----9 > Request ID: 01a11884-8bfb-7f80-b172-b381060abca210 > Request ID: 01a11884-8c06-7753-8781-812a6541431e11 > Request ID: 01a11884-8c4e-72c3-b820-e056932c78ae12 > Request ID: 01a11884-8c59-7141-a0a1-a9c8cc1bdb2113 >14 > thread 'server_fns::importers::authorization_tests::job_endpoints_enforce_session_role_and_organization' (5614) panicked at crates/horae/src/server_fns/importers/authorization_tests/cli.rs:75:13:15 > assertion `left == right` failed: ["import", "harvest-csv", "/build/.tmpUjhmeV/source.csv", "--dry-run"]: {"error":{"category":"indeterminate_submission","message":"Submission acknowledgement unavailable; resubmit identical input with the same request ID"},"operation":"import.harvest-csv","outcome":"error","request_id":"01a11884-8c59-7141-a0a1-a9c8cc1bdb21","version":1}16 > left: 617 > right: 118 >19 > ---- server_fns::permissions::project_management_tests::legacy_project_lock_returns_busy_instead_of_forming_an_org_fk_cycle stdout ----20 >21 > thread 'server_fns::permissions::project_management_tests::legacy_project_lock_returns_busy_instead_of_forming_an_org_fk_cycle' (7142) panicked at crates/horae/src/server_fns/permissions/tests/project_management.rs:797:5:22 > Ok(ProjectManagersOutcome { project_id: 01a11885-f31d-75b1-84e5-866b33319a76, access_revision: 1, changed: true })23 >24 >25 > failures:26 > reports::streaming::database_tests::authorization::streamed_cancelled_authorization_reclaims_its_single_connection27 > server_fns::importers::authorization_tests::job_endpoints_enforce_session_role_and_organization28 > server_fns::permissions::project_management_tests::legacy_project_lock_returns_busy_instead_of_forming_an_org_fk_cycle29 >30 > test result: FAILED. 1093 passed; 3 failed; 11 ignored; 0 measured; 0 filtered out; finished in 296.18s31 >32 > error: test failed, to rerun pass `-p horae --bin horae`33 For full logs, run:34 nix log /nix/store/6lk4ik3scdalh7ggk22dqnpi1x61s5sq-horae-tests-0.1.0.drv35error: Cannot build '/nix/store/6lk4ik3scdalh7ggk22dqnpi1x61s5sq-horae-tests-0.1.0.drv'.36 Reason: builder failed with exit code 1.37 Output paths:38 /nix/store/z2qcyn6sd0c0zf6spvj6vashnaik5c1q-horae-tests-0.1.0