nixbot

builds

numtide/horae build #377 failed

branch integration/scoped-time-csv-prerequisites · PR #264 · commit 1be265bd89 · · took 2h 16m · eval 19s

2 failed
failed attributes
status attribute duration
failed checks.aarch64-linux.tests 18m 35s
horae-tests-0.1.0: thread 'server_fns::permissions::project_management_tests::legacy_project_lock_returns_busy_instead_of_forming_an_org_fk_cycle' (7142) panick …
horae-tests-0.1.0:
thread 'server_fns::permissions::project_management_tests::legacy_project_lock_returns_busy_instead_of_forming_an_org_fk_cycle' (7142) panicked at crates/horae/src/server_fns/permissions/tests/project_management.rs:797:5:
Ok(ProjectManagersOutcome { project_id: 01a11885-f31d-75b1-84e5-866b33319a76, access_revision: 1, changed: true })
failures:
    reports::streaming::database_tests::authorization::streamed_cancelled_authorization_reclaims_its_single_connection
    server_fns::importers::authorization_tests::job_endpoints_enforce_session_role_and_organization
    server_fns::permissions::project_management_tests::legacy_project_lock_returns_busy_instead_of_forming_an_org_fk_cycle
test result: FAILED. 1093 passed; 3 failed; 11 ignored; 0 measured; 0 filtered out; finished in 296.18s
error: test failed, to rerun pass `-p horae --bin horae`
failed checks.x86_64-linux.tests 7m 43s
horae-tests-0.1.0: failures: ---- reports::streaming::database_tests::authorization::streamed_cancelled_fetch_reclaims_connection_without_authority_locks stdout …
horae-tests-0.1.0:
failures:
---- reports::streaming::database_tests::authorization::streamed_cancelled_fetch_reclaims_connection_without_authority_locks stdout ----
thread 'reports::streaming::database_tests::authorization::streamed_cancelled_fetch_reclaims_connection_without_authority_locks' (4416) panicked at crates/horae/src/reports/streaming/database_tests/authorization.rs:682:6:
cancelled export must close its connection: Elapsed(())
failures:
    reports::streaming::database_tests::authorization::streamed_cancelled_fetch_reclaims_connection_without_authority_locks
test result: FAILED. 1095 passed; 1 failed; 11 ignored; 0 measured; 0 filtered out; finished in 275.58s
error: test failed, to rerun pass `-p horae --bin horae`
14 succeeded
succeeded attributes
status attribute duration
loading…
4 already built
skipped attributes
status attribute duration
loading…