horae-tests-0.1.0
checks.x86_64-linux.tests
· build #338
· raw
unpackPhase
1unpacking source archive /nix/store/gmzk65pdhc24v5daxcs476fzsjbbrn2y-source2source root is sourcepatchPhase
3Executing configureCargoCommonVars4decompressing cargo artifacts from /nix/store/p0fga5r55aw5iwdy8h0dpr32lhcczl5i-horae-checks-deps-0.1.0/target.tar.zst to targetconfigurePhase
5will append /build/source/.cargo-home/config.toml with contents of /nix/store/i0bj632any4bjpvnl84zc2h7cq8zn0mz-vendor-cargo-deps/config.toml6default configurePhase, nothing to dobuildPhase
7+++ command cargo nextest run -p horae-core8 Compiling proc-macro2 v1.0.1069 Compiling serde_core v1.0.22810 Compiling serde v1.0.22811 Compiling num-traits v0.2.1912 Compiling quote v1.0.4613 Compiling syn v2.0.11814 Compiling uuid v1.23.415 Compiling serde_derive v1.0.22816 Compiling thiserror-impl v2.0.1817 Compiling thiserror v2.0.1818 Compiling chrono v0.4.4519 Compiling horae-core v0.1.0 (/build/source/crates/core)20 Finished `test` profile [unoptimized + debuginfo] target(s) in 6.67s21------------22 Nextest run ID a507b48a-0921-402a-bb74-eb51f829400b with nextest profile: default23 Starting 121 tests across 1 binary24 Running [ 00:00:00] 0/121: 38 running, 0 passed, 0 skipped 25 [ 00:00:00] horae-core ed_alert_threshold_is_exact_without_rounding26 [ 00:00:00] horae-core ert_accepts_zero_percent_but_not_zero_budget27 [ 00:00:00] horae-core ::a_single_jump_announces_every_crossed_band28 [ 00:00:00] horae-core jects_invalid_inputs_and_widens_large_values29 [ 00:00:00] horae-core percentage_rounds_clamps_and_never_overflows30 [ 00:00:00] horae-core ::tests::current_band_is_the_highest_reached31 [ 00:00:00] horae-core dget::tests::each_crossing_is_announced_once32 [ 00:00:00] horae-core elow_a_band_does_not_fire_but_current_resets33 Running [ 00:00:00] =======> 120/121: 1 running, 120 passed, 0 skipped 34 [ 00:00:00] horae-core s::conversion_matches_exact_scaled_rationals3536373839404142 PASS [ 0.008s] horae-core client::tests::profile_accepts_supported_currencies_and_unicode_character_limit43 PASS [ 0.008s] horae-core budget::tests::a_single_jump_announces_every_crossed_band44 PASS [ 0.008s] horae-core client::tests::default_rate_rejects_negative_fractional_cent_overflow_and_invalid_text45 PASS [ 0.008s] horae-core budget::tests::configured_alert_accepts_zero_percent_but_not_zero_budget46 PASS [ 0.011s] horae-core duration::tests::parse_decimal_rounds_half_minutes_exactly47 PASS [ 0.011s] horae-core duration::tests::format_round_trip48 PASS [ 0.011s] horae-core duration::tests::format_clamps_negative_to_zero49 PASS [ 0.011s] horae-core budget::tests::current_band_is_the_highest_reached50 PASS [ 0.011s] horae-core budget::tests::configured_alert_rejects_invalid_inputs_and_widens_large_values51 PASS [ 0.011s] horae-core budget::tests::large_values_do_not_overflow52 PASS [ 0.011s] horae-core budget::tests::display_percentage_rounds_clamps_and_never_overflows53 PASS [ 0.011s] horae-core importers::harvest::convert::tests::conversion_reports_precision_and_numerator_limits54 PASS [ 0.011s] horae-core budget::tests::over_budget_fires_even_without_a_configured_100_band55 PASS [ 0.011s] horae-core duration::tests::parse_rejects_negative_non_finite_and_malformed_values56 PASS [ 0.011s] horae-core budget::tests::each_crossing_is_announced_once57 PASS [ 0.011s] horae-core client::tests::profile_rejects_blank_overlong_and_null_names58 PASS [ 0.013s] horae-core duration::tests::parse_rejects_excessive_decimal_precision_and_numerator59 PASS [ 0.008s] horae-core budget::tests::configured_alert_threshold_is_exact_without_rounding60 PASS [ 0.015s] horae-core client::tests::optional_text_normalizes_only_blank_fields61 PASS [ 0.015s] horae-core client::tests::profile_rejects_unsupported_currency_and_null_billing_fields62 PASS [ 0.015s] horae-core duration::tests::parse_decimal63 PASS [ 0.015s] horae-core client::tests::default_rate_preserves_absence_zero_and_exact_large_amounts64 PASS [ 0.015s] horae-core duration::tests::parse_colon65 PASS [ 0.015s] horae-core importers::harvest::convert::tests::conversion_preserves_the_i64_boundary_and_rejects_rounding_past_it66 PASS [ 0.015s] horae-core duration::tests::parse_rejects_colon_overflow_without_panicking67 PASS [ 0.015s] horae-core budget::tests::no_band_for_zero_or_missing_budget68 PASS [ 0.005s] horae-core importers::harvest::types::tests::reconciles_when_errored_counts_match_collected_errors69 Running [ 00:00:00] =======> 120/121: 1 running, 120 passed, 0 skipped 70 [ 00:00:00] horae-core s::conversion_matches_exact_scaled_rationals7172737475767778 PASS [ 0.005s] horae-core importers::harvest::keys::tests::project_key_prefers_code_when_present79 PASS [ 0.005s] horae-core importers::harvest::types::account_switch_tests::account_switch_requires_binding_and_no_imports_or_active_work80 PASS [ 0.005s] horae-core importers::harvest::types::tests::import_modes_display_their_wire_names81 PASS [ 0.006s] horae-core importers::harvest::keys::tests::task_key_shared_across_projects82 PASS [ 0.006s] horae-core importers::harvest::keys::tests::occurrence_counter_numbers_repeats_from_zero83 PASS [ 0.006s] horae-core importers::harvest::keys::tests::occurrence_counter_keys_are_independent84 PASS [ 0.017s] horae-core importers::harvest::convert::tests::garbage_is_rejected85 PASS [ 0.013s] horae-core importers::harvest::convert::tests::negative_is_rejected86 PASS [ 0.017s] horae-core duration::tests::parse_round_trips_each_minute_in_a_day87 PASS [ 0.017s] horae-core importers::harvest::convert::tests::conversion_rejects_unrepresentable_scaled_values_without_panicking88 PASS [ 0.017s] horae-core duration::tests::format_hhmm_pads_minutes89 PASS [ 0.017s] horae-core importers::harvest::convert::tests::conversion_handles_high_precision_without_intermediate_overflow90 PASS [ 0.017s] horae-core duration::tests::parse_preserves_u32_boundary_without_saturating91 PASS [ 0.017s] horae-core importers::harvest::convert::tests::high_precision_fraction_straddles_the_half_minute_exactly92 PASS [ 0.013s] horae-core importers::harvest::convert::tests::hours_common_values_are_exact93 PASS [ 0.017s] horae-core duration::tests::minutes_between_is_exact_no_minimum94 PASS [ 0.017s] horae-core budget::tests::drop_below_a_band_does_not_fire_but_current_resets95 PASS [ 0.008s] horae-core invoice::tests::discount_allocation_conserves_header_amount_and_bounds_each_line96 PASS [ 0.015s] horae-core importers::harvest::convert::tests::money_rounds_third_decimal_half_up97 PASS [ 0.016s] horae-core importers::harvest::keys::tests::composite_components_do_not_collide98 PASS [ 0.009s] horae-core importers::harvest::keys::tests::time_entry_key_distinguishes_and_matches99 PASS [ 0.010s] horae-core importers::harvest::types::tests::archived_errors_and_new_inline_errors_reconcile_across_batches100 PASS [ 0.015s] horae-core importers::harvest::convert::tests::money_common_values_are_exact101 PASS [ 0.011s] horae-core importers::harvest::keys::tests::project_key_falls_back_to_client_and_name102 PASS [ 0.015s] horae-core importers::harvest::keys::tests::normalize_trims_and_case_folds103 Running [ 00:00:00] =======> 120/121: 1 running, 120 passed, 0 skipped 104 [ 00:00:00] horae-core s::conversion_matches_exact_scaled_rationals105106107108109110111112 PASS [ 0.011s] horae-core importers::harvest::types::tests::does_not_reconcile_when_an_errored_count_has_no_reported_error113 PASS [ 0.016s] horae-core importers::harvest::keys::tests::client_key_equal_across_case_and_whitespace114 PASS [ 0.016s] horae-core importers::harvest::convert::tests::leading_and_trailing_forms_parse115 PASS [ 0.016s] horae-core importers::harvest::convert::tests::money_round_trip_against_exporter_transform116 PASS [ 0.005s] horae-core invoice::tests::resolve_rate_cascade117 PASS [ 0.017s] horae-core importers::harvest::convert::tests::round_half_up_at_the_boundary118 PASS [ 0.007s] horae-core invoice::tests::discount_allocation_supports_maximum_representable_subtotal119 PASS [ 0.006s] horae-core money::tests::parse_cents_is_exact_where_a_float_would_drift120 PASS [ 0.006s] horae-core money::tests::format_cents_groups_thousands_and_keeps_sign121 PASS [ 0.005s] horae-core money::tests::parse_cents_tolerates_grouping_spaces_and_signs122 PASS [ 0.026s] horae-core importers::harvest::convert::tests::hours_round_trip_against_exporter_transform123 PASS [ 0.013s] horae-core invoice::tests::discount_allocation_handles_empty_zero_and_full_discounts124 PASS [ 0.026s] horae-core importers::harvest::keys::tests::normalize_matches_sql_harvest_norm_contract125 PASS [ 0.013s] horae-core invoice::tests::invoice_adjustments_round_components_half_up126 PASS [ 0.013s] horae-core invoice::tests::discounted_fee_contribution_leaves_discount_available127 PASS [ 0.012s] horae-core invoice::tests::line_amount_odd_minutes128 PASS [ 0.012s] horae-core money::tests::addition_rejects_overflow_in_both_directions129 PASS [ 0.013s] horae-core invoice::tests::discount_allocation_uses_largest_remainder_then_stable_source_order130 PASS [ 0.013s] horae-core invoice::tests::line_amount_90_minutes131 PASS [ 0.012s] horae-core project::tests::basics_reject_blank_and_overlong_names132 PASS [ 0.011s] horae-core invoice::tests::selected_rate_mode_ignores_unselected_rate_sources133 PASS [ 0.013s] horae-core invoice::tests::invoice_adjustments_reject_negative_subtotal_and_overflow134 PASS [ 0.012s] horae-core invoice::tests::line_amount_zero_rate135 PASS [ 0.012s] horae-core money::tests::addition_retains_currency_checks_and_representable_boundaries136 PASS [ 0.012s] horae-core invoice::tests::line_amount_rejects_unrepresentable_results137 PASS [ 0.012s] horae-core project::tests::basics_accept_same_day_but_reject_reversed_dates138 Running [ 00:00:00] =======> 120/121: 1 running, 120 passed, 0 skipped 139 [ 00:00:00] horae-core s::conversion_matches_exact_scaled_rationals140141142143144145146147 PASS [ 0.012s] horae-core money::tests::parse_cents_reads_whole_and_fractional_amounts148 PASS [ 0.012s] horae-core project::tests::basics_accept_supported_currencies_and_optional_dates149 PASS [ 0.012s] horae-core invoice::tests::line_amount_accepts_large_representable_amounts150 PASS [ 0.012s] horae-core money::tests::format_cents_plain_keeps_sign_below_one_unit151 PASS [ 0.012s] horae-core invoice::tests::selected_rate_keeps_zero_and_explicit_missing_project_rate152 PASS [ 0.011s] horae-core invoice::tests::line_amount_half_hour153 PASS [ 0.005s] horae-core project::tests::monthly_fee_dates_reject_invalid_calendar_inputs154 PASS [ 0.013s] horae-core invoice::tests::line_amount_rounds_half_cents_up_not_to_even155 PASS [ 0.013s] horae-core invoice::tests::discount_allocation_rejects_negative_lines_and_subtotal_overflow156 PASS [ 0.012s] horae-core money::tests::parse_cents_rejects_what_it_cannot_represent157 PASS [ 0.011s] horae-core project::tests::fee_schedules_reject_missing_overlong_and_excessive_milestones158 PASS [ 0.011s] horae-core project::tests::monthly_fee_dates_follow_calendar_months159 PASS [ 0.006s] horae-core rounding::tests::identity_when_inc_zero160 PASS [ 0.012s] horae-core project::tests::monetary_budgets_are_only_available_for_time_and_materials161 PASS [ 0.005s] horae-core time_of_day::tests::format_12h_matches_harvest_style162 PASS [ 0.007s] horae-core project::tests::payment_terms_support_receipt_and_checked_days163 PASS [ 0.016s] horae-core invoice::tests::invoice_adjustments_apply_discount_before_non_compounding_taxes164 PASS [ 0.009s] horae-core state::tests::invoiced_is_final165 PASS [ 0.009s] horae-core rounding::tests::effective_minutes_respect_frozen_history_including_zero166 PASS [ 0.017s] horae-core invoice::tests::line_amount_exact_hour167 PASS [ 0.016s] horae-core invoice::tests::line_amount_zero_minutes168 PASS [ 0.009s] horae-core rounding::tests::result_is_multiple_of_inc169 PASS [ 0.009s] horae-core project::tests::percentage_rejects_invalid_precision_range_and_syntax170 PASS [ 0.017s] horae-core project::tests::basics_reject_overlong_code_and_unsupported_currency171 PASS [ 0.009s] horae-core project::tests::percentage_preserves_exact_hundredths172 PASS [ 0.009s] horae-core time_of_day::tests::clamp_to_day_prevents_crossing_midnight173 PASS [ 0.004s] horae-core week::tests::configured_week_can_start_in_the_previous_year174 PASS [ 0.010s] horae-core rounding::tests::nearest_ties_round_up175 Running [ 00:00:00] =======> 120/121: 1 running, 120 passed, 0 skipped 176 [ 00:00:00] horae-core s::conversion_matches_exact_scaled_rationals177178179180181182183184 PASS [ 0.005s] horae-core time_of_day::tests::parse_rejects_out_of_range_and_garbage185 PASS [ 0.005s] horae-core week::tests::maps_any_weekday_to_its_monday186 PASS [ 0.005s] horae-core time_of_day::tests::snap_rounds_to_nearest_step187 PASS [ 0.005s] horae-core week::tests::configured_week_reports_an_unrepresentable_start188 PASS [ 0.005s] horae-core time_of_day::tests::parse_reads_24h189 PASS [ 0.011s] horae-core state::tests::member_submit_and_reopen190 PASS [ 0.011s] horae-core rounding::tests::up_and_down191 PASS [ 0.007s] horae-core types::tests::budget_kind_wire_strings_match_db_enum192 PASS [ 0.007s] horae-core time_of_day::tests::format_round_trips193 PASS [ 0.007s] horae-core week::tests::configured_week_contains_each_day_for_all_seven_start_days194 PASS [ 0.018s] horae-core project::tests::fee_schedules_validate_amounts_and_milestone_total195 PASS [ 0.013s] horae-core state::tests::only_manager_can_approve196 PASS [ 0.013s] horae-core state::tests::managers_invoice_open_and_approved_time197 PASS [ 0.009s] horae-core time_of_day::tests::parse_reads_12h_including_edges198 Running [ 00:00:00] =======> 120/121: 1 running, 120 passed, 0 skipped 199 [ 00:00:00] horae-core s::conversion_matches_exact_scaled_rationals200201202203204205206207 PASS [ 0.067s] horae-core importers::harvest::convert::tests::conversion_matches_exact_scaled_rationals208------------209 Summary [ 0.068s] 121 tests run: 121 passed, 0 skipped210 Running [ 00:00:00] ======== 121/121: 1 running, 120 passed, 0 skipped 211 [ 00:00:00] horae-core s::conversion_matches_exact_scaled_rationals212213214215216217218219The files belonging to this database system will be owned by user "nixbld".220This user must also own the server process.221222The database cluster will be initialized with locale "C".223The default text search configuration will be set to "english".224225Data page checksums are disabled.226227fixing permissions on existing directory /build/tmp.RX20C9deSF ... ok228creating subdirectories ... ok229selecting dynamic shared memory implementation ... posix230selecting default "max_connections" ... 100231selecting default "shared_buffers" ... 128MB232selecting default time zone ... UTC233creating configuration files ... ok234running bootstrap script ... ok235performing post-bootstrap initialization ... ok236syncing data to disk ... ok237238initdb: warning: enabling "trust" authentication for local connections239initdb: hint: You can change this by editing pg_hba.conf or using the option -A, or --auth-local and --auth-host, the next time you run initdb.240241Success. You can now start the database server using:242243 pg_ctl -D /build/tmp.RX20C9deSF -l logfile start244245waiting for server to start.... done246server started247+++ command cargo test -p horae --features server248 Compiling horae v0.1.0 (/build/source/crates/horae)249 Compiling horae-core v0.1.0 (/build/source/crates/core)250 Finished `test` profile [unoptimized + debuginfo] target(s) in 2m 25s251 Running unittests src/main.rs (target/debug/deps/horae-0767924faa118e50)252253running 847 tests254test auth::oidc::tests::deactivated_subject_match_is_denied ... ok255test auth::oidc::tests::first_login_links_subject_via_verified_email ... ok256test auth::page::tests::oidc_variant_uses_the_configured_label_and_hands_off_to_start ... ok257test cli::tests::environment_probe ... ok258test config::tests::dev_login_is_refused_off_loopback ... ok259test config::tests::environment::environment_probe ... ok260test cli::tests::remote_commands_reject_conflicting_or_unbounded_options ... ok261test cli::imports::tests::session_rejects_plaintext_remote_and_credential_bearing_urls ... ok262test cli::imports::tests::report_marks_confirmed_failed_outcomes_as_incomplete ... ok263test cli::imports::tests::missing_session_is_a_structured_configuration_failure ... ok264test auth::oidc::tests::deactivated_email_match_is_denied ... ok265test auth::oidc::tests::subject_match_takes_precedence_over_email ... ok266test cli::imports::tests::redirects_are_not_followed_or_exposed_as_server_error_text ... ok267test cli::imports::tests::session_rejects_public_permissions_and_symlinks ... ok268test auth::page::tests::dev_variant_offers_the_admin_bypass_and_no_fake_controls ... ok269test auth::oidc::tests::subject_match_logs_in_without_relinking ... ok270test cli::imports::tests::retry_snapshot_is_compatible_with_missing_and_future_values ... ok271test cli::imports::tests::malformed_submission_acknowledgement_retains_its_request_identity ... ok272test cli::imports::tests::api_submission_captures_generation_without_retrying_uncertain_acceptance ... ok273test cli::imports::tests::session_rejects_cookie_header_injection_without_echoing_the_value ... ok274test auth::oidc::tests::no_account_is_denied_not_provisioned ... ok275test auth::page::tests::configured_label_is_html_escaped ... ok276test auth::oidc::tests::unverified_email_is_not_matched ... ok277test config::tests::without_dev_login_any_bind_is_fine ... ok278test harvest::pagination_tests::harvest_pagination_total_pages_does_not_overflow ... ok279test cli::tests::remote_import_and_job_commands_accept_the_documented_arguments ... ok280test auth::oidc::tests::extra_audiences_are_trusted_only_when_listed ... ok281test config::tests::dev_login_is_allowed_on_loopback ... ok282test cli::imports::tests::csv_named_pipe_is_rejected_without_waiting_for_a_writer ... ok283test harvest::tests::page_window_defaults_and_checked_offsets ... ok284test cli::imports::tests::private_session_accepts_https_and_loopback_only ... ok285test config::tests::environment::obsolete_authentication_variables_do_not_configure_the_server ... ok286test cli::imports::tests::cancellation_racing_completion_does_not_claim_cancellation_was_requested ... ok287test db::tests::pool_connections_force_custom_plans ... ok288test cli::imports::tests::invalid_csv_files_fail_before_contacting_the_server ... ok289test cli::imports::tests::missing_and_mismatched_jobs_fail_without_substitution ... ok290test config::tests::environment::partial_oidc_configuration_remains_disabled_without_a_callback ... ok291test config::tests::environment::example_environment_can_configure_all_required_oidc_and_harvest_fields ... ok292test config::tests::environment::empty_environment_has_no_authentication_or_plugin_credentials ... ok293test cli::tests::default_command_uses_the_same_defaults_and_environment_as_serve ... ok294test importers::harvest::api_source::http::tests::cancelled_backoff_does_not_wait_or_retry ... ok295test importers::harvest::api_source::http::tests::cursor_links_are_authoritative_even_with_null_or_stale_page_numbers ... ok296test cli::imports::tests::archived_errors_publish_without_clobbering_and_preserve_the_prior_file_on_failure ... ok297test cli::imports::tests::status_and_wait_distinguish_failed_jobs_from_failed_reads ... ok298test config::tests::environment::job_attempt_limit_uses_the_documented_environment_variable ... ok299test importers::harvest::api_source::http::tests::missing_next_cursor_is_not_silently_treated_as_completed ... ok300test cli::imports::tests::ordinary_json_is_bounded_and_invalid_replies_are_not_echoed ... ok301test importers::harvest::api_source::http::tests::pagination_cycle_detection_survives_restarting_after_every_page ... ok302test cli::tests::default_command_rejects_invalid_environment_ports ... ok303test importers::harvest::api_source::http::tests::rejected_page_does_not_advance_the_cursor ... ok304test importers::harvest::api_source::http::tests::rejects_pagination_outside_the_authenticated_endpoint ... ok305test importers::harvest::api_source::http::tests::persisted_cursor_resumes_with_a_new_client_and_stays_complete_at_eof ... ok306test importers::harvest::api_source::http::tests::resumed_cursor_rejects_untrusted_destinations_and_invalid_state_before_http ... ok307test importers::harvest::api_source::tests::assembled_rows_convert_to_exact_minutes ... ok308test importers::harvest::api_source::tests::assembles_rows_joining_parents_by_id ... ok309test importers::harvest::api_source::tests::hours_render_as_exact_decimals ... ok310test importers::harvest::api_source::tests::json_exponents_expand_exactly_with_bounded_output ... ok311test importers::harvest::api_source::tests::http_page_preserves_decimal_values_before_integer_conversion ... ok312test importers::harvest::credentials::tests::bad_key_length_is_rejected ... ok313test config::tests::environment::mail_environment_requires_a_complete_valid_configuration ... ok314test config::tests::environment::secure_cookies_use_the_documented_prefixed_variable ... ok315test config::tests::environment::invalid_job_attempt_limits_reject_startup ... ok316test importers::harvest::api_source::http::tests::http_pages_follow_cursor_and_preserve_headers_and_encoded_filter ... ok317test importers::harvest::credentials::tests::decode_hex_rejects_bad_input ... ok318test importers::harvest::api_source::http::tests::http_retries_429_but_never_follows_redirects_or_shortens_long_backoff ... ok319test importers::harvest::credentials::tests::encrypt_then_decrypt_round_trips ... ok320test importers::harvest::api_source::http::tests::http_rejects_oversized_malformed_and_cyclic_pages ... ok321test importers::harvest::api_source::http::tests::slow_consumer_backpressures_http_and_cancellation_stops_further_pages ... ok322test importers::harvest::credentials::tests::nonce_makes_ciphertext_nondeterministic ... ok323test cli::imports::tests::wait_deadline_caps_a_pending_request_without_cancelling_the_job ... ok324test auth::oidc::tests::linking::existing_subject_wins_over_another_accounts_email ... ok325test importers::harvest::credentials::tests::wrong_key_fails_to_decrypt ... ok326test importers::harvest::csv_source::tests::bad_date_becomes_a_row_error_not_a_rejection ... ok327test importers::harvest::csv_source::tests::conflicting_email_aliases_error_only_the_affected_row ... ok328test importers::harvest::csv_source::tests::csv_records_preserve_multiline_unicode_across_single_byte_reads ... ok329test importers::harvest::csv_source::tests::cursor_beyond_upload_is_rejected_without_parsing_rows ... ok330test importers::harvest::csv_source::tests::cursor_resumes_after_multiline_unicode_and_preserves_error_locations ... ok331test importers::harvest::csv_source::tests::delivers_a_row_before_reading_the_rest_of_the_file ... ok332test importers::harvest::csv_source::tests::empty_file_is_rejected ... ok333test importers::harvest::csv_source::tests::identity_columns_are_required_and_cannot_repeat ... ok334test importers::harvest::csv_source::tests::invalid_utf8_errors_one_record_and_continues ... ok335test importers::harvest::csv_source::tests::missing_required_columns_is_rejected ... ok336test importers::harvest::csv_source::tests::names_stay_separate_from_optional_email ... ok337test importers::harvest::csv_source::tests::parse_bool_accepts_yes_variants ... ok338test importers::harvest::csv_source::tests::parses_rows_case_insensitively ... ok339test auth::oidc::tests::linking::unverified_email_cannot_link_an_account ... ok340test auth::oidc::tests::linking::simultaneous_logins_with_the_same_subject_are_allowed ... ok341test harvest::tests::a_member_cannot_list_users ... ok342test harvest::tests::a_member_sees_only_their_own_time_entries ... ok343test auth::oidc::tests::linking::different_subjects_cannot_both_claim_an_unlinked_account ... ok344test harvest::tests::harvest_effective_minutes_match_sql_for_open_and_frozen_time ... ok345test harvest::tests::a_member_cannot_fetch_a_colleagues_entry ... ok346test harvest::tests::members_cannot_read_own_project_rates_or_cost_overrides ... ok347test auth::oidc::tests::linking::deactivation_during_first_link_denies_login ... ok348test importers::harvest::account_switch::tests::queue_acceptance_does_not_wait_for_the_import_session_lock ... ok349test harvest::tests::a_manager_lists_users_with_their_rates ... ok350test importers::harvest::credentials::tests::unidentified_legacy_provenance_requires_operator_review ... ok351test importers::harvest::credentials::tests::migration_binds_existing_connections_without_changing_secrets_or_markers ... ok352test harvest::tests::a_member_cannot_filter_to_a_colleague ... ok353test importers::harvest::credentials::tests::concurrent_first_connections_cannot_bind_different_accounts ... ok354test importers::harvest::account_switch::tests::change_preserves_terminal_history_and_rejects_stale_confirmation ... ok355test harvest::pagination_tests::harvest_pagination_catalog_links_preserve_filters_and_break_name_ties ... ok356test importers::harvest::credentials::tests::connect_and_disconnect_share_import_exclusion_without_blocking_other_orgs ... ok357test importers::harvest::credentials::tests::same_account_reconnect_rotates_encryption_without_resetting_watermarks ... ok358test importers::harvest::account_switch::tests::queued_work_and_provenance_block_without_changing_binding ... ok359test importers::harvest::credentials::tests::failed_credential_write_does_not_leave_an_account_binding ... ok360test importers::harvest::credentials::tests::another_account_cannot_replace_credentials_or_watermarks ... ok361test harvest::tests::harvest_marks_unbilled_non_billable_contexts_consistently ... ok362test importers::harvest::account_switch::tests::retry_and_change_are_serialized ... ok363test importers::harvest::account_switch::tests::disconnect_and_reconnect_fence_callbacks_but_not_same_account_work ... ok364test importers::harvest::credentials::tests::disconnect_preserves_identity_and_provenance_for_the_original_account ... ok365test importers::harvest::account_switch::tests::successful_change_preserves_business_rows_and_failure_rolls_back_secrets ... ok366test harvest::tests::a_manager_sees_the_whole_org ... ok367test importers::harvest::engine_tests::api_and_csv_share_the_lock_but_other_organizations_can_import ... ok368test importers::harvest::account_switch::tests::competing_change_and_submission_cannot_both_succeed ... ok369test importers::harvest::engine_tests::csv_streaming::measure_csv_durable_100k ... ignored, 100,000-row durable CSV measurement; run explicitly with --release --nocapture370test importers::harvest::engine_tests::csv_streaming::measure_csv_durable_large_catalog_100k ... ignored, 100,000-row durable CSV with 5,000 parent sets; run explicitly with --release --nocapture371test importers::harvest::engine_tests::csv_streaming::measure_csv_streaming_100k ... ignored, 100,000-row CSV measurement; run explicitly with --release --nocapture372test importers::harvest::engine_tests::csv_streaming::measure_csv_streaming_large_catalog_100k ... ignored, 100,000-row CSV with 5,000 parent sets; run explicitly with --release --nocapture373test importers::harvest::credentials::tests::connection_changes_work_with_a_single_connection_pool ... ok374test importers::harvest::account_switch::tests::running_jobs_block_change_and_old_execution_never_reaches_http ... ok375test harvest::tests::harvest_entry_rates_respect_selected_project_mode ... ok376test importers::harvest::account_switch::tests::a_b_a_keeps_old_callbacks_requests_and_retries_fenced ... ok377test harvest::tests::harvest_entry_rates_follow_the_cascade_and_frozen_invoice_line ... ok378test importers::harvest::account_switch::tests::competing_callbacks_and_confirmations_have_one_winner ... ok379test importers::harvest::engine_tests::cancellation_rolls_back_rows_and_releases_the_import_session ... ok380test db::tests::reset_empties_the_database_and_reapplies_migrations ... ok381test importers::harvest::engine_tests::api_connection_checks_work_with_a_single_connection_pool ... ok382test importers::harvest::engine_tests::lookup_cache::cold_query_callsite_on_untraced_thread_is_still_captured ... ok383test importers::harvest::engine_tests::csv_ambiguous_names_include_inactive_users_but_unique_email_disambiguates ... ok384test importers::harvest::engine_tests::api_sync_adopts_entries_from_a_prior_csv_import ... ok385test importers::harvest::engine_tests::cancelled_http_waiter_keeps_the_lock_until_its_worker_exits ... ok386test importers::harvest::engine_tests::csv_import_populates_and_is_idempotent ... ok387test importers::harvest::engine_tests::concurrent_imports_reject_overlap_without_collapsing_repeated_entries ... ok388test importers::harvest::engine_tests::bad_records_are_reported_and_run_continues ... ok389test importers::harvest::engine_tests::csv_malformed_file_is_rejected_with_no_writes ... ok390test importers::harvest::engine_tests::csv_name_only_matches_one_org_user_and_reimports_without_duplicates ... ok391test importers::harvest::engine_tests::csv_streaming::cancelling_a_csv_waiting_for_more_bytes_releases_its_session ... ok392test importers::harvest::engine_tests::csv_streaming::csv_applies_before_eof_but_transport_failure_rolls_back_everything ... ok393test importers::harvest::engine_tests::completed_imports_allow_immediate_retries ... ok394test importers::harvest::engine_tests::edited_entry_still_matched_by_provenance ... ok395test importers::harvest::oauth::tests::authorize_url_carries_state_and_encoded_redirect ... ok396test importers::harvest::oauth::tests::authorize_url_preserves_query_values_without_injecting_parameters ... ok397test importers::harvest::oauth_callback_tests::account_policy_failures_return_safe_actionable_conflicts ... ok398test importers::harvest::engine_tests::csv_name_fallback_requires_a_full_unique_name_and_never_overrides_email ... ok399test importers::harvest::oauth_callback_tests::mismatched_state_is_rejected_without_a_code ... ok400test importers::harvest::oauth_callback_tests::missing_returned_state_is_rejected ... ok401test importers::harvest::oauth_callback_tests::missing_stored_state_is_rejected ... ok402test importers::harvest::oauth_callback_tests::valid_matching_state_yields_the_code ... ok403test importers::harvest::oauth_callback_tests::provider_error_is_rejected_before_exchange ... ok404test importers::harvest::oauth_callback_tests::valid_state_but_missing_code_is_rejected ... ok405test importers::harvest::report::tests::archive_metadata_cannot_masquerade_as_a_legacy_or_inconsistent_report ... ok406test importers::harvest::report::tests::legacy_report_preserves_its_counts_and_error_details ... ok407test importers::harvest::report::tests::report_rejects_unsupported_and_invalid_versions ... ok408test importers::harvest::report::tests::archived_report_round_trips_without_losing_error_accounting ... ok409test importers::harvest::report::tests::serialized_report_has_a_supported_schema_version ... ok410test importers::harvest::resolve::checkpoint_tests::run_cache_round_trip_preserves_identity_namespaces_and_occurrences ... ok411test harvest::pagination_tests::harvest_pagination_empty_and_out_of_range_pages_keep_the_contract ... ok412test importers::harvest::engine_tests::csv_streaming::csv_sql_backpressure_stops_reading_later_input_rows ... ok413test importers::harvest::engine_tests::csv_streaming::durable_csv_stale_commit_is_fenced_without_a_heartbeat ... ok414test importers::harvest::engine_tests::csv_name_only_dry_run_and_duplicate_occurrences_preserve_history ... ok415test importers::harvest::engine_tests::distinct_harvest_ids_with_identical_fields_import_as_two ... ok416test importers::harvest::engine_tests::csv_streaming::csv_preview_errors_and_repeated_rows_match_commit_and_reimport ... ok417test importers::harvest::engine_tests::full_import_creates_all_levels_with_exact_minutes ... ok418test importers::harvest::engine_tests::failed_source_releases_the_session_and_rolls_back_partial_rows ... ok419test importers::harvest::credentials::tests::completed_credential_changes_allow_immediate_retries ... ok420test importers::harvest::engine_tests::csv_streaming::durable_csv_cancel_joins_parser_and_preserves_committed_rows ... ok421test importers::harvest::engine_tests::lookup_cache::cached_project_task_still_validates_each_rows_rate ... ok422test importers::harvest::engine_tests::lookup_cache::project_task_cache_distinguishes_both_sides_of_the_link ... ok423test importers::harvest::engine_tests::dry_run_writes_nothing_and_matches_commit ... ok424test importers::harvest::engine_tests::lookup_cache::rolled_back_row_does_not_cache_user_or_project_task ... ok425test importers::harvest::engine_tests::lookup_cache::cached_email_and_full_name_do_not_share_a_namespace ... ok426test importers::harvest::engine_tests::lookup_cache::new_run_rechecks_previously_cached_user_for_ambiguity ... ok427test importers::harvest::engine_tests::natural_key_reimport_normalizes_whitespace_and_ascii_case ... ok428test importers::harvest::engine_tests::import_rejects_ambiguous_normalized_email_without_partial_writes ... ok429test importers::harvest::engine_tests::csv_streaming::durable_csv_report_metadata_is_bounded_after_recovery ... ok430test importers::harvest::engine_tests::reimporting_identical_csv_rows_is_idempotent ... ok431test importers::harvest::engine_tests::two_identical_csv_rows_import_as_two_entries ... ok432test importers::harvest::resolve::preview::tests::checkpoint_restores_known_task_currency_and_keeps_old_currency_unknown ... ok433test importers::harvest::engine_tests::overflowing_decimals_fail_only_their_rows ... ok434test importers::harvest::engine_tests::watermark_advances_only_on_commit ... ok435test importers::harvest::engine_tests::lookup_cache::lookup_index_migration_preserves_existing_ambiguous_identities ... ok436test importers::harvest::sync_tests::api_requires_email_even_when_full_name_matches ... ok437test importers::harvest::engine_tests::csv_streaming::durable_csv_preview_cancel_preserves_simulation_for_manual_retry ... FAILED438test importers::harvest::sync_tests::api_rejects_ambiguous_email_without_advancing_watermark ... ok439test importers::harvest::engine_tests::second_identical_run_creates_nothing ... ok440test importers::harvest::resolve::preview::tests::rejects_foreign_parent_snapshots_before_restoring_any_rows ... ok441test importers::harvest::engine_tests::submission_barrier_blocks_imported_time_entries ... ok442test importers::harvest::engine_tests::csv_streaming::durable_csv_resumes_committed_batches_without_recounting_duplicate_rows ... FAILED443test importers::harvest::streaming::tests::api_planning_policy_ends_with_the_transaction ... ok444test importers::harvest::streaming::durable::preview::tests::restoration_omits_unneeded_virtual_entries ... ok445test importers::harvest::engine_tests::csv_streaming::durable_csv_preview_crosses_batch_boundaries_without_committing_domain_data ... ok446test importers::harvest::engine_tests::csv_streaming::durable_csv_preview_resumes_after_a_crash_without_recounting_rows ... ok447test importers::harvest::sync_tests::checkpoints::durable_api_preview_finalization_retry_does_not_repeat_completed_downloads ... ok448test importers::harvest::sync_tests::checkpoints::durable_api_preview_cancellation_preserves_confirmed_pages_for_manual_retry ... ok449test harvest::pagination_tests::harvest_pagination_time_entries_keep_the_filtered_set_and_date_ties ... ok450test importers::harvest::sync_tests::checkpoints::durable_api_preview_reclaimed_worker_cannot_checkpoint_its_next_page ... ok451test importers::harvest::sync_tests::checkpoints::durable_api_finalization_retry_does_not_repeat_completed_downloads ... ok452test importers::harvest::engine_tests::csv_streaming::durable_csv_cancel_preserves_its_completed_batches_for_manual_retry ... ok453test importers::harvest::sync_tests::scale::api_100k_commit_and_reimport ... ignored, 100,000-entry scale measurement; run explicitly with --release --nocapture454test importers::harvest::sync_tests::scale::api_100k_dry_run ... ignored, 100,000-entry scale measurement; run explicitly with --release --nocapture455test importers::harvest::sync_tests::scale::api_durable_100k_commit_and_reimport ... ignored, 100,000-entry durable API measurement; run explicitly with --release --nocapture456test importers::harvest::sync_tests::scale::api_durable_100k_dry_run ... ignored, 100,000-entry durable API measurement; run explicitly with --release --nocapture457test importers::harvest::sync_tests::checkpoints::durable_api_preview_resume_preserves_row_errors ... ok458test importers::harvest::sync_tests::checkpoints::durable_api_preview_preserves_adoptions_and_repeated_ids_across_recovery ... ok459test importers::harvest::sync_tests::checkpoints::durable_api_cancellation_preserves_confirmed_pages_for_manual_retry ... ok460test importers::harvest::engine_tests::lookup_cache::repeated_rows_resolve_each_user_and_project_task_once ... ok461test importers::harvest::sync_tests::failed_rows_are_available_to_the_next_incremental_retry ... ok462test importers::harvest::sync_tests::dry_run_leaves_data_provenance_and_watermark_unchanged ... ok463test importers::harvest::sync_tests::disconnect_and_reconnect_preserves_imported_records_and_exact_identity ... ok464test importers::harvest::sync_tests::checkpoints::durable_api_resume_remembers_an_earlier_missing_timestamp ... ok465test importers::harvest::sync_tests::invalid_parent_blocks_dependent_time_but_other_catalog_records_survive ... ok466test importers::harvest::sync_tests::checkpoints::durable_api_resumes_committed_pages_and_preserves_the_high_watermark ... ok467test importers::harvest::sync_tests::checkpoints::durable_api_reclaimed_worker_cannot_commit_its_next_page ... ok468test importers::harvest::sync_tests::checkpoints::durable_api_resume_keeps_earlier_errors_and_does_not_advance_watermark ... ok469test importers::harvest::sync_tests::checkpoints::durable_api_preview_resumes_pages_without_publishing_domain_data ... ok470test importers::harvest::sync_tests::checkpoints::durable_api_preview_resumes_catalog_download ... ok471test importers::harvest::sync_tests::failed_client_propagates_to_project_and_entry_without_placeholder_records ... ok472test importers::harvest::sync_tests::checkpoints::failed_api_preview_publishes_its_last_confirmed_page_report ... ok473test importers::harvest::sync_tests::checkpoints::failed_api_commit_publishes_its_last_confirmed_page_report ... ok474test importers::harvest::sync_tests::checkpoints::durable_api_resumes_a_partially_downloaded_catalog ... ok475test importers::harvest::sync_tests::checkpoints::durable_api_resumes_after_a_confirmed_parent_batch ... ok476test importers::harvest::sync_tests::paging::later_download_failure_rolls_back_parents_rows_and_watermark ... ok477test importers::harvest::sync_tests::exact_api_decimals_survive_preview_commit_and_reimport ... ok478test importers::harvest::sync_tests::missing_client_fallback_and_failed_project_savepoints_do_not_poison_cache ... ok479test importers::harvest::sync_tests::parent_only_api_import_creates_catalog_and_reimport_skips_it ... ok480test init::tests::init_refuses_when_an_organization_exists ... ok481test init::tests::init_creates_one_org_and_one_admin_and_nothing_else ... ok482test importers::harvest::sync_tests::paging::cancelled_page_consumer_retains_lock_until_worker_exits_and_rolls_back ... ok483test importers::harvest::sync_tests::missing_source_timestamp_keeps_the_previous_watermark ... ok484test importers::harvest::sync_tests::parent_only_dry_run_previews_without_persisting_catalog ... ok485test importers::harvest::sync_tests::paging::durable_api_stale_commit_cannot_advance_data_or_watermark ... ok486test importers::harvest::sync_tests::watermark_never_passes_the_start_of_capture ... ok487test importers::harvest::sync_tests::parent_catalog_preserves_metadata_and_counts_each_entity_once ... ok488test importers::harvest::sync_tests::refreshed_tokens_survive_a_dry_run_rollback_in_the_same_import_session ... ok489test importers::harvest::sync_tests::watermark_write_failure_rolls_back_imported_data ... ok490test importers::harvest::engine_tests::csv_streaming::durable_csv_reclaimed_lease_cannot_commit_the_next_batch ... ok491test importers::harvest::sync_tests::successful_sync_only_marks_the_incrementally_fetched_entity ... ok492test importers::harvest::sync_tests::empty_sync_does_not_invent_a_watermark ... ok493test importers::harvest::sync_tests::out_of_range_api_decimals_error_per_row_and_leave_retry_watermark ... ok494test harvest::pagination_tests::harvest_project_cost_overrides_require_admin_without_fabricated_fallback ... ok495test importers::harvest::sync_tests::checkpoints::durable_api_preview_resumes_after_a_confirmed_parent_batch ... ok496test jobs::tests::cancellation_and_retry_are_scoped_and_idempotent ... ok497test jobs::tests::claims_are_atomic_and_expired_leases_recover ... ok498test importers::harvest::engine_tests::csv_streaming::durable_csv_preview_rejects_a_stale_next_batch ... ok499test jobs::tests::payload_kind_is_stable_and_round_trips ... ok500test jobs::tests::payload_versions_preserve_legacy_jobs_and_reject_unknown_versions ... ok501test jobs::tests::outbox_delivery_is_idempotent ... ok502test jobs::tests::retry_snapshot_does_not_guess_unknown_payloads_or_sources ... ok503test jobs::tests::cancellation_survives_a_crash_before_the_worker_acknowledges ... ok504test jobs::tests::shutdown_deadline_drops_and_joins_in_flight_work ... ok505test jobs::tests::shutdown_waits_for_in_flight_work ... ok506test importers::harvest::sync_tests::paging::durable_api_cancel_waits_for_the_producer_before_acknowledging ... ok507test importers::harvest::engine_tests::large_run_reuses_parents_and_reconciles_totals ... ok508test jobs::tests::retry_snapshot_matches_status_and_list_without_exposing_payload ... ok509test jobs::tests::history_paginates_tied_timestamps_and_rejects_foreign_cursors ... ok510test jobs::tests::synthetic_job_uses_the_same_registered_envelope ... ok511test jobs::tests::stopped_worker_leaves_queued_jobs_unclaimed ... ok512test models::project_creation::tests::draft_roundtrip_preserves_incomplete_input_without_demo_data ... ok513test models::project_creation::tests::unauthorized_catalog_cost_is_absent_from_serialized_options ... ok514test models::project_creation::tests::unknown_draft_fields_are_rejected ... ok515test importers::harvest::sync_tests::paging::invalid_and_missing_timestamp_rows_cross_page_boundaries_without_advancing ... ok516test notifications::tests::cancelling_delivery_kills_the_active_sender ... ok517test jobs::tests::concurrent_csv_resubmission_preserves_identity_after_upload_cleanup ... ok518test jobs::tests::upload_organization_must_match_its_job ... ok519test notifications::tests::acknowledged_email_is_never_claimed_again ... ok520test notifications::tests::mail_configuration_is_disabled_by_default_and_rejects_partial_values ... ok521test notifications::tests::mail_configuration_requires_an_executable_file_and_safe_sender ... ok522test jobs::tests::csv_job_persists_its_policy_with_the_upload ... ok523test notifications::tests::recipient_injection_is_rejected_before_starting_a_process ... ok524test notifications::tests::rendered_mail_bounds_body_lines_for_long_unicode_and_control_names ... ok525test notifications::tests::mail_worker_delivers_only_its_kind_and_drains_cleanly ... ok526test notifications::tests::disabled_mail_worker_does_not_claim_pending_notifications ... ok527test notifications::tests::sendmail_failure_does_not_expose_program_output ... ok528test notifications::tests::sendmail_receives_fixed_arguments_and_stable_message_identity ... ok529test importers::harvest::sync_tests::scale::durable_measurement_finishes_from_its_eof_checkpoint ... ok530test importers::harvest::sync_tests::scale::http_pages_preview_commit_and_reimport ... ok531test notifications::tests::verbose_sender_output_is_discarded_without_blocking_delivery ... ok532test pages::clients::filters::tests::clearing_query_preserves_selected_currency_and_lifecycle ... ok533test pages::clients::filters::tests::lifecycle_counts_share_query_and_currency_filters ... ok534test pages::clients::filters::tests::name_search_ignores_case_and_surrounding_whitespace ... ok535test pages::clients::filters::tests::preferred_or_visible_project_currency_matches_but_query_still_applies ... ok536test pages::clients::form::tests::absent_billing_authority_never_produces_an_edit_payload ... ok537test pages::clients::form::tests::ambiguous_creation_errors_require_explicit_recovery ... ok538test pages::clients::form::tests::clearing_a_rate_is_explicit_and_needs_no_currency_confirmation ... ok539test pages::clients::form::tests::invalid_fields_are_not_rewritten_by_validation ... ok540test pages::clients::form::tests::rate_replacement_requires_confirmation_in_the_current_currency ... ok541test pages::clients::form::tests::untouched_fields_keep_zero_rate_and_original_snapshot ... ok542test pages::importers::presentation::tests::interrupted_report_is_partial_regardless_of_retry_prerequisites ... ok543test pages::importers::presentation::tests::no_selection_does_not_claim_no_import_history ... ok544test pages::importers::presentation::tests::source_labels_do_not_guess_unknown_importers ... ok545test pages::importers::presentation::tests::states_and_phases_have_readable_unknown_fallbacks ... ok546test pages::importers::presentation::tests::summaries_distinguish_zero_skipped_and_mixed_outcomes ... ok547test pages::invoices::defaults_form::tests::invoice_fields_bound_metadata_by_characters_and_reject_nul ... ok548test pages::invoices::defaults_form::tests::invoice_fields_preserve_exact_percentages_and_custom_terms ... ok549test pages::invoices::defaults_form::tests::invoice_fields_preserve_receipt_terms_and_empty_optional_percentages ... ok550test pages::invoices::defaults_form::tests::invoice_fields_reject_invalid_percentages_terms_and_second_tax ... ok551test pages::invoices::preparation::fees::tests::fee_inputs_require_exact_amounts_and_an_explicit_positive_charge ... ok552test pages::invoices::preparation::fees::tests::refresh_keeps_raw_edits_and_does_not_select_new_sources ... ok553test pages::invoices::preparation::fees::tests::refresh_preserves_missing_or_relabelled_edits_until_explicit_removal ... ok554test pages::invoices::preparation::tests::invoice_context_selects_only_the_exact_available_client ... ok555test pages::invoices::preparation::tests::invoice_review_requires_matching_sources_and_valid_values ... ok556test pages::invoices::preparation::tests::unavailable_or_malformed_invoice_context_never_uses_the_first_client ... ok557test pages::new_project::basics::tests::a_batch_that_would_exceed_the_tag_limit_is_rejected ... ok558test pages::new_project::basics::tests::a_full_tag_list_still_accepts_a_duplicate ... ok559test pages::new_project::basics::tests::overlong_tags_are_rejected_without_truncation ... ok560test pages::new_project::basics::tests::tag_length_counts_characters_instead_of_bytes ... ok561test pages::new_project::basics::tests::tags_trim_and_deduplicate_without_changing_existing_spelling ... ok562test pages::new_project::billing::tests::budget_errors_target_a_control_that_can_be_corrected ... ok563test pages::new_project::draft::tests::a_mismatched_acknowledgement_does_not_lose_pending_input ... ok564test pages::new_project::draft::tests::a_retry_keeps_the_unacknowledged_payload_and_revision ... ok565test pages::new_project::draft::tests::a_validation_rejection_allows_corrected_input_at_the_same_revision ... ok566test pages::new_project::draft::tests::an_empty_form_is_not_reported_as_saved ... ok567test pages::new_project::draft::tests::any_saved_draft_wins_over_context_including_empty_or_matching_client ... ok568test pages::new_project::draft::tests::context_prefills_only_a_new_form_without_fixing_its_currency ... ok569test pages::new_project::draft::tests::resuming_preserves_the_server_identity_and_incomplete_fields ... ok570test pages::new_project::team::tests::adding_everyone_deduplicates_without_replacing_project_overrides ... ok571test pages::new_project::team::tests::exceeding_the_team_limit_does_not_partially_add_people ... ok572test pages::new_project::team::tests::removing_a_member_keeps_an_empty_restricted_task_restricted ... ok573test pages::new_project::tests::a_rejected_creation_can_be_edited_but_an_uncertain_commit_must_be_retried ... ok574test pages::new_project::tests::only_known_validation_fields_can_target_a_control ... ok575test pages::projects::budget_display_tests::configured_scopes_sum_without_hiding_an_individual_overrun ... ok576test pages::projects::budget_display_tests::display_preserves_units_sign_and_large_integer_values ... ok577test pages::projects::budget_display_tests::tag_filter_matches_identity_without_duplicates_or_name_collisions ... ok578test pages::projects::budget_display_tests::unallocated_zero_and_overflow_budgets_are_not_conflated ... ok579test pages::reports::tests::cost_total_uses_organization_currency_across_billing_currencies ... ok580test pages::reports::tests::mixed_currencies_are_not_added_even_when_the_numbers_would_overflow ... ok581test pages::reports::tests::monetary_total_overflow_is_visible_instead_of_panicking ... ok582test pages::reports::tests::redacted_costs_do_not_become_zero_or_partial_totals ... ok583test pages::reports::tests::single_currency_totals_are_formatted_and_empty_reports_have_no_amount ... ok584test pages::timesheet::tests::cal_span_day_shows_only_the_anchor_column ... ok585test pages::timesheet::tests::cal_span_defaults_to_week ... ok586test pages::timesheet::tests::cal_span_unknown_falls_back_to_week ... ok587test pages::timesheet::tests::cal_span_url_roundtrips ... ok588test pages::timesheet::tests::cal_span_week_shows_all_seven_days ... ok589test pages::timesheet::tests::cal_span_work_week_preserves_date_order_across_weekends ... ok590test pages::timesheet::tests::cal_span_work_week_shows_monday_to_friday ... ok591test pages::timesheet::tests::cal_span_work_week_skips_sunday_when_it_is_the_first_column ... ok592test notifications::tests::sendmail_timeout_kills_and_reaps_the_child ... ok593test pages::timesheet::tests::day_col_class_marks_today ... ok594test pages::timesheet::tests::day_col_class_marks_weekend ... ok595test pages::timesheet::tests::day_col_class_plain_weekday ... ok596test pages::timesheet::tests::day_col_class_today_wins_over_weekend ... ok597test pages::timesheet::tests::invalid_duration_cannot_start_a_timer_save_or_clear_a_cell ... ok598test pages::timesheet::tests::only_a_blank_duration_can_start_an_eligible_timer ... ok599test pages::timesheet::tests::timed_lanes_still_widens_overlapping_entries ... ok600test pages::timesheet::tests::timed_lanes_terminates_on_a_zero_length_entry ... ok601test pages::timesheet::tests::today_offset_is_none_after_the_week ... ok602test pages::timesheet::tests::today_offset_is_none_before_the_week ... ok603test pages::timesheet::tests::today_offset_is_six_on_the_sunday ... ok604test pages::timesheet::tests::today_offset_is_zero_on_the_monday ... ok605test pages::timesheet::tests::value_cell_class_empty_wins_over_today ... ok606test pages::timesheet::tests::value_cell_class_marks_today_when_nonzero ... ok607test pages::timesheet::tests::weekly_duration_edit_preserves_nine_am_start_notes_and_billability ... ok608test pages::timesheet::tests::weekend_style_follows_the_date_not_the_column_offset ... ok609test pages::timesheet::tests::weekly_new_entries_are_untimed_and_explicit_clears_still_work ... ok610test jobs::tests::expired_final_attempt_fails_without_claiming_again ... ok611test notifications::tests::failed_email_retries_same_identity_and_eventually_stops ... ok612test notifications::tests::revoked_recipient_does_not_receive_a_pending_email ... ok613test notifications::tests::foreign_notification_payload_is_terminal_and_never_sent ... ok614test notifications::tests::retry_can_recover_without_changing_message_identity ... ok615test plugin::database::tests::application_database_owner_is_not_a_plugin_identity ... ok616test jobs::tests::submission_key_cannot_change_csv_bytes_or_mode ... ok617test plugin::event::tests::active_transition_fires_only_on_a_real_flip ... ok618test plugin::event::tests::budget_and_timer_events_serialize ... ok619test plugin::event::tests::new_events_have_stable_hook_names ... ok620test plugin::event::tests::project_membership_payload_excludes_private_configuration ... ok621test plugin::event::tests::role_change_event_carries_previous_role ... ok622test plugin::event::tests::submission_event_serializes_payload ... ok623test plugin::event::tests::us2_events_have_stable_hook_names ... ok624test notifications::tests::stale_email_lease_cannot_start_delivery ... ok625test plugin::host::tests::config_lookup::a_set_key_is_returned ... ok626test plugin::host::tests::config_lookup::an_unset_key_is_none ... ok627test plugin::database::tests::dedicated_reader_is_accepted_but_new_write_grants_are_rejected ... ok628test importers::harvest::engine_tests::csv_streaming::csv_measurement_recovers_a_complete_batch_without_recounting ... ok629test plugin::database::tests::reader_cannot_execute_security_definer_functions ... ok630test plugin::database::tests::reader_cannot_have_access_to_credentials ... ok631test plugin::host::tests::database_tests::unconfigured_sql_never_falls_back_to_application_state ... ok632test plugin::database::tests::reader_accepts_optional_first_party_rounding_helper ... ok633test plugin::database::tests::project_configuration_is_private_even_when_plugin_grants_are_misconfigured ... ok634test plugin::host::tests::response_shaping::error_json_wraps_the_message ... ok635test plugin::host::tests::response_shaping::http_response_carries_status_and_body ... ok636test plugin::host::tests::response_shaping::invalid_http_utf8_is_an_error_not_an_empty_success ... ok637test plugin::host::tests::statement_is_read_only::a_cte_select_is_allowed ... ok638test plugin::host::tests::statement_is_read_only::a_second_statement_is_rejected ... ok639test plugin::host::tests::statement_is_read_only::a_single_trailing_semicolon_is_allowed ... ok640test plugin::host::tests::statement_is_read_only::a_write_hidden_behind_a_comment_is_rejected ... ok641test plugin::host::tests::statement_is_read_only::plain_select_is_allowed ... ok642test plugin::host::tests::statement_is_read_only::writes_are_rejected ... ok643test plugin::host::tests::wrap_select::strips_a_trailing_semicolon_before_wrapping ... ok644test plugin::host::tests::wrap_select::wraps_as_a_bounded_row_query ... ok645test plugin::host::tests::response_shaping::http_body_accepts_the_size_limit_and_rejects_larger_responses ... ok646test plugin::manifest::tests::config_defaults_to_empty_when_absent ... ok647test plugin::manifest::tests::parse_valid_manifest ... ok648test plugin::manifest::tests::parses_optional_config_table ... ok649test plugin::manifest::tests::reject_empty_hooks ... ok650test plugin::database::tests::reader_cannot_switch_into_another_role ... ok651test plugin::manifest::tests::accepts_all_published_business_events ... ok652test plugin::manifest::tests::reject_unknown_hook ... ok653test plugin::host::tests::database_queries_preserve_parameters_and_rollback_session_settings ... ok654test jobs::tests::expired_lease_cannot_renew_or_commit_using_an_old_transaction_timestamp ... ok655test plugin::host::tests::database_tests::query_discards_session_advisory_locks ... ok656657running 1 test658test plugin::database::tests::reader_rejects_unapproved_invoker_functions ... ok659test plugin::host::tests::database_tests::query_results_are_bounded_without_silent_truncation ... ok660test plugin::registry::tests::initialization::guest_initializers_have_an_engine_instruction_budget ... ok661662test result: ok. 1 passed; 0 failed; 0 ignored; 0 measured; 846 filtered out; finished in 0.69s663664test importers::harvest::engine_tests::csv_streaming::durable_csv_preview_matches_existing_and_new_rows_with_one_connection ... ok665666running 1 test667test jobs::report::stream_tests::download_reads_only_when_consumed_and_releases_its_connection ... ok668test plugin::registry::tests::initialization::instruction_budget_is_replenished_for_each_call ... ok669test plugin::registry::tests::isolation::cancelling_a_waiter_keeps_capacity_reserved_until_the_host_call_exits ... ok670test plugin::registry::tests::isolation::confirmed_dispatch_returns_overload_for_retry ... ok671test plugin::registry::tests::isolation::confirmed_dispatch_returns_plugin_failure_for_retry ... ok672test plugin::registry::tests::isolation::confirmed_dispatch_waits_for_the_plugin_to_finish ... ok673test plugin::registry::tests::isolation::events_execute_outside_the_async_worker ... ok674test plugin::registry::tests::isolation::different_plugins_share_the_running_call_limit ... ok675test plugin::host::tests::database_tests::wasm_host_uses_the_restricted_connection_on_a_current_thread_runtime ... ok676test plugin::registry::tests::isolation::oversized_event_payloads_are_not_queued ... ok677test plugin::host::tests::database_tests::select_cannot_write_or_gain_application_privileges ... ok678test plugin::registry::tests::isolation::pending_capacity_rejects_new_work_without_spawning_tasks ... ok679test plugin::registry::tests::isolation::loaded_plugins_cannot_start_with_excessive_memory ... ok680test plugin::registry::tests::load_empty_directory ... ok681test plugin::registry::tests::isolation::widgets_execute_outside_the_async_worker ... ok682test plugin::registry::tests::load_nonexistent_directory ... ok683test plugin::registry::tests::isolation::oversized_wasm_output_is_rejected_before_copying_it ... ok684test reports::bounded::tests::cancelled_export_keeps_its_slot_until_the_renderer_exits ... ok685test reports::bounded::tests::export_admission_stays_reserved_until_the_body_is_dropped ... ok686test reports::bounded::tests::export_rendering_runs_off_the_async_worker ... ok687test reports::bounded::tests::output_budget_checks_writes_and_seeks_without_truncation ... ok688test reports::bounded::tests::rendered_output_limit_rejects_oversized_files_and_releases_admission ... ok689test reports::bounded::tests::renderer_errors_and_panics_release_admission ... ok690test plugin::registry::tests::isolation::loaded_plugins_cannot_grow_memory_past_the_limit ... ok691test render::tests::invoice_template_formats_large_minor_units_exactly ... ok692test plugin::registry::tests::isolation::confirmed_dispatch_attempts_other_plugins_after_one_fails ... ok693test plugin::registry::tests::initialization::guest_initializers_have_an_engine_instruction_budget ... ok694695test result: ok. 1 passed; 0 failed; 0 ignored; 0 measured; 846 filtered out; finished in 1.12s696697698running 1 test699test reports::bounded::tests::timed_out_export_keeps_its_slot_until_the_renderer_exits ... ok700test jobs::report::stream_tests::download_keeps_its_snapshot_when_later_progress_archives_the_inline_tail ... ok701test plugin::registry::tests::initialization::guest_initializers_have_an_engine_instruction_budget ... ok702703test result: ok. 1 passed; 0 failed; 0 ignored; 0 measured; 846 filtered out; finished in 0.24s704705706running 1 test707test plugin::registry::tests::initialization::guest_initializers_have_an_engine_instruction_budget ... ok708709test result: ok. 1 passed; 0 failed; 0 ignored; 0 measured; 846 filtered out; finished in 0.56s710711test plugin::registry::tests::initialization::guest_initializers_have_an_engine_instruction_budget ... ok712test plugin::host::tests::a_query_cannot_disable_its_own_deadline ... ok713test jobs::tests::outbox_same_kind_consumers_cannot_claim_the_same_lease ... ok714test plugin::registry::tests::dispatch_event_with_no_subscribers ... ok715test plugin::registry::tests::load_test_plugins ... ok716test reports::limits::tests::measure_bounded_export_limits ... ignored, manual release export measurement; set HORAE_EXPORT_PROBE_DIR for artifacts717test jobs::outbox::tests::worker_delivers_available_events_and_stops_cleanly ... ok718test plugin::registry::tests::collect_widgets_from_echo_plugin ... ok719test jobs::report::tests::report_fragments_survive_until_the_owning_job_expires ... ok720test plugin::registry::tests::failing_plugin_does_not_block_caller ... ok721test jobs::report::stream_tests::download_reports_missing_fragments_after_its_buffered_page ... ok722test reports::streaming::database_tests::measure_streaming_csv_export ... ignored, Manual release measurement of a 100,000-row CSV download723test plugin::registry::tests::isolation::a_wasm_timeout_releases_the_worker_and_instance ... ok724test plugin::registry::tests::dispatch_invoice_sent_to_echo_plugin ... ok725test plugin::registry::tests::dispatch_to_echo_plugin_succeeds ... ok726test reports::limits::tests::invoice_exports_show_saved_adjustments_and_exact_large_amounts ... ok727test jobs::tests::import_adapters_reject_a_lease_from_another_organization ... ok728test reports::streaming::database_tests::streamed_timesheet_exceeds_xlsx_row_limit_without_one_large_body_chunk ... ok729test importers::harvest::sync_tests::scale::durable_api_report_preserves_overflow_errors_after_recovery ... ok730test reports::streaming::tests::completed_csv_keeps_admission_until_body_drop ... ok731test reports::streaming::tests::csv_backpressure_and_body_drop_bound_and_cancel_source_reads ... ok732test reports::streaming::tests::csv_does_not_truncate_a_quoted_unicode_record_larger_than_a_chunk ... ok733test reports::streaming::tests::csv_emits_a_chunk_before_the_source_finishes ... ok734test reports::streaming::tests::csv_failure_or_panic_after_a_chunk_is_not_successful_eof ... ok735test reports::streaming::tests::csv_startup_errors_are_http_errors_and_release_admission ... ok736test reports::streaming::database_tests::streamed_fee_invoice_has_no_fabricated_hours_or_hourly_rate ... ok737test reports::streaming::tests::dropping_csv_during_startup_cancels_the_producer ... ok738test route::tests::client_detail_preserves_identity_and_highlights_only_clients ... ok739test route::tests::client_workflow_paths_preserve_context_and_navigation_section ... ok740test route::tests::edit_project_preserves_identity_and_highlights_only_projects ... ok741test route::tests::malformed_context_reaches_the_workflow_for_validation_after_recovery ... ok742test route::tests::new_project_is_static_and_highlights_only_projects ... ok743test reports::streaming::tests::csv_timeout_interrupts_an_already_started_body ... ok744test jobs::tests::synthetic_job_executes_through_claim_and_completion ... ok745test seed::tests::concurrent_seed_runs_create_only_one_demo ... ok746test reports::privacy_tests::project_downloads_follow_progress_visibility ... ok747test seed::tests::repeated_seed_preserves_every_row_and_user_edits ... ok748test seed::tests::seed_leaves_an_older_or_partial_demo_unchanged ... ok749test jobs::tests::outbox_stale_claims_cannot_acknowledge_or_reschedule_delivery ... ok750test jobs::outbox::tests::invalid_payload_is_not_delivered_and_does_not_leak_into_errors ... ok751test server_fns::approvals::submission_tests::cancelling_a_submission_releases_its_write_barrier ... ok752test reports::limits::tests::fee_exports_preserve_absent_quantities_and_render_a_real_pdf ... ok753test server_fns::approvals::submission_tests::submission_accepts_the_organizations_sunday_start ... ok754test reports::streaming::database_tests::a_real_database_error_interrupts_the_csv_body ... ok755test server_fns::approvals::submission_tests::submission_barrier_allows_shared_writers_for_the_same_user ... ok756test server_fns::approvals::submission_tests::submission_does_not_wait_for_another_users_writer ... ok757test server_fns::approvals::submission_tests::submission_rejects_a_start_that_is_not_the_organizations_week_start ... ok758test server_fns::approvals::submission_tests::submission_freezes_the_minutes_after_a_competing_edit ... ok759test seed::tests::late_seed_failure_rolls_back_all_demo_data ... ok760test server_fns::approvals::submission_tests::submission_uses_one_pool_connection ... ok761test server_fns::approvals::submission_tests::submission_waits_for_a_new_timer_before_checking_the_week ... ok762test server_fns::approvals::tests::sees_a_running_timer_inside_the_week ... ok763test server_fns::approvals::tests::ignores_stopped_and_out_of_week_timers ... ok764test jobs::tests::cleanup_retains_retryable_uploads_and_deletes_expired_jobs ... ok765test server_fns::budget_tests::concurrent_budget_checks_have_one_band_claimant ... ok766test server_fns::budget_tests::budget_notification_schema_enforces_tenants_and_no_public_access ... ok767test server_fns::budget_tests::configured_alert_and_outbox_roll_back_together ... ok768test reports::streaming::database_tests::streamed_timesheet_preserves_csv_escaping_frozen_zero_and_all_filters ... ok769test server_fns::budget_tests::configured_alert_recipients_are_active_same_org_managers_and_project_leads ... ok770test harvest::pagination_tests::harvest_own_time_omits_private_project_budget_metadata has been running for over 60 seconds771test harvest::pagination_tests::harvest_pagination_malformed_filters_are_client_errors has been running for over 60 seconds772test harvest::pagination_tests::harvest_pagination_rejects_invalid_windows_on_every_collection has been running for over 60 seconds773test harvest::pagination_tests::harvest_pagination_router_preserves_session_and_tenant_guards has been running for over 60 seconds774test harvest::pagination_tests::harvest_project_progress_permissions_cover_counts_pages_and_details has been running for over 60 seconds775test harvest::pagination_tests::harvest_task_access_filters_counts_and_preserves_rate_free_history has been running for over 60 seconds776test harvest::tests::imported_legacy_rates_survive_retry_in_harvest_list_and_detail has been running for over 60 seconds777test server_fns::budget_tests::configured_alerts_deduplicate_concurrent_checks_and_recrossing ... ok778test jobs::tests::submission_key_cannot_change_api_mode_or_scope ... ok779test server_fns::budget_tests::configured_budget_does_not_read_foreign_or_legacy_projects ... ok780test server_fns::budget_tests::configured_amount_budget_uses_resolved_rates_and_explicit_zero ... ok781test server_fns::budget_tests::configured_budget_sweep_recovers_missed_checks_without_duplicates ... ok782test server_fns::budget_tests::configured_alerts_require_enabled_active_project_and_authorized_recipient ... ok783test server_fns::budget_tests::configured_monthly_budget_excludes_other_months_and_nonbillable_time ... ok784test server_fns::budget_tests::configured_monthly_budget_includes_leap_day_and_preserves_locked_rounding ... ok785test server_fns::budget_tests::configured_nonbillable_projects_count_time_without_hidden_checkbox ... ok786test server_fns::budget_tests::configured_person_budget_excludes_other_people_and_has_its_own_alert ... ok787test server_fns::budget_tests::configured_task_fee_budget_respects_billability_and_alert_scope ... ok788test server_fns::budget_tests::configured_task_and_person_budgets_do_not_share_consumption ... ok789test server_fns::budget_tests::overview_budget_progress_batches_projects_without_mixing_scopes ... ok790test server_fns::budget_tests::overview_budget_progress_includes_people_without_an_allowance ... ok791test server_fns::budget_tests::overview_budget_progress_is_current_period_scoped_and_authorized ... ok792test server_fns::clients::tests::both_activation_transitions_change_once_and_preserve_details ... ok793test server_fns::clients::tests::client_details_distinguish_unset_zero_and_positive_manager_rates ... ok794test server_fns::clients::tests::client_default_rate_allows_detail_edits_and_equivalent_currency ... ok795test server_fns::clients::tests::client_default_rate_prevents_currency_relabelling ... ok796test server_fns::clients::tests::client_details_hide_foreign_missing_and_inactive_actor_records ... ok797test server_fns::clients::tests::client_details_keep_catalog_identity_but_omit_member_billing ... ok798test server_fns::clients::tests::client_invoices_require_manager_authority_even_without_invoices ... ok799test server_fns::clients::tests::client_summaries_exclude_foreign_clients_and_unreadable_project_currencies ... ok800test server_fns::clients::tests::client_invoices_reject_a_winning_concurrent_revocation ... ok801test reports::limits::tests::bounded_entries_enforce_the_row_limit_after_all_filters ... ok802test server_fns::clients::tests::client_invoices_hold_authority_until_the_read_finishes ... ok803test server_fns::clients::tests::client_invoices_keep_exact_client_scope_statuses_and_currencies ... ok804test server_fns::clients::tests::client_summaries_follow_existing_progress_visibility_and_revoke_inactive_users ... ok805test server_fns::clients::tests::client_summaries_keep_catalog_without_projects_and_count_archived_projects ... ok806test server_fns::clients::tests::client_summaries_reject_a_foreign_actor_even_when_client_org_is_known ... ok807test server_fns::clients::tests::concurrent_deletion_is_not_an_unchanged_mutation ... ok808test server_fns::clients::tests::currency_edit_rechecks_a_concurrently_added_client_default_rate ... ok809test server_fns::clients::tests::each_field_changes_once_and_preserves_inactive_status ... ok810test server_fns::clients::tests::profile_create_persists_normalized_identity_and_exact_optional_rate ... ok811test server_fns::clients::tests::missing_and_foreign_clients_are_not_noops ... ok812test reports::limits::tests::bounded_entries_reject_large_fields_and_combined_text ... ok813test server_fns::clients::tests::profile_currency_change_without_a_rate_keeps_it_unset ... ok814test server_fns::clients::tests::profile_noop_preserves_row_and_returns_no_update_event_signal ... ok815test server_fns::clients::tests::profile_saves_reject_invalid_input_without_partial_writes ... ok816test server_fns::clients::tests::profile_update_rechecks_authority_after_waiting_for_a_concurrent_demotion ... ok817test server_fns::clients::tests::profile_saves_recheck_manager_org_and_active_actor ... ok818test server_fns::clients::tests::profile_update_rechecks_financial_snapshot_after_waiting_for_a_concurrent_edit ... ok819test server_fns::clients::tests::profile_update_rejects_stale_currency_even_when_the_rate_is_still_unset ... ok820test server_fns::clients::tests::profile_update_preserves_historical_rows_and_inactive_status ... ok821test server_fns::importers::authorization_tests::cli_job_endpoints_have_stable_registered_paths ... ok822test server_fns::clients::tests::profile_update_rejects_stale_rate_even_when_the_target_currency_is_unchanged ... ok823test server_fns::importers::authorization_tests::report_stress::large_report_streams_over_http_without_buffering_the_archive ... ignored, isolated Linux HTTP/memory stress; run with --release --exact --ignored --nocapture824test server_fns::importers::authorization_tests::request_bound_import_endpoints_are_not_registered ... ok825test server_fns::importers::csv_upload::tests::csv_upload_extractor_preserves_raw_bytes ... ok826test server_fns::importers::csv_upload::tests::csv_upload_requires_its_header_without_reading_the_body ... ok827test server_fns::importers::tests::concurrent_api_import_returns_a_retryable_conflict ... ok828test server_fns::clients::tests::profile_update_requires_explicit_rate_intent_for_currency_changes ... ok829test server_fns::importers::tests::submission_identity_rejects_expired_future_and_non_v7_keys ... ok830test server_fns::clients::tests::repeating_a_competing_deactivation_does_not_report_a_transition ... ok831test server_fns::importers::tests::csv_route_rejects_invalid_modes_and_headers_without_reading_uploads ... ok832test server_fns::clients::tests::repeating_a_competing_edit_does_not_report_a_change ... ok833test server_fns::clients::tests::restoring_values_after_a_competing_edit_reports_a_change ... ok834test server_fns::clients::tests::restoring_a_competing_deactivation_reports_reactivation ... ok835test server_fns::clients::tests::unchanged_activation_preserves_the_row ... ok836test server_fns::clients::tests::unchanged_edit_preserves_the_row ... ok837test server_fns::invoices::fee_tests::concurrent_invoices_claim_a_single_fee_once ... ok838test jobs::tests::failed_csv_preview_retains_confirmed_report_through_history_and_retry ... ok839test server_fns::invoices::fee_tests::fee_invoice_does_not_claim_hours_or_another_clients_fee ... ok840test seed::tests::concurrent_initializers_cannot_create_two_organizations ... ok841test server_fns::invoices::fee_tests::fee_occurrence_rejects_cross_organization_project ... ok842test server_fns::invoices::fee_tests::fee_total_overflow_rolls_back_occurrences_and_invoice ... ok843test jobs::tests::failed_csv_commit_retains_confirmed_report_through_history_and_retry ... ok844test seed::tests::seed_refuses_an_initialized_organization_without_writes ... ok845test server_fns::invoices::fee_tests::invoice_line_sources_reject_mixed_sources_and_invented_fee_quantities ... ok846test reports::limits::tests::bounded_exports_preserve_real_workbooks_and_deterministic_pdf ... ok847test server_fns::invoices::fee_tests::milestones_include_unbilled_overdue_fees_but_not_future_fees ... ok848test harvest::pagination_tests::harvest_task_access_filters_counts_and_preserves_rate_free_history ... ok849test server_fns::invoices::fee_tests::monthly_fees_use_calendar_dates_and_skip_already_claimed_months ... ok850test server_fns::invoices::fee_tests::fee_preview_discount_ties_follow_source_keys_not_display_dates ... ok851test server_fns::invoices::fee_tests::monthly_first_and_fifteenth_respect_partial_period_and_project_end ... ok852test server_fns::invoices::fee_tests::prepared_fee_selection_rejects_invalid_values_and_empty_generation ... ok853test jobs::tests::final_failure_is_retained_and_manual_retry_gets_a_new_budget ... ok854test server_fns::invoices::fee_tests::draft_fee_edit_replaces_amount_and_preserves_source_and_retry_identity ... ok855test server_fns::invoices::fee_tests::fee_preview_keeps_source_identity_and_reports_discounted_draft_balances ... ok856test jobs::report::tests::upgrading_legacy_reports_preserves_errors_and_fences_old_attempts ... ok857test server_fns::invoices::fee_tests::reviewed_generation_does_not_materialize_unselected_months ... ok858test server_fns::invoices::fee_tests::reviewed_generation_bills_partial_fees_and_rejects_stale_balances ... ok859test reports::streaming::database_tests::streamed_invoice_uses_stored_exact_cents_and_tenant_scoped_metadata ... ok860test jobs::outbox::tests::plugin_failure_retries_with_the_same_event_identity ... ok861test server_fns::invoices::fee_tests::single_fee_can_be_invoiced_without_time ... ok862test server_fns::invoices::fee_tests::project_fee_context_matches_invoice_balances_and_current_authority ... ok863test server_fns::invoices::preview::tests::excess_rejects_an_unrepresentable_total_even_when_the_remainder_fits ... ok864test server_fns::invoices::preview::tests::unselected_fee_currencies_do_not_relabel_or_block_selected_charges ... ok865test server_fns::invoices::fee_tests::void_releases_fee_identity_without_rewriting_the_original_line ... ok866test harvest::pagination_tests::harvest_own_time_omits_private_project_budget_metadata ... ok867test server_fns::invoices::tests::billing_cascade_agrees_across_all_four_levels_including_zero ... ok868test server_fns::invoices::tests::configured_fixed_fee_hours_are_not_invoiced_but_legacy_fees_are_unchanged ... ok869test server_fns::invoices::tests::configured_project_currency_and_cost_override_keep_their_denominations ... ok870test reports::streaming::database_tests::dropping_streamed_timesheet_closes_its_database_connection ... ok871test server_fns::invoices::tests::effective_minutes_migration_preserves_historical_invoice_quantities ... ok872test jobs::tests::invalid_policy_cannot_enqueue_a_job_or_upload ... ok873test server_fns::invoices::tests::imported_rates::rejected_import_rate_does_not_poison_the_next_row_or_its_catalog_rate ... ok874test server_fns::invoices::tests::effective_minutes_sql_matches_domain_rounding ... ok875test server_fns::invoices::fee_tests::reviewed_generation_requires_exact_excess_and_current_authority ... ok876test reports::streaming::database_tests::streamed_tag_filter_excludes_other_projects_without_duplicating_rows ... ok877test server_fns::invoices::fee_tests::concurrent_discounted_invoice_retries_return_one_invoice ... ok878test server_fns::invoices::fee_tests::invoice_preview_does_not_materialize_fees_and_preserves_released_snapshots ... ok879test server_fns::invoices::fee_tests::zero_fee_is_invoiced_once_until_voided ... ok880test server_fns::invoices::tests::invoice_defaults_validate_all_override_fields ... ok881test server_fns::invoices::tests::invoice_line_overflow_leaves_time_unbilled ... ok882test server_fns::invoices::tests::assignment_gate_allows_inflight_invoice_organization_fks_to_finish ... ok883test reports::limits::tests::bounded_invoice_limits_include_branding_and_preserve_tenant_scope ... ok884test server_fns::invoices::tests::invoice_defaults_are_invoice_owned_and_only_drafts_are_editable ... ok885test server_fns::invoices::tests::invoice_preview_requires_explicit_resolution_and_scopes_selected_projects ... ok886test server_fns::invoices::tests::invoice_total_overflow_leaves_all_time_unbilled ... ok887test server_fns::invoices::tests::invoice_transitions_reject_invalid_states_and_foreign_organizations ... ok888test server_fns::invoices::tests::invoiced_amounts_survive_rate_changes_and_void_uses_current_rates ... ok889test server_fns::invoices::tests::invoiced_billability_survives_later_project_changes ... ok890test server_fns::invoices::tests::invoicing_leaves_running_time_open ... ok891test server_fns::invoices::tests::invoicing_uses_and_freezes_effective_minutes ... ok892test server_fns::invoices::tests::large_invoice_and_reports_agree_without_intermediate_overflow ... ok893test server_fns::invoices::tests::mixed_project_currencies_cannot_partially_create_an_invoice ... ok894test server_fns::invoices::tests::non_billable_context_produces_no_unbilled_amount_on_any_report ... ok895test server_fns::invoices::tests::only_running_time_does_not_create_an_invoice ... ok896test server_fns::invoices::tests::project_rate_is_used_by_invoices_reports_and_spend ... ok897test server_fns::invoices::tests::selected_project_rate_modes_agree_across_billing_consumers ... ok898test server_fns::invoices::tests::void_reopens_time_without_stale_rounding ... ok899test server_fns::invoices::tests::void_waits_for_a_concurrent_payment_and_then_refuses ... ok900test reports::limits::tests::export_queries_are_read_only_and_have_a_database_deadline ... ok901test server_fns::organization::tests::each_branding_field_changes_once_including_null_and_empty ... ok902test server_fns::organization::tests::missing_organization_is_not_an_unchanged_update ... ok903test server_fns::invoices::tests::invoice_defaults_selection_rejects_unavailable_projects_before_claiming ... ok904test server_fns::organization::tests::unchanged_branding_preserves_the_row ... ok905test server_fns::organization::tests::restoring_branding_after_a_competing_edit_reports_a_change ... ok906test server_fns::organization::tests::repeating_a_competing_branding_edit_does_not_report_a_change ... ok907test reports::privacy_tests::unauthorized_project_text_does_not_affect_export_size_limits ... ok908test server_fns::project_creation::assignment_tests::finalization_reuses_catalog_and_keeps_lead_overrides_local_on_retry ... ok909test server_fns::project_creation::editing::tests::concurrent_edits_have_one_winner_and_association_writes_invalidate_open_forms ... ok910test server_fns::project_creation::assignment_tests::invalid_assignment_graphs_leave_no_partial_creation_or_draft_change ... ok911test server_fns::invoices::tests::invoice_defaults_edit_rechecks_status_after_waiting_for_a_concurrent_send ... ok912test server_fns::project_creation::editing::tests::editing_milestones_keeps_invoice_snapshots_and_fee_identities_immutable ... ok913test server_fns::project_creation::editing::tests::editor_loads_legacy_values_without_fabricating_a_billing_mode_or_draft ... ok914test server_fns::project_creation::editing::tests::editor_rechecks_tenant_role_and_active_status ... ok915test server_fns::project_creation::editing::tests::editor_keeps_archived_selected_identities_and_nullable_overrides ... ok916test server_fns::project_creation::editing::tests::editor_preserves_fee_schedule_and_operational_milestone_ids ... ok917test harvest::pagination_tests::harvest_pagination_router_preserves_session_and_tenant_guards ... ok918test server_fns::project_creation::editing::tests::foreign_actor_cannot_save_or_retry_another_organizations_edit ... ok919test server_fns::project_creation::editing::tests::editor_recovers_each_budget_scope_without_turning_absence_into_zero ... ok920test server_fns::project_creation::editing::tests::editor_recovers_full_configuration_and_redacts_private_values_after_role_change ... ok921test server_fns::project_creation::editing::tests::manager_edit_preserves_private_settings_and_cannot_remove_them_indirectly ... ok922test server_fns::invoices::tests::invoice_defaults_apply_exact_adjustments_and_payment_terms ... ok923test server_fns::project_creation::editing::tests::save_edits_the_same_legacy_project_and_never_creates_a_draft_or_configuration ... ok924test server_fns::project_creation::editing::tests::save_preserves_recorded_time_and_rejects_removing_its_task_or_person ... ok925test server_fns::project_creation::editing::tests::saves_recheck_current_authority_and_do_not_repeat_noops ... ok926test server_fns::project_creation::editing::tests::save_updates_configured_sections_atomically_and_rejects_stale_or_invalid_edits ... ok927test server_fns::project_creation::editing::tests::task_catalog_and_graph_changes_roll_back_together_on_duplicate_resolution ... ok928test server_fns::project_creation::tests::billing_schema_rejects_partial_fee_schedules ... ok929test server_fns::project_creation::tests::client_dialog_validates_details_and_persists_an_explicit_zero_rate ... ok930test server_fns::project_creation::tests::creation_actor_is_revalidated_inside_the_transaction ... ok931test reports::limits::tests::bounded_projects_filter_archives_before_size_checks ... ok932test server_fns::project_creation::tests::creation_client_must_be_active_and_in_the_same_organization ... ok933test server_fns::project_creation::tests::creation_options_are_scoped_bounded_and_redact_manager_costs ... ok934test server_fns::project_creation::tests::draft_ownership_discard_and_role_changes_are_enforced ... ok935test server_fns::project_creation::tests::draft_schema_enforces_one_current_draft_per_creator ... ok936test server_fns::project_creation::tests::draft_schema_rejects_oversize_payload_and_invalid_revision ... ok937test server_fns::project_creation::tests::draft_validation_preserves_incomplete_input_but_bounds_its_size ... ok938test server_fns::project_creation::tests::draft_save_retries_do_not_overwrite_a_newer_revision ... ok939test server_fns::project_creation::tests::final_validation_checks_invoice_defaults_and_scoped_budget_totals ... ok940test server_fns::project_creation::tests::final_validation_preserves_exact_budgets_and_rejects_unavailable_email ... ok941test server_fns::project_creation::tests::final_validation_requires_real_details_and_ignores_hidden_type_settings ... ok942test server_fns::project_creation::tests::final_validation_requires_complete_fee_schedules_and_distinct_entities ... ok943test server_fns::project_creation::locking_tests::every_project_entry_gates_before_actor_and_rechecks_revocation ... ok944test server_fns::project_creation::tests::draft_schema_rejects_foreign_creator_and_completed_project ... ok945test server_fns::project_creation::tests::existing_projects_have_no_implicit_new_billing_configuration ... ok946test server_fns::project_creation::tests::managers_cannot_store_administrator_notes_or_costs_in_a_draft ... ok947test seed::tests::concurrent_init_and_seed_cannot_mix_organizations ... ok948test server_fns::project_creation::tests::finalization_persists_task_access_and_project_only_financial_overrides ... ok949test server_fns::project_creation::tests::invalid_task_rolls_back_project_and_keeps_the_draft ... ok950test server_fns::project_creation::tests::finalization_rechecks_client_role_revision_and_rate_currency ... ok951test server_fns::project_creation::tests::finalize_is_atomic_and_repeated_submission_returns_one_project ... ok952test server_fns::project_creation::validation::tests::assignment_rejections_identify_the_invalid_row ... ok953test server_fns::project_creation::validation::tests::basic_rejections_identify_the_field_without_echoing_input ... ok954test server_fns::project_creation::validation::tests::billing_rejections_identify_the_active_control ... ok955test server_fns::project_creation::validation::tests::inactive_billing_inputs_remain_in_the_draft_without_blocking_creation ... ok956test server_fns::project_creation::validation::tests::invoice_rejections_identify_the_field_without_echoing_input ... ok957test server_fns::project_creation::validation::tests::milestone_rejections_target_the_invalid_row_by_identity ... ok958test server_fns::project_creation::validation::tests::non_billable_projects_ignore_hidden_invoice_inputs ... ok959test server_fns::project_creation::validation::tests::task_name_and_access_rejections_identify_the_invalid_row ... ok960test server_fns::project_creation::tests::simultaneous_draft_updates_have_one_winner ... ok961test server_fns::project_creation::tests::selected_client_lookup_is_scoped_and_keeps_archived_identity ... ok962test server_fns::project_creation::tests::missing_draft_responses_do_not_disclose_foreign_ownership ... ok963test server_fns::project_creation::tests::selected_catalog_bounds_requests_and_excludes_inactive_people ... ok964test server_fns::project_creation::tests::selected_catalog_is_scoped_deduplicated_and_redacts_manager_costs ... ok965test jobs::report::tests::legacy_upgrade_preserves_job_states_and_existing_archives ... ok966test server_fns::projects::bulk_tests::bulk_accepts_one_hundred_projects_and_mixed_status_noops ... ok967test server_fns::projects::bulk_tests::bulk_database_failure_rolls_back_earlier_changes ... ok968test server_fns::projects::bulk_tests::bulk_ids_validate_before_writes_and_normalize_duplicates ... ok969test server_fns::invoices::tests::invoice_preview_rejects_large_results_instead_of_truncating_them ... ok970test server_fns::projects::bulk_tests::bulk_missing_or_foreign_project_rolls_back_earlier_changes ... ok971test reports::streaming::database_tests::streamed_invoice_metadata_and_lines_share_one_snapshot ... ok972test server_fns::projects::bulk_tests::bulk_preserves_invoiced_history_assignments_and_spend ... ok973test server_fns::projects::bulk_tests::bulk_reversed_overlapping_batches_finish_without_deadlock ... ok974test server_fns::invoices::tests::invoice_preview_keeps_time_rates_and_defaults_in_one_snapshot ... ok975test server_fns::projects::bulk_tests::bulk_status_preserves_details_history_and_noop_versions ... ok976test server_fns::projects::details_tests::unlinked_and_private_project_tags_do_not_leak_into_filters ... ok977test jobs::outbox::tests::acknowledges_confirmed_delivery_without_reclaiming_it has been running for over 60 seconds978test server_fns::projects::mutation_tests::project::both_activation_transitions_preserve_details_and_change_once ... ok979test server_fns::invoices::tests::imported_rates::imported_task_rates_require_matching_currency_only_for_new_configured_links ... ok980test server_fns::projects::mutation_tests::project::concurrent_deletion_is_rejected_by_both_mutations ... ok981test jobs::tests::api_job_keeps_its_policy_across_duplicate_enqueue_and_manual_retry has been running for over 60 seconds982test jobs::tests::cancellation_waits_for_the_claimed_execution_before_allowing_retry has been running for over 60 seconds983test jobs::tests::invalid_stored_payloads_reach_a_terminal_error has been running for over 60 seconds984test jobs::tests::missing_configuration_records_error_and_requeues has been running for over 60 seconds985test jobs::tests::missing_csv_upload_records_error_and_requeues has been running for over 60 seconds986test jobs::tests::outbox_claims_only_the_requested_event_kind has been running for over 60 seconds987test jobs::tests::outbox_rollback_does_not_publish_an_event has been running for over 60 seconds988test server_fns::projects::mutation_tests::project::budgets_and_rates_distinguish_null_zero_and_normalized_values ... ok989test server_fns::invoices::fee_tests::settled_fee_sources_remain_reviewable_without_automatic_charges ... ok990test jobs::tests::reclaimed_attempt_rejects_stale_results_even_with_the_same_worker_name has been running for over 60 seconds991test server_fns::projects::mutation_tests::project::configured_edits_preserve_non_hourly_billing ... ok992test server_fns::projects::details_tests::project_details_and_tags_follow_current_progress_and_private_permissions ... ok993test server_fns::projects::mutation_tests::project::configured_edits_recheck_settings_after_waiting_for_the_project ... ok994test server_fns::projects::mutation_tests::project::configured_edits_preserve_compatible_changes_and_idempotence ... ok995test server_fns::projects::mutation_tests::project::inactive_project_edits_preserve_identity_and_reject_implicit_migrations ... ok996test server_fns::projects::mutation_tests::project::configured_edits_reject_incompatible_financial_changes_atomically ... ok997test server_fns::projects::assignment_tests::stale_administrator_cannot_create_or_remove_after_revocation ... ok998test server_fns::projects::mutation_tests::project::invalid_project_fields_leave_the_row_unchanged ... ok999test server_fns::projects::mutation_tests::project::repeating_a_competing_deactivation_reports_no_transition ... ok1000test server_fns::projects::mutation_tests::project::missing_and_foreign_rows_are_not_noops ... ok1001test server_fns::projects::mutation_tests::project::restoring_a_competing_deactivation_reports_reactivation ... ok1002test server_fns::projects::mutation_tests::task::both_activation_transitions_preserve_details_and_change_once ... ok1003test server_fns::projects::mutation_tests::project::repeating_a_competing_edit_requires_a_fresh_revision ... ok1004test server_fns::projects::mutation_tests::project::restoring_a_competing_edit_does_not_overwrite_the_other_session ... ok1005test jobs::tests::reclaimed_attempt_rejects_stale_results_even_with_the_same_worker_name ... ok1006test server_fns::projects::mutation_tests::task::each_detail_field_changes_once_and_preserves_inactive_status ... ok1007test server_fns::projects::mutation_tests::project::unchanged_edit_preserves_the_row ... ok1008test server_fns::projects::mutation_tests::task::concurrent_deletion_returns_not_found_for_both_mutations ... ok1009test server_fns::projects::mutation_tests::project::unchanged_activation_preserves_the_row ... ok1010test server_fns::projects::mutation_tests::task::rate_edits_set_currency_without_relabelling_renames_or_noops ... ok1011test server_fns::projects::mutation_tests::task::missing_and_foreign_rows_are_not_noops ... ok1012test server_fns::projects::mutation_tests::task::repeating_a_competing_deactivation_reports_no_transition ... ok1013test server_fns::projects::mutation_tests::task::restoring_a_competing_deactivation_reports_reactivation ... ok1014test server_fns::projects::mutation_tests::task::repeating_a_competing_edit_does_not_report_a_change ... ok1015test server_fns::projects::mutation_tests::task::restoring_a_competing_edit_reports_a_change ... ok1016test server_fns::projects::mutation_tests::task::unchanged_edit_preserves_the_row ... ok1017test server_fns::invoices::fee_tests::removing_discount_and_billing_the_remainder_cannot_both_succeed ... ok1018test server_fns::projects::mutation_tests::task::unchanged_activation_preserves_the_row ... ok1019test server_fns::projects::privacy_tests::client_project_filter_preserves_progress_access_and_rate_redaction ... ok1020test server_fns::projects::privacy_tests::legacy_members_retain_progress_without_new_settings ... ok1021test server_fns::projects::privacy_tests::revoked_membership_preserves_only_own_historical_tracking_identity ... ok1022test server_fns::projects::privacy_tests::project_reads_use_current_authority_and_reject_foreign_scope ... ok1023test server_fns::projects::privacy_tests::project_members_and_leads_receive_progress_without_rates ... ok1024test server_fns::projects::privacy_tests::private_progress_does_not_prevent_tracking_or_reveal_financial_fields ... ok1025test server_fns::projects::tests::creating_a_project_task_enables_it_with_its_defaults ... ok1026test server_fns::projects::details_tests::project_details_only_offer_task_rate_currency_to_current_managers ... ok1027test server_fns::projects::tests::assignments_are_scoped_to_the_viewers_organization ... ok1028test server_fns::projects::privacy_tests::outsiders_and_inactive_viewers_have_no_project_reads ... ok1029test server_fns::projects::tests::enabling_is_tenant_scoped_even_for_existing_links_and_preserves_overrides ... ok1030test server_fns::projects::tests::project_rate_distinguishes_inheritance_zero_and_exact_amounts ... ok1031test server_fns::projects::tests::enabling_tasks_accepts_exact_project_currency_rates_and_preserves_existing_links ... ok1032test server_fns::projects::tests::enabling_tasks_rejects_incompatible_catalog_currency ... ok1033test server_fns::projects::tests::enabling_tasks_rejects_invalid_or_wrong_currency_explicit_rates_without_linking ... ok1034test server_fns::projects::tests::failed_project_task_creation_leaves_no_orphan_task ... ok1035test server_fns::projects::tests::enabling_tasks_rejects_explicit_rates_unused_by_the_project ... ok1036test server_fns::projects::tests::enabling_tasks_only_inherits_rates_used_by_configured_projects ... ok1037test server_fns::projects::tests::project_rate_sql_matches_rust_for_missing_zero_and_present_sources ... ok1038test server_fns::projects::tests::members_can_list_identities_but_not_assignment_rates ... ok1039test server_fns::projects::tests::managers_and_admins_can_read_assignment_rates ... ok1040test server_fns::time_entries::tests::a_limit_bounds_a_listing_on_its_own ... ok1041test server_fns::projects::tests::unknown_catalog_currency_requires_explicit_configured_rates_but_preserves_legacy ... ok1042test jobs::tests::missing_configuration_records_error_and_requeues ... ok1043test server_fns::projects::tests::project_rate_helper_has_no_public_execute_grant ... ok1044test server_fns::time_entries::tests::an_open_entry_can_move_into_a_day_with_locked_time ... ok1045test server_fns::time_entries::tests::an_unlimited_listing_needs_both_ends_of_the_range ... ok1046test server_fns::time_entries::tests::a_running_timer_cannot_be_moved_to_another_day ... ok1047test server_fns::time_entries::tests::clamps_duration_against_the_snapped_start ... ok1048test server_fns::time_entries::tests::admin_may_log_time_without_assignment ... ok1049test seed::tests::seed_refuses_a_second_organization_even_when_the_demo_exists ... ok1050test server_fns::time_entries::tests::a_reorder_rejects_foreign_missing_timed_and_duplicate_ids ... ok1051test server_fns::time_entries::tests::assigned_member_may_log_time ... ok1052test server_fns::time_entries::tests::inactive_project_cannot_accept_new_time_even_for_admin ... ok1053test server_fns::time_entries::tests::concurrent_timer_starts_insert_exactly_one_entry ... ok1054test server_fns::time_entries::tests::moving_locked_time_rejects_the_entire_reorder ... ok1055test server_fns::time_entries::tests::rejects_out_of_range_start ... ok1056test server_fns::time_entries::tests::snaps_unaligned_start_to_the_grid ... ok1057test server_fns::time_entries::tests::edits_preserve_archived_time_but_cannot_override_non_billability ... ok1058test reports::streaming::database_tests::streamed_projects_preserve_scope_budget_and_tenant_isolation ... ok1059test server_fns::time_entries::tests::new_time_and_picker_require_a_project_task_link ... ok1060test server_fns::time_entries::tests::untimed_start_is_left_untouched ... ok1061test server_fns::time_entries::tests::new_time_and_picker_reject_inactive_or_foreign_contexts ... ok1062test server_fns::time_entries::tests::submission_barrier_blocks_edits_and_cross_week_reorders ... ok1063test server_fns::invoices::fee_tests::invoice_defaults_apply_to_selected_fees_without_claiming_other_projects ... ok1064test server_fns::time_entries::tests::unassigned_member_is_forbidden ... ok1065test server_fns::time_entries::tests::submission_barrier_blocks_manual_entries_and_timer_starts ... ok1066test server_fns::time_entries::tests::new_time_uses_effective_billability_for_manual_entries_and_timers ... ok1067test server_fns::time_entries::update_tests::effective_billability_noop_preserves_the_row ... ok1068test server_fns::invoices::fee_tests::project_fee_context_keeps_monthly_balances_separate ... ok1069test reports::limits::tests::export_size_checks_and_reads_share_a_repeatable_read_snapshot has been running for over 60 seconds1070test server_fns::time_entries::update_tests::competing_edit_that_restores_old_values_still_reports_a_change ... ok1071test server_fns::time_entries::update_tests::normalized_noop_preserves_the_row_and_updated_at ... ok1072test server_fns::time_entries::update_tests::competing_identical_edit_is_a_noop_after_the_first_commit ... ok1073test reports::limits::tests::tag_filter_applies_before_xlsx_size_checks_and_rendering has been running for over 60 seconds1074test server_fns::time_entries::update_tests::each_editable_field_changes_once_including_nulls ... ok1075test server_fns::time_entries::update_tests::restricted_empty_task_rejects_changes_and_noop_edits ... ok1076test server_fns::time_entries::update_tests::concurrent_lock_or_delete_is_rechecked_before_editing ... ok1077test server_fns::time_entries::update_tests::missing_foreign_and_locked_entries_are_not_noops ... ok1078test server_fns::invoices::tests::invoice_preview_matches_generation_without_claiming_time ... ok1079test server_fns::time_entries::update_tests::restricted_empty_task_rejects_picker_manual_and_timer_starts ... ok1080test server_fns::time_entries::update_tests::restricted_task_rejects_reschedule_and_delete ... ok1081test server_fns::time_entries::update_tests::restricted_reordering_rejects_the_whole_batch ... ok1082test server_fns::time_entries::update_tests::task_grant_revocation_committed_during_an_edit_is_rechecked ... ok1083test server_fns::time_entries::update_tests::restriction_changes_are_rechecked_before_manual_or_timer_insertion ... ok1084test server_fns::time_entries::update_tests::revoked_timer_stop_preserves_the_open_state_guard ... ok1085test server_fns::time_entries::update_tests::revoked_grant_does_not_trap_an_own_running_timer ... ok1086test server_fns::invoices::fee_tests::draft_fee_edit_requires_current_balance_and_exact_excess_confirmation ... ok1087test server_fns::time_entries::update_tests::task_grants_allow_tracking_and_archived_history_for_every_role ... ok1088test server_fns::users::tests::concurrency::access_changes_cannot_target_another_organization ... ok1089test server_fns::project_creation::editing::tests::editor_load_uses_current_role_across_all_billing_configurations ... ok1090test server_fns::users::tests::concurrency::concurrent_deactivations_keep_an_active_admin ... ok1091test server_fns::projects::assignment_tests::creation_rejects_foreign_and_unknown_project_or_person ... ok1092test server_fns::users::tests::concurrency::concurrent_demotions_keep_an_active_admin ... ok1093test server_fns::users::tests::concurrency::deactivation_and_demotion_keep_an_active_admin ... ok1094test harvest::pagination_tests::harvest_pagination_malformed_filters_are_client_errors ... ok1095test server_fns::users::tests::concurrency::demotion_and_deactivation_keep_an_active_admin ... ok1096test server_fns::users::tests::hide_rates_clears_both_rate_fields ... ok1097test server_fns::reports::tests::shared_person_and_task_are_partitioned_by_currency ... ok1098test server_fns::users::tests::concurrency::the_last_admin_cannot_be_demoted_or_deactivated ... ok1099test server_fns::users::tests::concurrency::unchanged_admin_access_is_allowed ... ok1100test server_fns::reports::tests::filters_and_renames_keep_report_identity_and_totals ... ok1101test server_fns::reports::tests::same_names_keep_separate_groups_for_every_dimension ... ok1102test server_fns::importers::authorization_tests::job_endpoints_enforce_session_role_and_organization has been running for over 60 seconds1103test server_fns::invoices::fee_tests::discounted_fee_leaves_a_balance_and_void_releases_only_its_contribution has been running for over 60 seconds1104test server_fns::invoices::fee_tests::draft_fee_edit_rejects_invalid_lines_and_current_unauthorized_actors has been running for over 60 seconds1105test server_fns::invoices::fee_tests::draft_fee_edit_serializes_retries_and_rejects_stale_revisions has been running for over 60 seconds1106test server_fns::invoices::fee_tests::fee_balance_migration_allocates_discount_without_rewriting_invoice_snapshots has been running for over 60 seconds1107test server_fns::invoices::fee_tests::invoice_status_rechecks_authority_after_waiting_for_the_invoice_lock has been running for over 60 seconds1108test server_fns::invoices::fee_tests::mixed_time_and_fee_discount_conserves_cents_without_reopening_time has been running for over 60 seconds1109test server_fns::importers::authorization_tests::job_endpoints_enforce_session_role_and_organization ... ok1110test server_fns::users::tests::authority::active_administrator_can_create_change_roles_and_deactivate ... ok1111test server_fns::invoices::fee_tests::reviewed_generation_rejects_changed_time_before_claiming_it has been running for over 60 seconds1112test harvest::pagination_tests::harvest_project_progress_permissions_cover_counts_pages_and_details ... ok1113test server_fns::projects::assignment_tests::removal_preserves_foreign_and_malformed_assignments ... ok1114test server_fns::projects::assignment_tests::project_membership_and_task_callers_wait_before_authorizing ... ok1115test server_fns::invoices::tests::imported_rates::imported_legacy_project_keeps_exact_rates_and_totals_on_retry has been running for over 60 seconds1116test server_fns::projects::assignment_tests::own_assignment_lifecycle_preserves_role_and_duplicate_behavior ... ok1117test server_fns::invoices::tests::invoice_defaults_conflict_rolls_back_all_claims has been running for over 60 seconds1118test server_fns::invoices::tests::invoice_defaults_legacy_insert_preserves_dates_and_exact_total has been running for over 60 seconds1119test server_fns::reports::tests::manager_report_omits_groups_containing_private_project_costs ... ok1120test server_fns::users::tests::authority::access_transaction_holds_actor_authority_until_commit ... ok1121test jobs::tests::outbox_claims_only_the_requested_event_kind ... ok1122test server_fns::invoices::fee_tests::mixed_time_and_fee_discount_conserves_cents_without_reopening_time ... ok1123test reports::limits::tests::tag_filter_applies_before_xlsx_size_checks_and_rendering ... ok1124test server_fns::reports::tests::tag_filters_keep_report_dimensions_and_details_in_sync ... ok1125test server_fns::invoices::tests::imported_rates::imported_legacy_project_keeps_exact_rates_and_totals_on_retry ... ok1126test server_fns::users::tests::authority::revoked_administrator_cannot_create_change_roles_or_deactivate ... ok1127test server_fns::invoices::fee_tests::draft_fee_edit_rejects_invalid_lines_and_current_unauthorized_actors ... ok1128test server_fns::invoices::tests::invoice_defaults_legacy_insert_preserves_dates_and_exact_total ... ok1129test jobs::tests::missing_csv_upload_records_error_and_requeues ... ok1130test server_fns::project_creation::import_tests::imported_catalog_rate_cannot_be_relabelled_as_workspace_currency has been running for over 60 seconds1131test server_fns::project_creation::import_tests::imports_preserve_finalized_project_configuration_and_restricted_access has been running for over 60 seconds1132test server_fns::project_creation::import_tests::imports_preserve_finalized_project_configuration_and_restricted_access ... ok1133test jobs::tests::cancellation_waits_for_the_claimed_execution_before_allowing_retry ... ok1134test server_fns::projects::assignment_tests::assignment_mutations_wait_for_revocation_and_recheck_authority has been running for over 60 seconds1135test server_fns::users::tests::authority::project_editor_and_user_revocation_commit_in_gate_order ... ok1136test server_fns::time_entries::update_tests::assignment_cascade_allows_an_inflight_entry_project_fk_to_finish ... ok1137test server_fns::projects::assignment_tests::assignment_mutations_wait_for_revocation_and_recheck_authority ... ok1138test server_fns::invoices::fee_tests::invoice_status_rechecks_authority_after_waiting_for_the_invoice_lock ... ok1139test server_fns::users::tests::authority::foreign_and_unknown_actors_cannot_change_local_user_access ... ok1140test jobs::tests::invalid_stored_payloads_reach_a_terminal_error ... ok1141test server_fns::invoices::fee_tests::reviewed_generation_rejects_changed_time_before_claiming_it ... ok1142test server_fns::invoices::fee_tests::draft_fee_edit_serializes_retries_and_rejects_stale_revisions ... ok1143test jobs::tests::api_job_keeps_its_policy_across_duplicate_enqueue_and_manual_retry ... ok1144test jobs::tests::outbox_rollback_does_not_publish_an_event ... ok1145test server_fns::reports::tests::report_uses_current_active_actor_and_tenant_for_every_filter has been running for over 60 seconds1146test harvest::pagination_tests::harvest_pagination_rejects_invalid_windows_on_every_collection ... ok1147test server_fns::users::tests::authority::user_mutations_wait_for_actor_revocation_and_recheck_after_commit ... ok1148test server_fns::reports::tests::report_uses_current_active_actor_and_tenant_for_every_filter ... ok1149test jobs::outbox::tests::acknowledges_confirmed_delivery_without_reclaiming_it ... ok1150test harvest::tests::imported_legacy_rates_survive_retry_in_harvest_list_and_detail ... ok1151test reports::limits::tests::export_size_checks_and_reads_share_a_repeatable_read_snapshot ... ok1152test server_fns::users::tests::authority::duplicate_creation_rolls_back_and_leaves_access_changes_usable ... ok1153test server_fns::users::tests::authority::user_mutations_recheck_revocation_after_waiting_for_organization_lock has been running for over 60 seconds1154test server_fns::project_creation::import_tests::imported_catalog_rate_cannot_be_relabelled_as_workspace_currency ... ok1155test server_fns::invoices::tests::invoice_defaults_conflict_rolls_back_all_claims ... ok1156test server_fns::invoices::fee_tests::discounted_fee_leaves_a_balance_and_void_releases_only_its_contribution ... ok1157test server_fns::invoices::fee_tests::fee_balance_migration_allocates_discount_without_rewriting_invoice_snapshots ... ok1158test server_fns::users::tests::authority::user_mutations_recheck_revocation_after_waiting_for_organization_lock ... ok11591160failures:11611162---- importers::harvest::engine_tests::csv_streaming::durable_csv_preview_cancel_preserves_simulation_for_manual_retry stdout ----11631164thread 'importers::harvest::engine_tests::csv_streaming::durable_csv_preview_cancel_preserves_simulation_for_manual_retry' (2020) panicked at crates/horae/src/importers/harvest/engine_tests/csv_streaming.rs:338:5:1165a durable batch must commit before source EOF1166note: run with `RUST_BACKTRACE=1` environment variable to display a backtrace11671168---- importers::harvest::engine_tests::csv_streaming::durable_csv_resumes_committed_batches_without_recounting_duplicate_rows stdout ----11691170thread 'importers::harvest::engine_tests::csv_streaming::durable_csv_resumes_committed_batches_without_recounting_duplicate_rows' (2038) panicked at crates/horae/src/importers/harvest/engine_tests/csv_streaming.rs:338:5:1171a durable batch must commit before source EOF117211731174failures:1175 importers::harvest::engine_tests::csv_streaming::durable_csv_preview_cancel_preserves_simulation_for_manual_retry1176 importers::harvest::engine_tests::csv_streaming::durable_csv_resumes_committed_batches_without_recounting_duplicate_rows11771178test result: FAILED. 834 passed; 2 failed; 11 ignored; 0 measured; 0 filtered out; finished in 170.68s11791180error: test failed, to rerun pass `-p horae --bin horae`