nixbot

builds

numtide/horae build #338 failed

branch fix/user-mutation-authority · PR #228 · commit 951baf9d31 · · took 2h 3m · eval 51s

2 failed
failed attributes
status attribute duration
failed checks.aarch64-linux.tests 13m 33s
horae-tests-0.1.0: ---- importers::harvest::sync_tests::paging::cancelled_page_consumer_retains_lock_until_worker_exits_and_rolls_back stdout ---- thread 'impor …
horae-tests-0.1.0:
---- importers::harvest::sync_tests::paging::cancelled_page_consumer_retains_lock_until_worker_exits_and_rolls_back stdout ----
thread 'importers::harvest::sync_tests::paging::cancelled_page_consumer_retains_lock_until_worker_exits_and_rolls_back' (3172) panicked at crates/horae/src/importers/harvest/sync_tests/paging.rs:297:10:
called `Result::unwrap()` on an `Err` value: Busy
note: run with `RUST_BACKTRACE=1` environment variable to display a backtrace
failures:
    importers::harvest::sync_tests::paging::cancelled_page_consumer_retains_lock_until_worker_exits_and_rolls_back
test result: FAILED. 835 passed; 1 failed; 11 ignored; 0 measured; 0 filtered out; finished in 137.58s
error: test failed, to rerun pass `-p horae --bin horae`
failed checks.x86_64-linux.tests 5m 51s
horae-tests-0.1.0: ---- importers::harvest::engine_tests::csv_streaming::durable_csv_resumes_committed_batches_without_recounting_duplicate_rows stdout ---- thr …
horae-tests-0.1.0:
---- importers::harvest::engine_tests::csv_streaming::durable_csv_resumes_committed_batches_without_recounting_duplicate_rows stdout ----
thread 'importers::harvest::engine_tests::csv_streaming::durable_csv_resumes_committed_batches_without_recounting_duplicate_rows' (2038) panicked at crates/horae/src/importers/harvest/engine_tests/csv_streaming.rs:338:5:
a durable batch must commit before source EOF
failures:
    importers::harvest::engine_tests::csv_streaming::durable_csv_preview_cancel_preserves_simulation_for_manual_retry
    importers::harvest::engine_tests::csv_streaming::durable_csv_resumes_committed_batches_without_recounting_duplicate_rows
test result: FAILED. 834 passed; 2 failed; 11 ignored; 0 measured; 0 filtered out; finished in 170.68s
error: test failed, to rerun pass `-p horae --bin horae`
14 succeeded
succeeded attributes
status attribute duration
loading…
4 already built
skipped attributes
status attribute duration
loading…