setup
checks.x86_64-linux.tests
· build #338
· raw
1this derivation will be built:2 /nix/store/v0f6dz6flkg3qn96ccbz6k8jqb39p0m6-horae-tests-0.1.0.drv3error: Cannot build '/nix/store/v0f6dz6flkg3qn96ccbz6k8jqb39p0m6-horae-tests-0.1.0.drv'.4 Reason: builder failed with exit code 101.5 Output paths:6 /nix/store/aqmcgc6k0z70bkvf3rlmw007qra02m93-horae-tests-0.1.07 Last 25 log lines:8 > test server_fns::invoices::fee_tests::discounted_fee_leaves_a_balance_and_void_releases_only_its_contribution ... ok9 > test server_fns::invoices::fee_tests::fee_balance_migration_allocates_discount_without_rewriting_invoice_snapshots ... ok10 > test server_fns::users::tests::authority::user_mutations_recheck_revocation_after_waiting_for_organization_lock ... ok11 >12 > failures:13 >14 > ---- importers::harvest::engine_tests::csv_streaming::durable_csv_preview_cancel_preserves_simulation_for_manual_retry stdout ----15 >16 > thread 'importers::harvest::engine_tests::csv_streaming::durable_csv_preview_cancel_preserves_simulation_for_manual_retry' (2020) panicked at crates/horae/src/importers/harvest/engine_tests/csv_streaming.rs:338:5:17 > a durable batch must commit before source EOF18 > note: run with `RUST_BACKTRACE=1` environment variable to display a backtrace19 >20 > ---- importers::harvest::engine_tests::csv_streaming::durable_csv_resumes_committed_batches_without_recounting_duplicate_rows stdout ----21 >22 > thread 'importers::harvest::engine_tests::csv_streaming::durable_csv_resumes_committed_batches_without_recounting_duplicate_rows' (2038) panicked at crates/horae/src/importers/harvest/engine_tests/csv_streaming.rs:338:5:23 > a durable batch must commit before source EOF24 >25 >26 > failures:27 > importers::harvest::engine_tests::csv_streaming::durable_csv_preview_cancel_preserves_simulation_for_manual_retry28 > importers::harvest::engine_tests::csv_streaming::durable_csv_resumes_committed_batches_without_recounting_duplicate_rows29 >30 > test result: FAILED. 834 passed; 2 failed; 11 ignored; 0 measured; 0 filtered out; finished in 170.68s31 >32 > error: test failed, to rerun pass `-p horae --bin horae`33 For full logs, run:34 nix log /nix/store/v0f6dz6flkg3qn96ccbz6k8jqb39p0m6-horae-tests-0.1.0.drv