nixbot

builds

failed horae-tests-0.1.0 checks.aarch64-darwin.tests · build #28 · raw

1mac02: building 2qp38a4qid2lclfy8wqpf62yjla9c9gz-horae-tests-0.1.0.drv
unpackPhase
2unpacking source archive /nix/store/xf0lh5v98pi1jy57i4pq31f73dx2a0wz-source3source root is source4Executing cargoSetupPostUnpackHook5Finished cargoSetupPostUnpackHook
patchPhase
6Executing cargoSetupPostPatchHook7Validating consistency between /nix/var/nix/builds/nix-32654-952730949/source/Cargo.lock and /nix/var/nix/builds/nix-32654-952730949/cargo-vendor-dir/Cargo.lock8Finished cargoSetupPostPatchHook
buildPhase
9 Compiling proc-macro2 v1.0.10610 Compiling quote v1.0.4611 Compiling unicode-ident v1.0.2412 Compiling serde_core v1.0.22813 Compiling autocfg v1.5.114 Compiling serde v1.0.22815 Compiling core-foundation-sys v0.8.716 Compiling thiserror v2.0.1817 Compiling iana-time-zone v0.1.6518 Compiling num-traits v0.2.1919 Compiling syn v2.0.11820 Compiling serde_derive v1.0.22821 Compiling thiserror-impl v2.0.1822 Compiling uuid v1.23.423 Compiling chrono v0.4.4524 Compiling horae-core v0.1.0 (/nix/var/nix/builds/nix-32654-952730949/source/crates/core)25 Finished `test` profile [unoptimized + debuginfo] target(s) in 5.23s26------------27 Nextest run ID 187ad169-b744-4517-a3bf-d196fd2607f0 with nextest profile: default28 Starting 121 tests across 1 binary29 Running [ 00:00:00] 0/121: 10 running, 0 passed, 0 skipped 30 [ 00:00:00] horae-core ed_alert_threshold_is_exact_without_rounding31 [ 00:00:00] horae-core ert_accepts_zero_percent_but_not_zero_budget32 [ 00:00:00] horae-core ::a_single_jump_announces_every_crossed_band33 [ 00:00:00] horae-core jects_invalid_inputs_and_widens_large_values34 [ 00:00:00] horae-core percentage_rounds_clamps_and_never_overflows35 [ 00:00:00] horae-core ::tests::current_band_is_the_highest_reached36 [ 00:00:00] horae-core dget::tests::each_crossing_is_announced_once37 [ 00:00:00] horae-core elow_a_band_does_not_fire_but_current_resets38 Running [ 00:00:00] => 30/121: 10 running, 30 passed, 0 skipped 39 [ 00:00:00] horae-core s::conversion_matches_exact_scaled_rationals40 [ 00:00:00] horae-core he_i64_boundary_and_rejects_rounding_past_it41 [ 00:00:00] horae-core epresentable_scaled_values_without_panicking42 [ 00:00:00] horae-core rsion_reports_precision_and_numerator_limits43 [ 00:00:00] horae-core n_fraction_straddles_the_half_minute_exactly44 [ 00:00:00] horae-core harvest::convert::tests::garbage_is_rejected45 [ 00:00:00] horae-core onvert::tests::hours_common_values_are_exact46 [ 00:00:00] horae-core :hours_round_trip_against_exporter_transform47 PASS [ 0.011s] horae-core budget::tests::configured_alert_rejects_invalid_inputs_and_widens_large_values48 PASS [ 0.011s] horae-core budget::tests::configured_alert_accepts_zero_percent_but_not_zero_budget49 PASS [ 0.013s] horae-core budget::tests::display_percentage_rounds_clamps_and_never_overflows50 PASS [ 0.014s] horae-core budget::tests::a_single_jump_announces_every_crossed_band51 PASS [ 0.013s] horae-core budget::tests::no_band_for_zero_or_missing_budget52 PASS [ 0.014s] horae-core budget::tests::configured_alert_threshold_is_exact_without_rounding53 PASS [ 0.014s] horae-core budget::tests::current_band_is_the_highest_reached54 PASS [ 0.017s] horae-core budget::tests::drop_below_a_band_does_not_fire_but_current_resets55 PASS [ 0.019s] horae-core budget::tests::large_values_do_not_overflow56 PASS [ 0.019s] horae-core budget::tests::each_crossing_is_announced_once57 PASS [ 0.014s] horae-core budget::tests::over_budget_fires_even_without_a_configured_100_band58 PASS [ 0.012s] horae-core client::tests::profile_rejects_unsupported_currency_and_null_billing_fields59 PASS [ 0.014s] horae-core client::tests::default_rate_preserves_absence_zero_and_exact_large_amounts60 PASS [ 0.014s] horae-core client::tests::profile_rejects_blank_overlong_and_null_names61 PASS [ 0.014s] horae-core client::tests::profile_accepts_supported_currencies_and_unicode_character_limit62 PASS [ 0.010s] horae-core duration::tests::format_round_trip63 PASS [ 0.017s] horae-core client::tests::default_rate_rejects_negative_fractional_cent_overflow_and_invalid_text64 PASS [ 0.012s] horae-core duration::tests::format_hhmm_pads_minutes65 PASS [ 0.017s] horae-core client::tests::optional_text_normalizes_only_blank_fields66 PASS [ 0.015s] horae-core duration::tests::format_clamps_negative_to_zero67 PASS [ 0.014s] horae-core duration::tests::minutes_between_is_exact_no_minimum68 PASS [ 0.012s] horae-core duration::tests::parse_preserves_u32_boundary_without_saturating69 PASS [ 0.015s] horae-core duration::tests::parse_decimal70 PASS [ 0.013s] horae-core duration::tests::parse_round_trips_each_minute_in_a_day71 PASS [ 0.013s] horae-core duration::tests::parse_rejects_negative_non_finite_and_malformed_values72 PASS [ 0.012s] horae-core importers::harvest::convert::tests::conversion_handles_high_precision_without_intermediate_overflow73 PASS [ 0.018s] horae-core duration::tests::parse_colon74 Running [ 00:00:00] => 30/121: 10 running, 30 passed, 0 skipped 75 [ 00:00:00] horae-core s::conversion_matches_exact_scaled_rationals76 [ 00:00:00] horae-core he_i64_boundary_and_rejects_rounding_past_it77 [ 00:00:00] horae-core epresentable_scaled_values_without_panicking78 [ 00:00:00] horae-core rsion_reports_precision_and_numerator_limits79 [ 00:00:00] horae-core n_fraction_straddles_the_half_minute_exactly80 [ 00:00:00] horae-core harvest::convert::tests::garbage_is_rejected81 [ 00:00:00] horae-core onvert::tests::hours_common_values_are_exact82 [ 00:00:00] horae-core :hours_round_trip_against_exporter_transform83 PASS [ 0.017s] horae-core duration::tests::parse_decimal_rounds_half_minutes_exactly84 PASS [ 0.016s] horae-core duration::tests::parse_rejects_excessive_decimal_precision_and_numerator85 PASS [ 0.017s] horae-core duration::tests::parse_rejects_colon_overflow_without_panicking86 Running [ 00:00:00] => 30/121: 10 running, 30 passed, 0 skipped 87 [ 00:00:00] horae-core s::conversion_matches_exact_scaled_rationals88 [ 00:00:00] horae-core he_i64_boundary_and_rejects_rounding_past_it89 [ 00:00:00] horae-core epresentable_scaled_values_without_panicking90 [ 00:00:00] horae-core rsion_reports_precision_and_numerator_limits91 [ 00:00:00] horae-core n_fraction_straddles_the_half_minute_exactly92 [ 00:00:00] horae-core harvest::convert::tests::garbage_is_rejected93 [ 00:00:00] horae-core onvert::tests::hours_common_values_are_exact94 [ 00:00:00] horae-core :hours_round_trip_against_exporter_transform95 Running [ 00:00:00] ====> 68/121: 10 running, 68 passed, 0 skipped 96 [ 00:00:00] horae-core s::conversion_matches_exact_scaled_rationals97 [ 00:00:00] horae-core e_amount_accepts_large_representable_amounts98 [ 00:00:00] horae-core invoice::tests::line_amount_exact_hour99 [ 00:00:00] horae-core invoice::tests::line_amount_half_hour100 [ 00:00:00] horae-core invoice::tests::line_amount_odd_minutes101 [ 00:00:00] horae-core :line_amount_rejects_unrepresentable_results102 [ 00:00:00] horae-core line_amount_rounds_half_cents_up_not_to_even103 [ 00:00:00] horae-core invoice::tests::line_amount_zero_minutes104 PASS [ 0.011s] horae-core importers::harvest::convert::tests::conversion_rejects_unrepresentable_scaled_values_without_panicking105 PASS [ 0.009s] horae-core importers::harvest::convert::tests::garbage_is_rejected106 PASS [ 0.009s] horae-core importers::harvest::convert::tests::hours_common_values_are_exact107 PASS [ 0.010s] horae-core importers::harvest::convert::tests::conversion_reports_precision_and_numerator_limits108 PASS [ 0.014s] horae-core importers::harvest::convert::tests::conversion_preserves_the_i64_boundary_and_rejects_rounding_past_it109 PASS [ 0.013s] horae-core importers::harvest::convert::tests::money_common_values_are_exact110 PASS [ 0.016s] horae-core importers::harvest::convert::tests::high_precision_fraction_straddles_the_half_minute_exactly111 PASS [ 0.016s] horae-core importers::harvest::convert::tests::hours_round_trip_against_exporter_transform112 PASS [ 0.010s] horae-core importers::harvest::convert::tests::money_round_trip_against_exporter_transform113 PASS [ 0.018s] horae-core importers::harvest::convert::tests::leading_and_trailing_forms_parse114 PASS [ 0.011s] horae-core importers::harvest::convert::tests::money_rounds_third_decimal_half_up115 PASS [ 0.011s] horae-core importers::harvest::convert::tests::negative_is_rejected116 PASS [ 0.012s] horae-core importers::harvest::convert::tests::round_half_up_at_the_boundary117 PASS [ 0.008s] horae-core importers::harvest::keys::tests::normalize_trims_and_case_folds118 PASS [ 0.010s] horae-core importers::harvest::keys::tests::composite_components_do_not_collide119 PASS [ 0.015s] horae-core importers::harvest::keys::tests::client_key_equal_across_case_and_whitespace120 PASS [ 0.011s] horae-core importers::harvest::keys::tests::normalize_matches_sql_harvest_norm_contract121 PASS [ 0.011s] horae-core importers::harvest::keys::tests::occurrence_counter_keys_are_independent122 PASS [ 0.008s] horae-core importers::harvest::keys::tests::task_key_shared_across_projects123 PASS [ 0.010s] horae-core importers::harvest::keys::tests::project_key_prefers_code_when_present124 PASS [ 0.012s] horae-core importers::harvest::keys::tests::project_key_falls_back_to_client_and_name125 PASS [ 0.013s] horae-core importers::harvest::keys::tests::occurrence_counter_numbers_repeats_from_zero126 PASS [ 0.010s] horae-core importers::harvest::keys::tests::time_entry_key_distinguishes_and_matches127 PASS [ 0.011s] horae-core importers::harvest::types::account_switch_tests::account_switch_requires_binding_and_no_imports_or_active_work128 Running [ 00:00:00] ====> 68/121: 10 running, 68 passed, 0 skipped 129 [ 00:00:00] horae-core s::conversion_matches_exact_scaled_rationals130 [ 00:00:00] horae-core e_amount_accepts_large_representable_amounts131 [ 00:00:00] horae-core invoice::tests::line_amount_exact_hour132 [ 00:00:00] horae-core invoice::tests::line_amount_half_hour133 [ 00:00:00] horae-core invoice::tests::line_amount_odd_minutes134 [ 00:00:00] horae-core :line_amount_rejects_unrepresentable_results135 [ 00:00:00] horae-core line_amount_rounds_half_cents_up_not_to_even136 [ 00:00:00] horae-core invoice::tests::line_amount_zero_minutes137 PASS [ 0.012s] horae-core importers::harvest::types::tests::does_not_reconcile_when_an_errored_count_has_no_reported_error138 PASS [ 0.013s] horae-core importers::harvest::types::tests::archived_errors_and_new_inline_errors_reconcile_across_batches139 PASS [ 0.011s] horae-core importers::harvest::types::tests::import_modes_display_their_wire_names140 PASS [ 0.011s] horae-core importers::harvest::types::tests::reconciles_when_errored_counts_match_collected_errors141 PASS [ 0.011s] horae-core invoice::tests::discount_allocation_handles_empty_zero_and_full_discounts142 PASS [ 0.014s] horae-core invoice::tests::discount_allocation_rejects_negative_lines_and_subtotal_overflow143 PASS [ 0.011s] horae-core invoice::tests::discount_allocation_uses_largest_remainder_then_stable_source_order144 PASS [ 0.013s] horae-core invoice::tests::discount_allocation_supports_maximum_representable_subtotal145 PASS [ 0.016s] horae-core invoice::tests::discount_allocation_conserves_header_amount_and_bounds_each_line146 PASS [ 0.009s] horae-core invoice::tests::line_amount_90_minutes147 PASS [ 0.011s] horae-core invoice::tests::invoice_adjustments_reject_negative_subtotal_and_overflow148 PASS [ 0.014s] horae-core invoice::tests::discounted_fee_contribution_leaves_discount_available149 PASS [ 0.013s] horae-core invoice::tests::invoice_adjustments_apply_discount_before_non_compounding_taxes150 PASS [ 0.011s] horae-core invoice::tests::invoice_adjustments_round_components_half_up151 Running [ 00:00:00] ====> 68/121: 10 running, 68 passed, 0 skipped 152 [ 00:00:00] horae-core s::conversion_matches_exact_scaled_rationals153 [ 00:00:00] horae-core e_amount_accepts_large_representable_amounts154 [ 00:00:00] horae-core invoice::tests::line_amount_exact_hour155 [ 00:00:00] horae-core invoice::tests::line_amount_half_hour156 [ 00:00:00] horae-core invoice::tests::line_amount_odd_minutes157 [ 00:00:00] horae-core :line_amount_rejects_unrepresentable_results158 [ 00:00:00] horae-core line_amount_rounds_half_cents_up_not_to_even159 [ 00:00:00] horae-core invoice::tests::line_amount_zero_minutes160 Running [ 00:00:00] =======> 110/121: 10 running, 68 passed, 0 skipped 161 [ 00:00:00] horae-core s::conversion_matches_exact_scaled_rationals162 [ 00:00:00] horae-core e_amount_accepts_large_representable_amounts163 [ 00:00:00] horae-core invoice::tests::line_amount_exact_hour164 [ 00:00:00] horae-core invoice::tests::line_amount_half_hour165 [ 00:00:00] horae-core invoice::tests::line_amount_odd_minutes166 [ 00:00:00] horae-core :line_amount_rejects_unrepresentable_results167 [ 00:00:00] horae-core line_amount_rounds_half_cents_up_not_to_even168 [ 00:00:00] horae-core invoice::tests::line_amount_zero_minutes169 PASS [ 0.011s] horae-core invoice::tests::line_amount_accepts_large_representable_amounts170 PASS [ 0.011s] horae-core invoice::tests::line_amount_odd_minutes171 PASS [ 0.012s] horae-core invoice::tests::line_amount_half_hour172 PASS [ 0.013s] horae-core invoice::tests::line_amount_exact_hour173 PASS [ 0.010s] horae-core invoice::tests::line_amount_rejects_unrepresentable_results174 PASS [ 0.011s] horae-core invoice::tests::line_amount_zero_minutes175 PASS [ 0.011s] horae-core invoice::tests::resolve_rate_cascade176 PASS [ 0.013s] horae-core invoice::tests::line_amount_rounds_half_cents_up_not_to_even177 PASS [ 0.013s] horae-core invoice::tests::line_amount_zero_rate178 PASS [ 0.010s] horae-core invoice::tests::selected_rate_keeps_zero_and_explicit_missing_project_rate179 PASS [ 0.010s] horae-core invoice::tests::selected_rate_mode_ignores_unselected_rate_sources180 PASS [ 0.010s] horae-core money::tests::format_cents_plain_keeps_sign_below_one_unit181 PASS [ 0.013s] horae-core money::tests::addition_retains_currency_checks_and_representable_boundaries182 PASS [ 0.009s] horae-core money::tests::parse_cents_reads_whole_and_fractional_amounts183 PASS [ 0.014s] horae-core money::tests::addition_rejects_overflow_in_both_directions184 PASS [ 0.012s] horae-core money::tests::parse_cents_is_exact_where_a_float_would_drift185 PASS [ 0.008s] horae-core project::tests::basics_accept_same_day_but_reject_reversed_dates186 PASS [ 0.013s] horae-core money::tests::parse_cents_rejects_what_it_cannot_represent187 PASS [ 0.016s] horae-core money::tests::format_cents_groups_thousands_and_keeps_sign188 PASS [ 0.082s] horae-core importers::harvest::convert::tests::conversion_matches_exact_scaled_rationals189 PASS [ 0.013s] horae-core money::tests::parse_cents_tolerates_grouping_spaces_and_signs190 PASS [ 0.009s] horae-core project::tests::basics_accept_supported_currencies_and_optional_dates191 PASS [ 0.010s] horae-core project::tests::basics_reject_blank_and_overlong_names192 PASS [ 0.011s] horae-core project::tests::fee_schedules_validate_amounts_and_milestone_total193 PASS [ 0.013s] horae-core project::tests::basics_reject_overlong_code_and_unsupported_currency194 PASS [ 0.012s] horae-core project::tests::fee_schedules_reject_missing_overlong_and_excessive_milestones195 PASS [ 0.010s] horae-core project::tests::monthly_fee_dates_follow_calendar_months196 Running [ 00:00:00] =======> 112/121: 9 running, 112 passed, 0 skipped 197 [ 00:00:00] horae-core _day::tests::parse_reads_12h_including_edges198 [ 00:00:00] horae-core time_of_day::tests::parse_reads_24h199 [ 00:00:00] horae-core ests::parse_rejects_out_of_range_and_garbage200 [ 00:00:00] horae-core e_of_day::tests::snap_rounds_to_nearest_step201 [ 00:00:00] horae-core ests::budget_kind_wire_strings_match_db_enum202 [ 00:00:00] horae-core nfigured_week_can_start_in_the_previous_year203 [ 00:00:00] horae-core k_contains_each_day_for_all_seven_start_days204 [ 00:00:00] horae-core igured_week_reports_an_unrepresentable_start205 PASS [ 0.011s] horae-core project::tests::monthly_fee_dates_reject_invalid_calendar_inputs206 PASS [ 0.011s] horae-core project::tests::payment_terms_support_receipt_and_checked_days207 PASS [ 0.012s] horae-core project::tests::monetary_budgets_are_only_available_for_time_and_materials208 PASS [ 0.010s] horae-core project::tests::percentage_rejects_invalid_precision_range_and_syntax209 PASS [ 0.009s] horae-core rounding::tests::effective_minutes_respect_frozen_history_including_zero210 PASS [ 0.013s] horae-core project::tests::percentage_preserves_exact_hundredths211 PASS [ 0.008s] horae-core rounding::tests::result_is_multiple_of_inc212 PASS [ 0.010s] horae-core rounding::tests::identity_when_inc_zero213 PASS [ 0.009s] horae-core rounding::tests::up_and_down214 PASS [ 0.010s] horae-core rounding::tests::nearest_ties_round_up215 PASS [ 0.013s] horae-core state::tests::invoiced_is_final216 PASS [ 0.013s] horae-core state::tests::managers_invoice_open_and_approved_time217 PASS [ 0.014s] horae-core state::tests::member_submit_and_reopen218 PASS [ 0.009s] horae-core time_of_day::tests::format_12h_matches_harvest_style219 PASS [ 0.011s] horae-core time_of_day::tests::clamp_to_day_prevents_crossing_midnight220 PASS [ 0.012s] horae-core state::tests::only_manager_can_approve221 PASS [ 0.010s] horae-core time_of_day::tests::format_round_trips222 Running [ 00:00:00] =======> 112/121: 9 running, 112 passed, 0 skipped 223 [ 00:00:00] horae-core _day::tests::parse_reads_12h_including_edges224 [ 00:00:00] horae-core time_of_day::tests::parse_reads_24h225 [ 00:00:00] horae-core ests::parse_rejects_out_of_range_and_garbage226 [ 00:00:00] horae-core e_of_day::tests::snap_rounds_to_nearest_step227 [ 00:00:00] horae-core ests::budget_kind_wire_strings_match_db_enum228 [ 00:00:00] horae-core nfigured_week_can_start_in_the_previous_year229 [ 00:00:00] horae-core k_contains_each_day_for_all_seven_start_days230 [ 00:00:00] horae-core igured_week_reports_an_unrepresentable_start231 PASS [ 0.010s] horae-core time_of_day::tests::parse_reads_12h_including_edges232 PASS [ 0.010s] horae-core time_of_day::tests::parse_rejects_out_of_range_and_garbage233 PASS [ 0.013s] horae-core time_of_day::tests::parse_reads_24h234 PASS [ 0.009s] horae-core week::tests::configured_week_contains_each_day_for_all_seven_start_days235 PASS [ 0.011s] horae-core types::tests::budget_kind_wire_strings_match_db_enum236 PASS [ 0.012s] horae-core time_of_day::tests::snap_rounds_to_nearest_step237 PASS [ 0.012s] horae-core week::tests::configured_week_can_start_in_the_previous_year238 PASS [ 0.011s] horae-core week::tests::configured_week_reports_an_unrepresentable_start239 PASS [ 0.011s] horae-core week::tests::maps_any_weekday_to_its_monday240------------241 Summary [ 0.162s] 121 tests run: 121 passed, 0 skipped242 Running [ 00:00:00] ======== 121/121: 9 running, 112 passed, 0 skipped 243 [ 00:00:00] horae-core _day::tests::parse_reads_12h_including_edges244 [ 00:00:00] horae-core time_of_day::tests::parse_reads_24h245 [ 00:00:00] horae-core ests::parse_rejects_out_of_range_and_garbage246 [ 00:00:00] horae-core e_of_day::tests::snap_rounds_to_nearest_step247 [ 00:00:00] horae-core ests::budget_kind_wire_strings_match_db_enum248 [ 00:00:00] horae-core nfigured_week_can_start_in_the_previous_year249 [ 00:00:00] horae-core k_contains_each_day_for_all_seven_start_days250 [ 00:00:00] horae-core igured_week_reports_an_unrepresentable_start251The files belonging to this database system will be owned by user "_nixbld10".252This user must also own the server process.253254The database cluster will be initialized with locale "C".255The default text search configuration will be set to "english".256257Data page checksums are disabled.258259fixing permissions on existing directory /nix/var/nix/builds/nix-32654-952730949/tmp.jSW7B3WMoS ... ok260creating subdirectories ... ok261selecting dynamic shared memory implementation ... posix262selecting default "max_connections" ... 100263selecting default "shared_buffers" ... 128MB264selecting default time zone ... UTC265creating configuration files ... ok266running bootstrap script ... ok267performing post-bootstrap initialization ... ok268syncing data to disk ... ok269270initdb: warning: enabling "trust" authentication for local connections271initdb: hint: You can change this by editing pg_hba.conf or using the option -A, or --auth-local and --auth-host, the next time you run initdb.272273Success. You can now start the database server using:274275 pg_ctl -D /nix/var/nix/builds/nix-32654-952730949/tmp.jSW7B3WMoS -l logfile start276277waiting for server to start.... done278server started279 Compiling unicode-ident v1.0.24280 Compiling proc-macro2 v1.0.106281 Compiling serde v1.0.228282 Compiling serde_core v1.0.228283 Compiling cfg-if v1.0.4284 Compiling libc v0.2.186285 Compiling memchr v2.8.3286 Compiling version_check v0.9.5287 Compiling log v0.4.33288 Compiling libm v0.2.16289 Compiling itoa v1.0.18290 Compiling equivalent v1.0.2291 Compiling foldhash v0.2.0292 Compiling once_cell v1.21.4293 Compiling pin-project-lite v0.2.17294 Compiling typenum v1.20.1295 Compiling slab v0.4.12296 Compiling parking_lot_core v0.9.12297 Compiling scopeguard v1.2.0298 Compiling crossbeam-utils v0.8.22299 Compiling futures-core v0.3.32300 Compiling zeroize v1.9.0301 Compiling crossbeam-epoch v0.9.20302 Compiling crossbeam-deque v0.8.7303 Compiling hashbrown v0.17.1304 Compiling rayon-core v1.13.0305 Compiling quote v1.0.46306 Compiling syn v2.0.118307 Compiling futures-io v0.3.32308 Compiling futures-task v0.3.32309 Compiling num-traits v0.2.19310 Compiling getrandom v0.2.17311 Compiling futures-sink v0.3.32312 Compiling futures-channel v0.3.32313 Compiling rand_core v0.6.4314 Compiling generic-array v0.14.7315 Compiling zmij v1.0.21316 Compiling subtle v2.6.1317 Compiling allocator-api2 v0.2.21318 Compiling fnv v1.0.7319 Compiling bitflags v2.13.0320 Compiling stable_deref_trait v1.2.1321 Compiling crc32fast v1.5.0322 Compiling errno v0.3.14323 Compiling jobserver v0.1.35324 Compiling find-msvc-tools v0.1.9325 Compiling shlex v2.0.1326 Compiling const-oid v0.9.6327 Compiling base64 v0.22.1328 Compiling cc v1.2.66329 Compiling tracing-core v0.1.36330 Compiling zerocopy v0.8.53331 Compiling anyhow v1.0.103332 Compiling utf8_iter v1.0.4333 Compiling serde_json v1.0.150334 Compiling percent-encoding v2.3.2335 Compiling rustc-hash v2.1.3336 Compiling icu_properties_data v2.2.0337 Compiling crypto-common v0.1.7338 Compiling block-buffer v0.10.4339 Compiling icu_normalizer_data v2.2.0340 Compiling synstructure v0.13.2341 Compiling digest v0.10.7342 Compiling simd-adler32 v0.3.9343 Compiling adler2 v2.0.1344 Compiling writeable v0.6.3345 Compiling heck v0.5.0346 Compiling miniz_oxide v0.8.9347 Compiling litemap v0.8.2348 Compiling zlib-rs v0.6.6349 Compiling signal-hook-registry v1.4.8350 Compiling socket2 v0.6.4351 Compiling mio v1.2.1352 Compiling cpufeatures v0.2.17353 Compiling utf16_iter v1.0.5354 Compiling write16 v1.0.0355 Compiling num-conv v0.2.2356 Compiling time-core v0.1.9357 Compiling powerfmt v0.2.0358 Compiling form_urlencoded v1.2.2359 Compiling ryu v1.0.23360 Compiling slotmap v1.1.1361 Compiling time-macros v0.2.31362 Compiling memmap2 v0.9.11363 Compiling rustversion v1.0.23364 Compiling bumpalo v3.20.3365 Compiling deranged v0.5.8366 Compiling unicode-segmentation v1.13.3367 Compiling winnow v0.7.15368 Compiling serde_derive v1.0.228369 Compiling thiserror-impl v2.0.18370 Compiling zerofrom-derive v0.1.7371 Compiling yoke-derive v0.8.2372 Compiling zerovec-derive v0.11.3373 Compiling displaydoc v0.2.6374 Compiling futures-macro v0.3.32375 Compiling zerofrom v0.1.8376 Compiling thiserror v2.0.18377 Compiling tracing-attributes v0.1.31378 Compiling zerocopy-derive v0.8.53379 Compiling tokio-macros v2.7.0380 Compiling yoke v0.8.3381 Compiling futures-util v0.3.32382 Compiling cobs v0.3.0383 Compiling bytemuck_derive v1.11.0384 Compiling time v0.3.53385 Compiling zerovec v0.11.6386 Compiling unicode-xid v0.2.6387 Compiling arrayvec v0.7.8388 Compiling tracing v0.1.44389 Compiling httparse v1.10.1390 Compiling getrandom v0.4.3391 Compiling bytemuck v1.25.1392 Compiling tinyvec_macros v0.1.1393 Compiling siphasher v1.0.3394 Compiling tinyvec v1.11.0395 Compiling tinystr v0.8.3396 Compiling flate2 v1.1.9397 Compiling hashbrown v0.16.1398 Compiling semver v1.0.28399 Compiling spin v0.9.8400 Compiling fastrand v2.4.1401 Compiling smallvec v1.15.2402 Compiling either v1.16.0403 Compiling lock_api v0.4.14404 Compiling bytes v1.12.0405 Compiling postcard v1.1.3406 Compiling rayon v1.12.0407 Compiling parking_lot v0.12.5408 Compiling indexmap v2.14.0409 Compiling polycool v0.4.0410 Compiling tokio v1.52.3411 Compiling http v1.4.2412 Compiling kurbo v0.13.1413 Compiling tower-service v0.3.3414 Compiling unicode-properties v0.1.4415 Compiling ring v0.17.14416 Compiling aho-corasick v1.1.4417 Compiling mime v0.3.17418 Compiling fearless_simd v0.4.1419 Compiling unicode-bidi v0.3.18420 Compiling zerotrie v0.2.4421 Compiling icu_locale_core v2.2.0422 Compiling potential_utf v0.1.5423 Compiling icu_collections v2.2.0424 Compiling wasmtime-internal-core v43.0.2425 Compiling regex-syntax v0.8.11426 Compiling unicode-normalization v0.1.25427 Compiling fdeflate v0.3.7428 Compiling icu_provider v2.2.0429 Compiling zune-core v0.5.1430 Compiling png v0.18.1431 Compiling ppv-lite86 v0.2.21432 Compiling icu_properties v2.2.0433 Compiling icu_normalizer v2.2.0434 Compiling rand_chacha v0.3.1435 Compiling rand v0.8.6436 Compiling zune-jpeg v0.5.15437 Compiling http-body v1.0.1438 Compiling sha2 v0.10.9439 Compiling serde_path_to_error v0.1.20440 Compiling untrusted v0.9.0441 Compiling cranelift-bitset v0.130.2442 Compiling half v2.7.1443 Compiling regex-automata v0.4.14444 Compiling core_maths v0.1.1445 Compiling hayro-ccitt v0.3.0446 Compiling ciborium-io v0.2.2447 Compiling ident_case v1.0.1448 Compiling ipnet v2.12.0449 Compiling tower-layer v0.3.3450 Compiling konst_macro_rules v0.2.19451 Compiling idna_adapter v1.2.2452 Compiling konst v0.2.20453 Compiling idna v1.1.0454 Compiling hayro-jbig2 v0.3.0455 Compiling ciborium-ll v0.2.2456 Compiling url v2.5.8457 Compiling hayro-jpeg2000 v0.3.5458 Compiling uuid v1.23.4459 Compiling const_format_proc_macros v0.2.34460 Compiling float-cmp v0.9.0461 Compiling num-integer v0.1.46462 Compiling getrandom v0.3.4463 Compiling color_quant v1.1.0464 Compiling quick-error v2.0.1465 Compiling byteorder-lite v0.1.0466 Compiling unsafe-libyaml v0.2.11467 Compiling proc-macro-hack v0.5.20+deprecated468 Compiling weezl v0.1.12469 Compiling target-lexicon v0.13.5470 Compiling dioxus-core-types v0.7.9471 Compiling gif v0.14.2472 Compiling tokio-util v0.7.18473 Compiling serde_yaml v0.9.34+deprecated474 Compiling image-webp v0.2.4475 Compiling const_format v0.2.36476 Compiling hayro-syntax v0.7.2477 Compiling strict-num v0.1.1478 Compiling ciborium v0.2.2479 Compiling ttf-parser v0.25.1480 Compiling subsecond-types v0.7.9481 Compiling euclid v0.22.14482 Compiling phf_shared v0.13.1483 Compiling sync_wrapper v1.0.2484 Compiling libloading v0.8.9485 Compiling unicode-script v0.5.8486 Compiling pxfm v0.1.30487 Compiling icu_locale_data v2.2.0488 Compiling httpdate v1.0.3489 Compiling arrayref v0.3.9490 Compiling cranelift-srcgen v0.130.2491 Compiling tiny-skia-path v0.12.0492 Compiling subsecond v0.7.9493 Compiling cranelift-assembler-x64-meta v0.130.2494 Compiling phf_generator v0.13.1495 Compiling http-body-util v0.1.3496 Compiling generational-box v0.7.9497 Compiling unic-langid-impl v0.9.6498 Compiling font-types v0.11.3499 Compiling pin-project-internal v1.1.13500 Compiling async-trait v0.1.89501 Compiling encoding_rs v0.8.35502 Compiling longest-increasing-subsequence v0.1.0503 Compiling rustix v1.1.4504 Compiling unicode-bidi-mirroring v0.4.0505 Compiling unicode-ccc v0.4.0506 Compiling same-file v1.0.6507 Compiling base64ct v1.8.3508 Compiling thiserror v1.0.69509 Compiling try-lock v0.2.5510 Compiling want v0.3.1511 Compiling pin-project v1.1.13512 Compiling pem-rfc7468 v0.7.0513 Compiling walkdir v2.5.0514 Compiling rustybuzz v0.20.1515 Compiling dioxus-core v0.7.9516 Compiling read-fonts v0.39.2517 Compiling moxcms v0.8.1518 Compiling unic-langid-macros-impl v0.9.6519 Compiling phf_macros v0.13.1520 Compiling rand_core v0.9.5521 Compiling thiserror-impl v1.0.69522 Compiling pulley-macros v43.0.2523 Compiling rustls-pki-types v1.15.0524 Compiling leb128fmt v0.1.0525 Compiling xmlwriter v0.1.0526 Compiling paste v1.0.15527 Compiling imagesize v0.14.0528 Compiling portable-atomic v1.13.1529 Compiling wasm-bindgen-shared v0.2.126530 Compiling bit-vec v0.8.0531 Compiling icu_collator_data v2.2.0532 Compiling bit-set v0.8.0533 Compiling unic-langid-macros v0.9.6534 Compiling phf v0.13.1535 Compiling icu_locale v2.2.0536 Compiling rand_chacha v0.9.0537 Compiling der v0.7.10538 Compiling fontdb v0.23.0539 Compiling cranelift-entity v0.130.2540 Compiling gimli v0.33.0541 Compiling svgtypes v0.16.1542 Compiling serde_spanned v0.6.9543 Compiling toml_datetime v0.6.11544 Compiling futures-executor v0.3.32545 Compiling enum-ordinalize-derive v4.4.1546 Compiling strum_macros v0.27.2547 Compiling comemo-macros v0.5.1548 Compiling wasmtime-internal-versioned-export-macros v43.0.2549 Compiling core-foundation v0.9.4550 Compiling sha1 v0.10.6551 Compiling roxmltree v0.21.1552 Compiling quick-xml v0.41.0553 Compiling simplecss v0.2.2554 Compiling pico-args v0.5.0555 Compiling typst-utils v0.15.0556 Compiling cranelift-isle v0.130.2557 Compiling wasmparser v0.239.0558 Compiling unscanny v0.1.0559 Compiling data-url v0.3.2560 Compiling unicode-vo v0.1.0561 Compiling linked-hash-map v0.5.6562 Compiling toml_write v0.1.2563 Compiling yaml-rust v0.4.5564 Compiling toml_edit v0.22.27565 Compiling usvg v0.47.0566 Compiling plist v1.10.0567 Compiling strum v0.27.2568 Compiling comemo v0.5.1569 Compiling enum-ordinalize v4.4.1570 Compiling image v0.25.10571 Compiling spki v0.7.3572 Compiling cranelift-bforest v0.130.2573 Compiling skrifa v0.42.1574 Compiling unic-langid v0.9.6575 Compiling rand v0.9.4576 Compiling fancy-regex v0.16.2577 Compiling pulley-interpreter v43.0.2578 Compiling axum-core v0.5.6579 Compiling num-bigint v0.4.8580 Compiling wasmparser v0.245.1581 Compiling quick-xml v0.38.4582 Compiling bincode v1.3.3583 Compiling convert_case v0.8.0584 Compiling warnings-macro v0.2.0585 Compiling hmac v0.12.1586 Compiling wasmi_core v1.1.0587 Compiling by_address v1.2.1588 Compiling palette v0.7.6589 Compiling unicode-math-class v0.1.0590 Compiling rust_decimal v1.42.1591 Compiling object v0.38.1592 Compiling roman-numerals-rs v3.1.0593 Compiling thin-vec v0.2.18594 Compiling cranelift-codegen-shared v0.130.2595 Compiling codex v0.3.0596 Compiling chinese-variant v1.1.6597 Compiling rustls v0.23.41598 Compiling data-encoding v2.11.0599 Compiling wasmi_ir v1.1.0600 Compiling citationberg v0.7.0601 Compiling chinese-number v0.7.8602 Compiling cranelift-codegen-meta v0.130.2603 Compiling biblatex v0.12.0604 Compiling palette_derive v0.7.6605 Compiling warnings v0.2.1606 Compiling syntect v5.3.0607 Compiling icu_collator v2.2.1608 Compiling toml v0.8.23609 Compiling pkcs8 v0.10.2610 Compiling futures v0.3.32611 Compiling rustls-webpki v0.103.13612 Compiling cranelift-assembler-x64 v0.130.2613 Compiling darling_core v0.21.3614 Compiling typst-timing v0.15.0615 Compiling ecow v0.2.6616 Compiling approx v0.5.1617 Compiling csv-core v0.1.13618 Compiling proc-macro2-diagnostics v0.10.1619 Compiling lazy-js-bundle v0.7.9620 Compiling pkg-config v0.3.33621 Compiling cpp_demangle v0.4.5622 Compiling parking v2.2.1623 Compiling system-configuration-sys v0.6.0624 Compiling atomic-waker v1.1.2625 Compiling mutate_once v0.1.2626 Compiling io-lifetimes v2.0.4627 Compiling wasmi_collections v1.1.0628 Compiling fast-srgb8 v1.0.0629 Compiling foldhash v0.1.5630 Compiling hayagriva v0.10.1631 Compiling hashbrown v0.15.5632 Compiling cranelift-codegen v0.130.2633 Compiling kamadak-exif v0.6.1634 Compiling wasm-bindgen-macro-support v0.2.126635 Compiling darling_macro v0.21.3636 Compiling zstd-sys v2.0.16+zstd.1.5.7637 Compiling csv v1.4.0638 Compiling wasm-encoder v0.245.1639 Compiling typst-syntax v0.15.0640 Compiling two-face v0.4.5641 Compiling wasmi v1.1.0642 Compiling dioxus-signals v0.7.9643 Compiling hkdf v0.12.4644 Compiling webpki-roots v1.0.8645 Compiling regex v1.13.0646 Compiling chrono v0.4.45647 Compiling lipsum v0.9.1648 Compiling wasm-bindgen v0.2.126649 Compiling typst-macros v0.15.0650 Compiling typst-assets v0.15.0651 Compiling arbitrary v1.4.2652 Compiling glidesort v0.1.2653 Compiling typed-arena v2.0.2654 Compiling byteorder v1.5.0655 Compiling wasmtime-internal-component-util v43.0.2656 Compiling crc-catalog v2.5.0657 Compiling termcolor v1.4.1658 Compiling icu_segmenter_data v2.2.0659 Compiling winnow v1.0.3660 Compiling az v1.3.0661 Compiling object v0.37.3662 Compiling cranelift-control v0.130.2663 Compiling wasmprinter v0.245.1664 Compiling crc v3.4.0665 Compiling wasm-bindgen-macro v0.2.126666 Compiling toml_parser v1.1.2+spec-1.1.0667 Compiling typst-library v0.15.0668 Compiling darling v0.21.3669 Compiling hashlink v0.10.0670 Compiling h2 v0.4.15671 Compiling regalloc2 v0.15.1672 Compiling serde_urlencoded v0.7.1673 Compiling lazy_static v1.5.0674 Compiling color v0.3.3675 Compiling linebender_resource_handle v0.1.1676 Compiling hayro-postscript v0.1.0677 Compiling io-extras v0.18.4678 Compiling dioxus-cli-config v0.7.9679 Compiling rustc-demangle v0.1.28680 Compiling wasmtime-environ v43.0.2681 Compiling hayro-cmap v0.1.0682 Compiling hyper v1.10.1683 Compiling peniko v0.6.1684 Compiling system-configuration v0.7.0685 Compiling enumset_derive v0.15.0686 Compiling dioxus-rsx v0.7.9687 Compiling concurrent-queue v2.5.0688 Compiling guillotiere v0.7.0689 Compiling const-serialize-macro v0.7.2690 Compiling cookie v0.18.1691 Compiling strsim v0.11.1692 Compiling utf-8 v0.7.6693 Compiling cap-primitives v3.4.5694 Compiling zstd-safe v7.2.4695 Compiling unicase v2.9.0696 Compiling leb128 v0.2.7697 Compiling ambient-authority v0.0.2698 Compiling wast v35.0.2699 Compiling mime_guess v2.0.5700 Compiling tokio-stream v0.1.18701 Compiling js-sys v0.3.103702 Compiling ar_archive_writer v0.5.2703 Compiling const-serialize v0.7.2704 Compiling vello_common v0.0.8705 Compiling event-listener v5.4.1706 Compiling icu_segmenter v2.2.0707 Compiling dioxus-core-macro v0.7.9708 Compiling enumset v1.1.13709 Compiling hyper-util v0.1.20710 Compiling futures-intrusive v0.5.0711 Compiling hayro-interpret v0.7.0712 Compiling fs-set-times v0.20.3713 Compiling crossbeam-queue v0.3.13714 Compiling dioxus-hooks v0.7.9715 Compiling dioxus-document v0.7.9716 Compiling dioxus-html-internal-macro v0.7.9717 Compiling wasm-encoder v0.253.0718 Compiling tower v0.5.3719 Compiling icu_provider_blob v2.2.0720 Compiling stringprep v0.1.5721 Compiling http v0.2.12722 Compiling keyboard-types v0.7.0723 Compiling serde_repr v0.1.20724 Compiling const-serialize-macro v0.8.0-alpha.0725 Compiling signature v2.2.0726 Compiling ff v0.13.1727 Compiling bitmaps v2.1.0728 Compiling multer v3.1.0729 Compiling im-rc v15.1.0730 Compiling compression-core v0.4.32731 Compiling unicode-width v0.2.2732 Compiling hypher v0.1.7733 Compiling maybe-owned v0.3.4734 Compiling hex v0.4.3735 Compiling wasmtime-internal-unwinder v43.0.2736 Compiling home v0.5.12737 Compiling id-arena v2.3.0738 Compiling base16ct v0.2.0739 Compiling whoami v1.6.1740 Compiling rustls v0.21.12741 Compiling dotenvy v0.15.7742 Compiling sec1 v0.7.3743 Compiling wit-parser v0.245.1744 Compiling sqlx-core v0.8.6745 Compiling wast v253.0.0746 Compiling sized-chunks v0.6.5747 Compiling compression-codecs v0.4.38748 Compiling dioxus-html v0.7.9749 Compiling group v0.13.0750 Compiling vello_cpu v0.0.8751 Compiling psm v0.1.31752 Compiling atoi v2.0.0753 Compiling tungstenite v0.29.0754 Compiling wasmtime-internal-fiber v43.0.2755 Compiling wasmtime-internal-jit-debug v43.0.2756 Compiling pic-scale v0.7.10757 Compiling rustls-webpki v0.101.7758 Compiling sct v0.7.1759 Compiling md-5 v0.10.6760 Compiling crypto-bigint v0.5.5761 Compiling toml_datetime v0.7.5+spec-1.1.0762 Compiling serde_spanned v1.1.1763 Compiling rand_xoshiro v0.6.0764 Compiling dirs-sys-next v0.1.2765 Compiling wasmtime-internal-cache v43.0.2766 Compiling system-configuration-sys v0.5.0767 Compiling fixedbitset v0.4.2768 Compiling toml_writer v1.1.1+spec-1.1.0769 Compiling wasmtime-internal-component-macro v43.0.2770 Compiling cap-std v3.4.5771 Compiling wat v1.253.0772 Compiling elliptic-curve v0.13.8773 Compiling sqlx-postgres v0.8.6774 Compiling hayro v0.7.1775 Compiling toml v0.9.12+spec-1.1.0776 Compiling petgraph v0.6.5777 Compiling directories-next v2.0.0778 Compiling typst-layout v0.15.0779 Compiling tokio-tungstenite v0.29.0780 Compiling wasmtime-internal-wit-bindgen v43.0.2781 Compiling zstd v0.13.3782 Compiling web-sys v0.3.103783 Compiling async-compression v0.4.42784 Compiling hayro-svg v0.7.0785 Compiling h2 v0.3.27786 Compiling http-body v0.4.6787 Compiling witx v0.9.1788 Compiling cranelift-frontend v0.130.2789 Compiling cranelift-native v0.130.2790 Compiling darling_core v0.23.0791 Compiling tungstenite v0.28.0792 Compiling sharded-slab v0.1.7793 Compiling cfb v0.7.3794 Compiling wasmtime v43.0.2795 Compiling dioxus-history v0.7.9796 Compiling matchers v0.2.0797 Compiling rustc_version v0.4.1798 Compiling debugid v0.8.0799 Compiling proc-macro-utils v0.10.0800 Compiling itertools v0.14.0801 Compiling axum-macros v0.5.1802 Compiling stacker v0.1.24803 Compiling tracing-log v0.2.0804 Compiling socket2 v0.5.10805 Compiling thread_local v1.1.9806 Compiling cbindgen v0.29.4807 Compiling rustix v0.38.44808 Compiling inventory v0.3.24809 Compiling toml_datetime v1.1.1+spec-1.1.0810 Compiling litrs v1.0.0811 Compiling matchit v0.8.4812 Compiling wiggle-macro v43.0.2813 Compiling nu-ansi-term v0.50.3814 Compiling http-range-header v0.4.2815 Compiling psl-types v2.0.11816 Compiling axum v0.8.9817 Compiling document-features v0.2.12818 Compiling publicsuffix v2.3.0819 Compiling tracing-subscriber v0.3.23820 Compiling tower-http v0.6.11821 Compiling wasmtime-internal-cranelift v43.0.2822 Compiling hyper v0.14.32823 Compiling toml_edit v0.25.12+spec-1.1.0824 Compiling dioxus-fullstack-core v0.7.9825 Compiling darling_macro v0.23.0826 Compiling manyhow-macros v0.11.4827 Compiling tempfile v3.27.0828 Compiling curve25519-dalek v4.1.3829 Compiling fxprof-processed-profile v0.8.1830 Compiling infer v0.19.0831 Compiling typst-svg v0.15.0832 Compiling wiggle-generate v43.0.2833 Compiling tokio-rustls v0.24.1834 Compiling sqlx-macros-core v0.8.6835 Compiling wasm-compose v0.245.1836 Compiling wasm-bindgen-futures v0.4.76837 Compiling const-serialize v0.8.0-alpha.0838 Compiling tokio-rustls v0.26.4839 Compiling dioxus-interpreter-js v0.7.9840 Compiling rfc6979 v0.4.0841 Compiling addr2line v0.26.1842 Compiling write-fonts v0.48.1843 Compiling wasmtime-internal-jit-icache-coherence v43.0.2844 Compiling headers-core v0.3.0845 Compiling convert_case v0.10.0846 Compiling pdf-writer v0.15.0847 Compiling rmp v0.8.15848 Compiling mach2 v0.4.3849 Compiling cap-fs-ext v3.4.5850 Compiling base64 v0.21.7851 Compiling objc2 v0.6.4852 Compiling num-bigint-dig v0.8.6853 Compiling bitflags v1.3.2854 Compiling base16 v0.2.1855 Compiling utf8parse v0.2.2856 Compiling option-ext v0.2.0857 Compiling system-interface v0.27.3858 Compiling dioxus-router-macro v0.7.9859 Compiling dirs-sys v0.5.0860 Compiling anstyle-parse v1.0.0861 Compiling system-configuration v0.5.1862 Compiling rustls-pemfile v1.0.4863 Compiling prost-derive v0.14.4864 Compiling hayro-write v0.7.0865 Compiling rmp-serde v1.3.1866 Compiling sqlx-macros v0.8.6867 Compiling derive_more-impl v2.1.1868 Compiling headers v0.4.1869 Compiling ecdsa v0.16.9870 Compiling hyper-rustls v0.27.9871 Compiling manganis-core v0.7.9872 Compiling hyper-rustls v0.24.2873 Compiling typst-html v0.15.0874 Compiling manyhow v0.11.4875 Compiling darling v0.23.0876 Compiling proc-macro-crate v3.5.0877 Compiling gloo-utils v0.2.0878 Compiling cookie_store v0.22.1879 Compiling tokio-tungstenite v0.28.0880 Compiling primeorder v0.13.6881 Compiling tungstenite v0.27.0882 Compiling webpki-roots v0.26.11883 Compiling tower-sessions-core v0.14.0884 Compiling dioxus-devtools-types v0.7.9885 Compiling charset v0.1.5886 Compiling subsetter v0.2.6887 Compiling tiny-skia v0.12.0888 Compiling num-iter v0.1.46889 Compiling serde_qs v0.15.0890 Compiling rgb v0.8.53891 Compiling async-stream-impl v0.3.6892 Compiling macro-string v0.1.4893 Compiling inout v0.1.4894 Compiling dunce v1.0.5895 Compiling zip v2.4.2896 Compiling anstyle v1.0.14897 Compiling hashbrown v0.14.5898 Compiling objc2-encode v4.1.0899 Compiling sync_wrapper v0.1.2900 Compiling anstyle-query v1.1.5901 Compiling xmp-writer v0.3.3902 Compiling colorchoice v1.0.5903 Compiling askama_escape v0.13.0904 Compiling is_terminal_polyfill v1.70.2905 Compiling xxhash-rust v0.8.16906 Compiling webpki-roots v0.25.4907 Compiling anstream v1.0.0908 Compiling dioxus-fullstack-macro v0.7.9909 Compiling reqwest v0.11.27910 Compiling krilla v0.8.2911 Compiling dashmap v6.2.1912 Compiling dioxus-ssr v0.7.9913 Compiling resvg v0.47.0914 Compiling extism v1.30.0915 Compiling manganis-macro v0.7.9916 Compiling async-stream v0.3.6917 Compiling cipher v0.4.4918 Compiling sqlx v0.8.6919 Compiling content_disposition v0.4.0920 Compiling dioxus-devtools v0.7.9921 Compiling ureq v2.12.1922 Compiling async-tungstenite v0.31.0923 Compiling typst-realize v0.15.0924 Compiling reqwest v0.12.28925 Compiling extism-convert-macros v1.30.0926 Compiling gloo-net v0.6.0927 Compiling derive_more v2.1.1928 Compiling serde_with_macros v3.21.0929 Compiling typst-eval v0.15.0930 Compiling prost v0.14.4931 Compiling axum-extra v0.10.3932 Compiling dioxus-router v0.7.9933 Compiling dirs v6.0.0934 Compiling wasm-streams v0.4.2935 Compiling dioxus-asset-resolver v0.7.9936 Compiling dioxus-logger v0.7.9937 Compiling cap-time-ext v3.4.5938 Compiling ed25519 v2.2.3939 Compiling cap-rand v3.4.5940 Compiling pkcs1 v0.7.5941 Compiling dioxus-stores-macro v0.7.9942 Compiling tracing-futures v0.2.5943 Compiling ureq-proto v0.6.0944 Compiling lru v0.16.4945 Compiling zopfli v0.8.3946 Compiling universal-hash v0.5.1947 Compiling ordered-float v2.10.1948 Compiling send_wrapper v0.6.0949 Compiling base64 v0.13.1950 Compiling const-str v0.7.1951 Compiling utf8-zero v0.8.1952 Compiling clap_lex v1.1.0953 Compiling opaque-debug v0.3.1954 Compiling poly1305 v0.8.0955 Compiling clap_builder v4.6.0956 Compiling dioxus-fullstack v0.7.9 (/nix/var/nix/builds/nix-32654-952730949/source/vendor/dioxus-fullstack-0.7.9)957 Compiling ureq v3.3.0958 Compiling oauth2 v4.4.2959 Compiling serde-value v0.7.0960 Compiling dioxus-stores v0.7.9961 Compiling dioxus-server v0.7.9962 Compiling rsa v0.9.10963 Compiling ed25519-dalek v2.2.0964 Compiling typst v0.15.0965 Compiling typst-kit v0.15.0966 Compiling extism-convert v1.30.0967 Compiling serde_with v3.21.0968 Compiling manganis v0.7.9969 Compiling krilla-svg v0.8.1970 Compiling chacha20 v0.9.1971 Compiling tower-sessions-memory-store v0.14.0972 Compiling p256 v0.13.2973 Compiling p384 v0.13.1974 Compiling tower-cookies v0.11.0975 Compiling itertools v0.10.5976 Compiling extism-manifest v1.30.0977 Compiling serde_plain v1.0.2978 Compiling clap_derive v4.6.1979 Compiling aead v0.5.2980 Compiling dioxus-config-macro v0.7.9981 Compiling dyn-clone v1.0.20982 Compiling horae v0.1.0 (/nix/var/nix/builds/nix-32654-952730949/source/crates/horae)983 Compiling dioxus-config-macros v0.7.9984 Compiling glob v0.3.3985 Compiling dioxus v0.7.9986 Compiling chacha20poly1305 v0.10.1987 Compiling tower-sessions v0.14.0988 Compiling typst-pdf v0.15.0989 Compiling typst-as-lib v0.16.0990 Compiling rust_xlsxwriter v0.80.0991 Compiling horae-core v0.1.0 (/nix/var/nix/builds/nix-32654-952730949/source/crates/core)992 Compiling tower-sessions-sqlx-store v0.15.0993 Compiling clap v4.6.1994 Compiling serial_test_derive v3.5.0995 Compiling serial_test v3.5.0996 Compiling openidconnect v3.5.0997 Compiling wiggle v43.0.2998 Compiling wasi-common v43.0.2999 Finished `test` profile [unoptimized + debuginfo] target(s) in 6m 23s1000 Running unittests src/main.rs (target/debug/deps/horae-d25262ae1fc74356)10011002running 831 tests1003test auth::oidc::tests::deactivated_email_match_is_denied ... ok1004test auth::oidc::tests::deactivated_subject_match_is_denied ... ok1005test auth::oidc::tests::no_account_is_denied_not_provisioned ... ok1006test auth::oidc::tests::extra_audiences_are_trusted_only_when_listed ... ok1007test auth::oidc::tests::first_login_links_subject_via_verified_email ... ok1008test auth::oidc::tests::subject_match_logs_in_without_relinking ... ok1009test auth::oidc::tests::subject_match_takes_precedence_over_email ... ok1010test auth::oidc::tests::unverified_email_is_not_matched ... ok1011test auth::page::tests::configured_label_is_html_escaped ... ok1012test auth::page::tests::dev_variant_offers_the_admin_bypass_and_no_fake_controls ... ok1013test auth::page::tests::oidc_variant_uses_the_configured_label_and_hands_off_to_start ... ok1014test cli::imports::tests::cancellation_racing_completion_does_not_claim_cancellation_was_requested ... ok1015test cli::imports::tests::csv_named_pipe_is_rejected_without_waiting_for_a_writer ... ok1016test cli::imports::tests::invalid_csv_files_fail_before_contacting_the_server ... ok1017test cli::imports::tests::api_submission_captures_generation_without_retrying_uncertain_acceptance ... ok1018test cli::imports::tests::missing_session_is_a_structured_configuration_failure ... ok1019test cli::imports::tests::malformed_submission_acknowledgement_retains_its_request_identity ... ok1020test cli::imports::tests::private_session_accepts_https_and_loopback_only ... ok1021test cli::imports::tests::redirects_are_not_followed_or_exposed_as_server_error_text ... ok1022test cli::imports::tests::retry_snapshot_is_compatible_with_missing_and_future_values ... ok1023test cli::imports::tests::missing_and_mismatched_jobs_fail_without_substitution ... ok1024test cli::imports::tests::report_marks_confirmed_failed_outcomes_as_incomplete ... ok1025test cli::imports::tests::session_rejects_public_permissions_and_symlinks ... ok1026test cli::imports::tests::session_rejects_cookie_header_injection_without_echoing_the_value ... ok1027test cli::imports::tests::archived_errors_publish_without_clobbering_and_preserve_the_prior_file_on_failure ... ok1028test cli::imports::tests::ordinary_json_is_bounded_and_invalid_replies_are_not_echoed ... ok1029test cli::imports::tests::session_rejects_plaintext_remote_and_credential_bearing_urls ... ok1030test cli::tests::environment_probe ... ok1031test cli::tests::remote_commands_reject_conflicting_or_unbounded_options ... ok1032test cli::tests::remote_import_and_job_commands_accept_the_documented_arguments ... ok1033test config::tests::dev_login_is_allowed_on_loopback ... ok1034test config::tests::dev_login_is_refused_off_loopback ... ok1035test cli::imports::tests::status_and_wait_distinguish_failed_jobs_from_failed_reads ... ok1036test config::tests::environment::environment_probe ... ok1037test config::tests::environment::empty_environment_has_no_authentication_or_plugin_credentials ... ok1038test cli::tests::default_command_uses_the_same_defaults_and_environment_as_serve ... ok1039test config::tests::environment::example_environment_can_configure_all_required_oidc_and_harvest_fields ... ok1040test cli::tests::default_command_rejects_invalid_environment_ports ... ok1041test config::tests::environment::obsolete_authentication_variables_do_not_configure_the_server ... ok1042test config::tests::environment::partial_oidc_configuration_remains_disabled_without_a_callback ... ok1043test config::tests::environment::job_attempt_limit_uses_the_documented_environment_variable ... ok1044test config::tests::without_dev_login_any_bind_is_fine ... ok1045test db::tests::pool_connections_force_custom_plans ... ok1046test config::tests::environment::mail_environment_requires_a_complete_valid_configuration ... ok1047test config::tests::environment::invalid_job_attempt_limits_reject_startup ... ok1048test config::tests::environment::secure_cookies_use_the_documented_prefixed_variable ... ok1049test auth::oidc::tests::linking::existing_subject_wins_over_another_accounts_email ... ok1050test auth::oidc::tests::linking::simultaneous_logins_with_the_same_subject_are_allowed ... ok1051test auth::oidc::tests::linking::different_subjects_cannot_both_claim_an_unlinked_account ... ok1052test auth::oidc::tests::linking::unverified_email_cannot_link_an_account ... ok1053test harvest::pagination_tests::harvest_own_time_omits_private_project_budget_metadata ... ok1054test harvest::pagination_tests::harvest_pagination_total_pages_does_not_overflow ... ok1055test auth::oidc::tests::linking::deactivation_during_first_link_denies_login ... ok1056test db::tests::reset_empties_the_database_and_reapplies_migrations ... ok1057test harvest::pagination_tests::harvest_pagination_catalog_links_preserve_filters_and_break_name_ties ... ok1058test cli::imports::tests::wait_deadline_caps_a_pending_request_without_cancelling_the_job ... ok1059test harvest::tests::a_manager_lists_users_with_their_rates ... ok1060test harvest::tests::a_manager_sees_the_whole_org ... ok1061test harvest::pagination_tests::harvest_pagination_empty_and_out_of_range_pages_keep_the_contract ... ok1062test harvest::tests::a_member_cannot_fetch_a_colleagues_entry ... ok1063test harvest::tests::a_member_cannot_filter_to_a_colleague ... ok1064test harvest::tests::a_member_cannot_list_users ... ok1065test harvest::tests::a_member_sees_only_their_own_time_entries ... ok1066test harvest::pagination_tests::harvest_pagination_malformed_filters_are_client_errors ... ok1067test harvest::tests::harvest_effective_minutes_match_sql_for_open_and_frozen_time ... ok1068test harvest::tests::harvest_marks_unbilled_non_billable_contexts_consistently ... ok1069test harvest::tests::harvest_entry_rates_respect_selected_project_mode ... ok1070test harvest::tests::page_window_defaults_and_checked_offsets ... ok1071test harvest::pagination_tests::harvest_pagination_rejects_invalid_windows_on_every_collection ... ok1072test harvest::tests::harvest_entry_rates_follow_the_cascade_and_frozen_invoice_line ... ok1073test importers::harvest::account_switch::tests::change_preserves_terminal_history_and_rejects_stale_confirmation ... ok1074test importers::harvest::account_switch::tests::a_b_a_keeps_old_callbacks_requests_and_retries_fenced ... ok1075test harvest::pagination_tests::harvest_pagination_router_preserves_session_and_tenant_guards ... ok1076test harvest::tests::members_cannot_read_own_project_rates_or_cost_overrides ... ok1077test importers::harvest::account_switch::tests::competing_callbacks_and_confirmations_have_one_winner ... ok1078test importers::harvest::account_switch::tests::queued_work_and_provenance_block_without_changing_binding ... ok1079test importers::harvest::account_switch::tests::queue_acceptance_does_not_wait_for_the_import_session_lock ... ok1080test importers::harvest::account_switch::tests::competing_change_and_submission_cannot_both_succeed ... ok1081test importers::harvest::api_source::http::tests::cancelled_backoff_does_not_wait_or_retry ... ok1082test importers::harvest::api_source::http::tests::cursor_links_are_authoritative_even_with_null_or_stale_page_numbers ... ok1083test importers::harvest::account_switch::tests::disconnect_and_reconnect_fence_callbacks_but_not_same_account_work ... ok1084test importers::harvest::api_source::http::tests::http_pages_follow_cursor_and_preserve_headers_and_encoded_filter ... ok1085test harvest::pagination_tests::harvest_project_progress_permissions_cover_counts_pages_and_details ... ok1086test importers::harvest::api_source::http::tests::missing_next_cursor_is_not_silently_treated_as_completed ... ok1087test importers::harvest::api_source::http::tests::pagination_cycle_detection_survives_restarting_after_every_page ... ok1088test importers::harvest::api_source::http::tests::persisted_cursor_resumes_with_a_new_client_and_stays_complete_at_eof ... ok1089test importers::harvest::api_source::http::tests::rejected_page_does_not_advance_the_cursor ... ok1090test importers::harvest::api_source::http::tests::rejects_pagination_outside_the_authenticated_endpoint ... ok1091test importers::harvest::api_source::http::tests::resumed_cursor_rejects_untrusted_destinations_and_invalid_state_before_http ... ok1092test importers::harvest::account_switch::tests::running_jobs_block_change_and_old_execution_never_reaches_http ... ok1093test importers::harvest::api_source::tests::assembled_rows_convert_to_exact_minutes ... ok1094test importers::harvest::api_source::tests::assembles_rows_joining_parents_by_id ... ok1095test importers::harvest::api_source::tests::hours_render_as_exact_decimals ... ok1096test importers::harvest::api_source::tests::http_page_preserves_decimal_values_before_integer_conversion ... ok1097test importers::harvest::api_source::tests::json_exponents_expand_exactly_with_bounded_output ... ok1098test importers::harvest::api_source::http::tests::http_retries_429_but_never_follows_redirects_or_shortens_long_backoff ... ok1099test importers::harvest::credentials::tests::bad_key_length_is_rejected ... ok1100test importers::harvest::account_switch::tests::successful_change_preserves_business_rows_and_failure_rolls_back_secrets ... ok1101test importers::harvest::account_switch::tests::retry_and_change_are_serialized ... ok1102test importers::harvest::api_source::http::tests::http_rejects_oversized_malformed_and_cyclic_pages ... ok1103test harvest::pagination_tests::harvest_pagination_time_entries_keep_the_filtered_set_and_date_ties ... ok1104test importers::harvest::credentials::tests::decode_hex_rejects_bad_input ... ok1105test importers::harvest::credentials::tests::connect_and_disconnect_share_import_exclusion_without_blocking_other_orgs ... ok1106test importers::harvest::credentials::tests::concurrent_first_connections_cannot_bind_different_accounts ... ok1107test importers::harvest::credentials::tests::encrypt_then_decrypt_round_trips ... ok1108test importers::harvest::credentials::tests::another_account_cannot_replace_credentials_or_watermarks ... ok1109test importers::harvest::credentials::tests::nonce_makes_ciphertext_nondeterministic ... ok1110test importers::harvest::api_source::http::tests::slow_consumer_backpressures_http_and_cancellation_stops_further_pages ... ok1111test importers::harvest::credentials::tests::connection_changes_work_with_a_single_connection_pool ... ok1112test importers::harvest::credentials::tests::wrong_key_fails_to_decrypt ... ok1113test importers::harvest::csv_source::tests::bad_date_becomes_a_row_error_not_a_rejection ... ok1114test importers::harvest::csv_source::tests::conflicting_email_aliases_error_only_the_affected_row ... ok1115test importers::harvest::csv_source::tests::csv_records_preserve_multiline_unicode_across_single_byte_reads ... ok1116test importers::harvest::csv_source::tests::cursor_beyond_upload_is_rejected_without_parsing_rows ... ok1117test importers::harvest::csv_source::tests::cursor_resumes_after_multiline_unicode_and_preserves_error_locations ... ok1118test importers::harvest::csv_source::tests::delivers_a_row_before_reading_the_rest_of_the_file ... ok1119test importers::harvest::csv_source::tests::empty_file_is_rejected ... ok1120test importers::harvest::csv_source::tests::identity_columns_are_required_and_cannot_repeat ... ok1121test importers::harvest::csv_source::tests::invalid_utf8_errors_one_record_and_continues ... ok1122test importers::harvest::csv_source::tests::missing_required_columns_is_rejected ... ok1123test importers::harvest::csv_source::tests::names_stay_separate_from_optional_email ... ok1124test importers::harvest::csv_source::tests::parse_bool_accepts_yes_variants ... ok1125test importers::harvest::csv_source::tests::parses_rows_case_insensitively ... ok1126test importers::harvest::credentials::tests::unidentified_legacy_provenance_requires_operator_review ... ok1127test importers::harvest::credentials::tests::disconnect_preserves_identity_and_provenance_for_the_original_account ... ok1128test importers::harvest::credentials::tests::same_account_reconnect_rotates_encryption_without_resetting_watermarks ... ok1129test importers::harvest::engine_tests::api_and_csv_share_the_lock_but_other_organizations_can_import ... ok1130test importers::harvest::credentials::tests::migration_binds_existing_connections_without_changing_secrets_or_markers ... ok1131test importers::harvest::credentials::tests::failed_credential_write_does_not_leave_an_account_binding ... ok1132test harvest::tests::imported_legacy_rates_survive_retry_in_harvest_list_and_detail ... ok1133test importers::harvest::credentials::tests::completed_credential_changes_allow_immediate_retries ... ok1134test importers::harvest::engine_tests::bad_records_are_reported_and_run_continues ... ok1135test importers::harvest::engine_tests::cancelled_http_waiter_keeps_the_lock_until_its_worker_exits ... ok1136test harvest::pagination_tests::harvest_task_access_filters_counts_and_preserves_rate_free_history ... ok1137test importers::harvest::engine_tests::api_sync_adopts_entries_from_a_prior_csv_import ... ok1138test importers::harvest::engine_tests::cancellation_rolls_back_rows_and_releases_the_import_session ... ok1139test importers::harvest::engine_tests::concurrent_imports_reject_overlap_without_collapsing_repeated_entries ... ok1140test importers::harvest::engine_tests::api_connection_checks_work_with_a_single_connection_pool ... ok1141test importers::harvest::engine_tests::completed_imports_allow_immediate_retries ... FAILED1142test importers::harvest::engine_tests::csv_malformed_file_is_rejected_with_no_writes ... ok1143test importers::harvest::engine_tests::csv_ambiguous_names_include_inactive_users_but_unique_email_disambiguates ... ok1144test importers::harvest::engine_tests::csv_import_populates_and_is_idempotent ... ok1145test importers::harvest::engine_tests::csv_name_only_dry_run_and_duplicate_occurrences_preserve_history ... ok1146test importers::harvest::engine_tests::csv_name_only_matches_one_org_user_and_reimports_without_duplicates ... ok1147test importers::harvest::engine_tests::csv_name_fallback_requires_a_full_unique_name_and_never_overrides_email ... ok1148test importers::harvest::engine_tests::csv_streaming::csv_applies_before_eof_but_transport_failure_rolls_back_everything ... ok1149test importers::harvest::engine_tests::csv_streaming::cancelling_a_csv_waiting_for_more_bytes_releases_its_session ... ok1150test harvest::pagination_tests::harvest_project_cost_overrides_require_admin_without_fabricated_fallback ... ok1151test importers::harvest::engine_tests::csv_streaming::csv_preview_errors_and_repeated_rows_match_commit_and_reimport ... ok1152test importers::harvest::engine_tests::csv_streaming::durable_csv_preview_crosses_batch_boundaries_without_committing_domain_data ... ok1153test importers::harvest::engine_tests::csv_streaming::durable_csv_cancel_joins_parser_and_preserves_committed_rows ... ok1154test importers::harvest::engine_tests::csv_streaming::durable_csv_discards_incomplete_preparation_and_resumes_its_checkpoint ... ok1155test importers::harvest::engine_tests::csv_streaming::durable_csv_report_metadata_is_bounded_after_recovery ... ok1156test importers::harvest::engine_tests::csv_streaming::csv_sql_backpressure_stops_reading_later_input_rows ... ok1157test importers::harvest::engine_tests::csv_streaming::durable_csv_preview_rejects_a_stale_next_batch ... ok1158test importers::harvest::engine_tests::csv_streaming::measure_csv_durable_100k ... ignored, 100,000-row durable CSV measurement; run explicitly with --release --nocapture1159test importers::harvest::engine_tests::csv_streaming::measure_csv_durable_large_catalog_100k ... ignored, 100,000-row durable CSV with 5,000 parent sets; run explicitly with --release --nocapture1160test importers::harvest::engine_tests::csv_streaming::measure_csv_streaming_100k ... ignored, 100,000-row CSV measurement; run explicitly with --release --nocapture1161test importers::harvest::engine_tests::csv_streaming::measure_csv_streaming_large_catalog_100k ... ignored, 100,000-row CSV with 5,000 parent sets; run explicitly with --release --nocapture1162test importers::harvest::engine_tests::csv_streaming::durable_csv_stale_commit_is_fenced_without_a_heartbeat ... ok1163test importers::harvest::engine_tests::csv_streaming::durable_csv_preview_resumes_after_a_crash_without_recounting_rows ... ok1164test importers::harvest::engine_tests::dry_run_writes_nothing_and_matches_commit ... ok1165test importers::harvest::engine_tests::distinct_harvest_ids_with_identical_fields_import_as_two ... ok1166test importers::harvest::engine_tests::edited_entry_still_matched_by_provenance ... ok1167test importers::harvest::engine_tests::full_import_creates_all_levels_with_exact_minutes ... ok1168test importers::harvest::engine_tests::failed_source_releases_the_session_and_rolls_back_partial_rows ... ok1169test importers::harvest::engine_tests::csv_streaming::durable_csv_resumes_committed_batches_without_recounting_duplicate_rows ... ok1170test importers::harvest::engine_tests::csv_streaming::durable_csv_reclaimed_lease_cannot_commit_the_next_batch ... ok1171test importers::harvest::engine_tests::lookup_cache::cold_query_callsite_on_untraced_thread_is_still_captured ... ok1172test importers::harvest::engine_tests::lookup_cache::cached_email_and_full_name_do_not_share_a_namespace ... ok1173test importers::harvest::engine_tests::lookup_cache::cached_project_task_still_validates_each_rows_rate ... ok1174test importers::harvest::engine_tests::import_rejects_ambiguous_normalized_email_without_partial_writes ... ok1175test importers::harvest::engine_tests::csv_streaming::durable_csv_preview_cancel_preserves_simulation_for_manual_retry ... ok1176test importers::harvest::engine_tests::csv_streaming::durable_csv_cancel_preserves_its_completed_batches_for_manual_retry ... ok1177test importers::harvest::engine_tests::csv_streaming::durable_csv_waits_for_input_without_an_open_transaction ... ok1178test importers::harvest::engine_tests::lookup_cache::lookup_index_migration_preserves_existing_ambiguous_identities ... ok1179test importers::harvest::engine_tests::lookup_cache::project_task_cache_distinguishes_both_sides_of_the_link ... ok1180test importers::harvest::engine_tests::lookup_cache::rolled_back_row_does_not_cache_user_or_project_task ... ok1181test importers::harvest::engine_tests::lookup_cache::new_run_rechecks_previously_cached_user_for_ambiguity ... ok1182test importers::harvest::engine_tests::overflowing_decimals_fail_only_their_rows ... ok1183test importers::harvest::engine_tests::natural_key_reimport_normalizes_whitespace_and_ascii_case ... ok1184test importers::harvest::engine_tests::reimporting_identical_csv_rows_is_idempotent ... ok1185test importers::harvest::oauth::tests::authorize_url_carries_state_and_encoded_redirect ... ok1186test importers::harvest::oauth_callback_tests::account_policy_failures_return_safe_actionable_conflicts ... ok1187test importers::harvest::oauth::tests::authorize_url_preserves_query_values_without_injecting_parameters ... ok1188test importers::harvest::oauth_callback_tests::mismatched_state_is_rejected_without_a_code ... ok1189test importers::harvest::oauth_callback_tests::missing_returned_state_is_rejected ... ok1190test importers::harvest::oauth_callback_tests::missing_stored_state_is_rejected ... ok1191test importers::harvest::oauth_callback_tests::provider_error_is_rejected_before_exchange ... ok1192test importers::harvest::oauth_callback_tests::valid_matching_state_yields_the_code ... ok1193test importers::harvest::oauth_callback_tests::valid_state_but_missing_code_is_rejected ... ok1194test importers::harvest::report::tests::archived_report_round_trips_without_losing_error_accounting ... ok1195test importers::harvest::report::tests::archive_metadata_cannot_masquerade_as_a_legacy_or_inconsistent_report ... ok1196test importers::harvest::report::tests::legacy_report_preserves_its_counts_and_error_details ... ok1197test importers::harvest::report::tests::report_rejects_unsupported_and_invalid_versions ... ok1198test importers::harvest::report::tests::serialized_report_has_a_supported_schema_version ... ok1199test importers::harvest::resolve::checkpoint_tests::run_cache_round_trip_preserves_identity_namespaces_and_occurrences ... ok1200test importers::harvest::resolve::preview::tests::checkpoint_restores_known_task_currency_and_keeps_old_currency_unknown ... ok1201test importers::harvest::resolve::preview::tests::rejects_foreign_parent_snapshots_before_restoring_any_rows ... ok1202test importers::harvest::engine_tests::second_identical_run_creates_nothing ... ok1203test importers::harvest::engine_tests::submission_barrier_blocks_imported_time_entries ... ok1204test importers::harvest::engine_tests::two_identical_csv_rows_import_as_two_entries ... ok1205test importers::harvest::engine_tests::watermark_advances_only_on_commit ... ok1206test importers::harvest::engine_tests::lookup_cache::repeated_rows_resolve_each_user_and_project_task_once ... ok1207test importers::harvest::sync_tests::api_requires_email_even_when_full_name_matches ... ok1208test importers::harvest::streaming::tests::api_planning_policy_ends_with_the_transaction ... ok1209test importers::harvest::sync_tests::api_rejects_ambiguous_email_without_advancing_watermark ... ok1210test importers::harvest::streaming::durable::preview::tests::restoration_omits_unneeded_virtual_entries ... ok1211test importers::harvest::engine_tests::csv_streaming::csv_measurement_recovers_a_complete_batch_without_recounting ... ok1212test importers::harvest::engine_tests::large_run_reuses_parents_and_reconciles_totals ... ok1213test importers::harvest::engine_tests::csv_streaming::durable_csv_preview_matches_existing_and_new_rows_with_one_connection ... ok1214test importers::harvest::sync_tests::checkpoints::durable_api_cancellation_preserves_confirmed_pages_for_manual_retry ... ok1215test importers::harvest::sync_tests::checkpoints::durable_api_finalization_retry_does_not_repeat_completed_downloads ... ok1216test importers::harvest::sync_tests::checkpoints::durable_api_preview_reclaimed_worker_cannot_checkpoint_its_next_page ... ok1217test importers::harvest::sync_tests::checkpoints::durable_api_preview_resume_preserves_row_errors ... ok1218test importers::harvest::sync_tests::checkpoints::durable_api_preview_cancellation_preserves_confirmed_pages_for_manual_retry ... ok1219test importers::harvest::sync_tests::checkpoints::durable_api_preview_finalization_retry_does_not_repeat_completed_downloads ... ok1220test importers::harvest::sync_tests::checkpoints::durable_api_preview_resumes_after_a_confirmed_parent_batch ... ok1221test importers::harvest::sync_tests::checkpoints::durable_api_preview_resumes_pages_without_publishing_domain_data ... ok1222test importers::harvest::sync_tests::checkpoints::durable_api_preview_resumes_catalog_download ... ok1223test importers::harvest::sync_tests::checkpoints::durable_api_reclaimed_worker_cannot_commit_its_next_page ... ok1224test importers::harvest::sync_tests::disconnect_and_reconnect_preserves_imported_records_and_exact_identity ... ok1225test importers::harvest::sync_tests::checkpoints::durable_api_resume_remembers_an_earlier_missing_timestamp ... ok1226test importers::harvest::sync_tests::checkpoints::durable_api_resume_keeps_earlier_errors_and_does_not_advance_watermark ... ok1227test importers::harvest::sync_tests::checkpoints::durable_api_resumes_a_partially_downloaded_catalog ... ok1228test importers::harvest::sync_tests::dry_run_leaves_data_provenance_and_watermark_unchanged ... ok1229test importers::harvest::sync_tests::checkpoints::durable_api_resumes_committed_pages_and_preserves_the_high_watermark ... ok1230test importers::harvest::sync_tests::empty_sync_does_not_invent_a_watermark ... ok1231test importers::harvest::sync_tests::checkpoints::failed_api_commit_publishes_its_last_confirmed_page_report ... ok1232test importers::harvest::sync_tests::missing_client_fallback_and_failed_project_savepoints_do_not_poison_cache ... ok1233test importers::harvest::sync_tests::exact_api_decimals_survive_preview_commit_and_reimport ... ok1234test importers::harvest::sync_tests::failed_client_propagates_to_project_and_entry_without_placeholder_records ... ok1235test importers::harvest::sync_tests::failed_rows_are_available_to_the_next_incremental_retry ... ok1236test importers::harvest::sync_tests::invalid_parent_blocks_dependent_time_but_other_catalog_records_survive ... ok1237test importers::harvest::sync_tests::checkpoints::durable_api_resumes_after_a_confirmed_parent_batch ... ok1238test importers::harvest::sync_tests::missing_source_timestamp_keeps_the_previous_watermark ... ok1239test importers::harvest::sync_tests::checkpoints::failed_api_preview_publishes_its_last_confirmed_page_report ... ok1240test importers::harvest::sync_tests::parent_catalog_preserves_metadata_and_counts_each_entity_once ... ok1241test importers::harvest::sync_tests::paging::later_download_failure_rolls_back_parents_rows_and_watermark ... ok1242test importers::harvest::sync_tests::scale::api_100k_commit_and_reimport ... ignored, 100,000-entry scale measurement; run explicitly with --release --nocapture1243test importers::harvest::sync_tests::scale::api_100k_dry_run ... ignored, 100,000-entry scale measurement; run explicitly with --release --nocapture1244test importers::harvest::sync_tests::scale::api_durable_100k_commit_and_reimport ... ignored, 100,000-entry durable API measurement; run explicitly with --release --nocapture1245test importers::harvest::sync_tests::scale::api_durable_100k_dry_run ... ignored, 100,000-entry durable API measurement; run explicitly with --release --nocapture1246test importers::harvest::sync_tests::paging::cancelled_page_consumer_retains_lock_until_worker_exits_and_rolls_back ... ok1247test importers::harvest::sync_tests::paging::durable_api_stale_commit_cannot_advance_data_or_watermark ... ok1248test importers::harvest::sync_tests::out_of_range_api_decimals_error_per_row_and_leave_retry_watermark ... ok1249test importers::harvest::sync_tests::parent_only_api_import_creates_catalog_and_reimport_skips_it ... ok1250test importers::harvest::sync_tests::parent_only_dry_run_previews_without_persisting_catalog ... ok1251test importers::harvest::sync_tests::refreshed_tokens_survive_a_dry_run_rollback_in_the_same_import_session ... ok1252test importers::harvest::sync_tests::successful_sync_only_marks_the_incrementally_fetched_entity ... ok1253test importers::harvest::sync_tests::watermark_never_passes_the_start_of_capture ... ok1254test init::tests::init_refuses_when_an_organization_exists ... ok1255test jobs::outbox::tests::acknowledges_confirmed_delivery_without_reclaiming_it ... ok1256test init::tests::init_creates_one_org_and_one_admin_and_nothing_else ... ok1257test importers::harvest::sync_tests::watermark_write_failure_rolls_back_imported_data ... ok1258test importers::harvest::sync_tests::paging::invalid_and_missing_timestamp_rows_cross_page_boundaries_without_advancing ... ok1259test importers::harvest::sync_tests::checkpoints::durable_api_preview_preserves_adoptions_and_repeated_ids_across_recovery ... ok1260test jobs::outbox::tests::invalid_payload_is_not_delivered_and_does_not_leak_into_errors ... ok1261test jobs::outbox::tests::plugin_failure_retries_with_the_same_event_identity ... ok1262test jobs::outbox::tests::worker_delivers_available_events_and_stops_cleanly ... ok1263test importers::harvest::sync_tests::paging::durable_api_cancel_waits_for_the_producer_before_acknowledging ... ok1264test jobs::report::stream_tests::download_keeps_its_snapshot_when_later_progress_archives_the_inline_tail ... ok1265test jobs::tests::cancellation_and_retry_are_scoped_and_idempotent ... ok1266test jobs::report::tests::report_fragments_survive_until_the_owning_job_expires ... ok1267test jobs::report::tests::upgrading_legacy_reports_preserves_errors_and_fences_old_attempts ... ok1268test jobs::tests::claims_are_atomic_and_expired_leases_recover ... ok1269test jobs::report::stream_tests::download_reports_missing_fragments_after_its_buffered_page ... ok1270test jobs::tests::cancellation_survives_a_crash_before_the_worker_acknowledges ... ok1271test jobs::tests::cancellation_waits_for_the_claimed_execution_before_allowing_retry ... ok1272test jobs::tests::api_job_keeps_its_policy_across_duplicate_enqueue_and_manual_retry ... ok1273test jobs::report::stream_tests::download_reads_only_when_consumed_and_releases_its_connection ... ok1274test importers::harvest::sync_tests::scale::durable_measurement_finishes_from_its_eof_checkpoint ... ok1275test importers::harvest::sync_tests::scale::http_pages_preview_commit_and_reimport ... ok1276test jobs::report::tests::legacy_upgrade_preserves_job_states_and_existing_archives ... ok1277test jobs::tests::cleanup_retains_retryable_uploads_and_deletes_expired_jobs ... ok1278test jobs::tests::history_paginates_tied_timestamps_and_rejects_foreign_cursors ... ok1279test jobs::tests::failed_csv_commit_retains_confirmed_report_through_history_and_retry ... ok1280test jobs::tests::expired_final_attempt_fails_without_claiming_again ... ok1281test jobs::tests::expired_lease_cannot_renew_or_commit_using_an_old_transaction_timestamp ... ok1282test jobs::tests::import_adapters_reject_a_lease_from_another_organization ... ok1283test jobs::tests::invalid_policy_cannot_enqueue_a_job_or_upload ... ok1284test jobs::tests::outbox_delivery_is_idempotent ... ok1285test jobs::tests::failed_csv_preview_retains_confirmed_report_through_history_and_retry ... ok1286test jobs::tests::missing_configuration_records_error_and_requeues ... ok1287test jobs::tests::missing_csv_upload_records_error_and_requeues ... ok1288test jobs::tests::payload_kind_is_stable_and_round_trips ... ok1289test jobs::tests::payload_versions_preserve_legacy_jobs_and_reject_unknown_versions ... ok1290test jobs::tests::outbox_claims_only_the_requested_event_kind ... ok1291test jobs::tests::retry_snapshot_does_not_guess_unknown_payloads_or_sources ... ok1292test jobs::tests::concurrent_csv_resubmission_preserves_identity_after_upload_cleanup ... ok1293test jobs::tests::shutdown_deadline_drops_and_joins_in_flight_work ... ok1294test jobs::tests::shutdown_waits_for_in_flight_work ... ok1295test jobs::tests::retry_snapshot_matches_status_and_list_without_exposing_payload ... ok1296test jobs::tests::final_failure_is_retained_and_manual_retry_gets_a_new_budget ... ok1297test jobs::tests::outbox_rollback_does_not_publish_an_event ... ok1298test jobs::tests::csv_job_persists_its_policy_with_the_upload ... ok1299test jobs::tests::synthetic_job_uses_the_same_registered_envelope ... ok1300test jobs::tests::upload_organization_must_match_its_job ... ok1301test models::project_creation::tests::draft_roundtrip_preserves_incomplete_input_without_demo_data ... ok1302test models::project_creation::tests::unauthorized_catalog_cost_is_absent_from_serialized_options ... ok1303test models::project_creation::tests::unknown_draft_fields_are_rejected ... ok1304test jobs::tests::reclaimed_attempt_rejects_stale_results_even_with_the_same_worker_name ... ok1305test notifications::tests::cancelling_delivery_kills_the_active_sender ... ok1306test jobs::tests::stopped_worker_leaves_queued_jobs_unclaimed ... ok1307test notifications::tests::acknowledged_email_is_never_claimed_again ... ok1308test jobs::tests::submission_key_cannot_change_csv_bytes_or_mode ... ok1309test notifications::tests::mail_configuration_is_disabled_by_default_and_rejects_partial_values ... ok1310test notifications::tests::disabled_mail_worker_does_not_claim_pending_notifications ... ok1311test notifications::tests::mail_configuration_requires_an_executable_file_and_safe_sender ... ok1312test notifications::tests::recipient_injection_is_rejected_before_starting_a_process ... ok1313test notifications::tests::rendered_mail_bounds_body_lines_for_long_unicode_and_control_names ... ok1314test notifications::tests::failed_email_retries_same_identity_and_eventually_stops ... ok1315test notifications::tests::foreign_notification_payload_is_terminal_and_never_sent ... ok1316test jobs::tests::outbox_stale_claims_cannot_acknowledge_or_reschedule_delivery ... ok1317test notifications::tests::retry_can_recover_without_changing_message_identity ... ok1318test notifications::tests::revoked_recipient_does_not_receive_a_pending_email ... ok1319test jobs::tests::submission_key_cannot_change_api_mode_or_scope ... ok1320test notifications::tests::mail_worker_delivers_only_its_kind_and_drains_cleanly ... ok1321test pages::clients::filters::tests::clearing_query_preserves_selected_currency_and_lifecycle ... ok1322test pages::clients::filters::tests::lifecycle_counts_share_query_and_currency_filters ... ok1323test pages::clients::filters::tests::name_search_ignores_case_and_surrounding_whitespace ... ok1324test pages::clients::filters::tests::preferred_or_visible_project_currency_matches_but_query_still_applies ... ok1325test pages::clients::form::tests::absent_billing_authority_never_produces_an_edit_payload ... ok1326test pages::clients::form::tests::ambiguous_creation_errors_require_explicit_recovery ... ok1327test pages::clients::form::tests::clearing_a_rate_is_explicit_and_needs_no_currency_confirmation ... ok1328test pages::clients::form::tests::invalid_fields_are_not_rewritten_by_validation ... ok1329test pages::clients::form::tests::rate_replacement_requires_confirmation_in_the_current_currency ... ok1330test pages::clients::form::tests::untouched_fields_keep_zero_rate_and_original_snapshot ... ok1331test pages::importers::presentation::tests::interrupted_report_is_partial_regardless_of_retry_prerequisites ... ok1332test pages::importers::presentation::tests::no_selection_does_not_claim_no_import_history ... ok1333test pages::importers::presentation::tests::source_labels_do_not_guess_unknown_importers ... ok1334test pages::importers::presentation::tests::states_and_phases_have_readable_unknown_fallbacks ... ok1335test pages::importers::presentation::tests::summaries_distinguish_zero_skipped_and_mixed_outcomes ... ok1336test pages::invoices::defaults_form::tests::invoice_fields_bound_metadata_by_characters_and_reject_nul ... ok1337test pages::invoices::defaults_form::tests::invoice_fields_preserve_exact_percentages_and_custom_terms ... ok1338test pages::invoices::defaults_form::tests::invoice_fields_preserve_receipt_terms_and_empty_optional_percentages ... ok1339test pages::invoices::defaults_form::tests::invoice_fields_reject_invalid_percentages_terms_and_second_tax ... ok1340test pages::invoices::preparation::fees::tests::fee_inputs_require_exact_amounts_and_an_explicit_positive_charge ... ok1341test pages::invoices::preparation::fees::tests::refresh_keeps_raw_edits_and_does_not_select_new_sources ... ok1342test pages::invoices::preparation::fees::tests::refresh_preserves_missing_or_relabelled_edits_until_explicit_removal ... ok1343test pages::invoices::preparation::tests::invoice_context_selects_only_the_exact_available_client ... ok1344test pages::invoices::preparation::tests::invoice_review_requires_matching_sources_and_valid_values ... ok1345test pages::invoices::preparation::tests::unavailable_or_malformed_invoice_context_never_uses_the_first_client ... ok1346test pages::new_project::basics::tests::a_batch_that_would_exceed_the_tag_limit_is_rejected ... ok1347test pages::new_project::basics::tests::a_full_tag_list_still_accepts_a_duplicate ... ok1348test pages::new_project::basics::tests::overlong_tags_are_rejected_without_truncation ... ok1349test pages::new_project::basics::tests::tag_length_counts_characters_instead_of_bytes ... ok1350test pages::new_project::basics::tests::tags_trim_and_deduplicate_without_changing_existing_spelling ... ok1351test pages::new_project::billing::tests::budget_errors_target_a_control_that_can_be_corrected ... ok1352test pages::new_project::draft::tests::a_mismatched_acknowledgement_does_not_lose_pending_input ... ok1353test pages::new_project::draft::tests::a_retry_keeps_the_unacknowledged_payload_and_revision ... ok1354test pages::new_project::draft::tests::a_validation_rejection_allows_corrected_input_at_the_same_revision ... ok1355test pages::new_project::draft::tests::an_empty_form_is_not_reported_as_saved ... ok1356test pages::new_project::draft::tests::any_saved_draft_wins_over_context_including_empty_or_matching_client ... ok1357test pages::new_project::draft::tests::context_prefills_only_a_new_form_without_fixing_its_currency ... ok1358test pages::new_project::draft::tests::resuming_preserves_the_server_identity_and_incomplete_fields ... ok1359test pages::new_project::team::tests::adding_everyone_deduplicates_without_replacing_project_overrides ... ok1360test pages::new_project::team::tests::exceeding_the_team_limit_does_not_partially_add_people ... ok1361test pages::new_project::team::tests::removing_a_member_keeps_an_empty_restricted_task_restricted ... ok1362test pages::new_project::tests::a_rejected_creation_can_be_edited_but_an_uncertain_commit_must_be_retried ... ok1363test pages::new_project::tests::only_known_validation_fields_can_target_a_control ... ok1364test pages::projects::budget_display_tests::configured_scopes_sum_without_hiding_an_individual_overrun ... ok1365test pages::projects::budget_display_tests::display_preserves_units_sign_and_large_integer_values ... ok1366test pages::projects::budget_display_tests::tag_filter_matches_identity_without_duplicates_or_name_collisions ... ok1367test pages::projects::budget_display_tests::unallocated_zero_and_overflow_budgets_are_not_conflated ... ok1368test pages::reports::tests::cost_total_uses_organization_currency_across_billing_currencies ... ok1369test pages::reports::tests::mixed_currencies_are_not_added_even_when_the_numbers_would_overflow ... ok1370test pages::reports::tests::monetary_total_overflow_is_visible_instead_of_panicking ... ok1371test pages::reports::tests::redacted_costs_do_not_become_zero_or_partial_totals ... ok1372test pages::reports::tests::single_currency_totals_are_formatted_and_empty_reports_have_no_amount ... ok1373test pages::timesheet::tests::cal_span_day_shows_only_the_anchor_column ... ok1374test pages::timesheet::tests::cal_span_defaults_to_week ... ok1375test pages::timesheet::tests::cal_span_unknown_falls_back_to_week ... ok1376test pages::timesheet::tests::cal_span_url_roundtrips ... ok1377test pages::timesheet::tests::cal_span_week_shows_all_seven_days ... ok1378test pages::timesheet::tests::cal_span_work_week_preserves_date_order_across_weekends ... ok1379test pages::timesheet::tests::cal_span_work_week_shows_monday_to_friday ... ok1380test pages::timesheet::tests::cal_span_work_week_skips_sunday_when_it_is_the_first_column ... ok1381test pages::timesheet::tests::day_col_class_marks_today ... ok1382test pages::timesheet::tests::day_col_class_marks_weekend ... ok1383test pages::timesheet::tests::day_col_class_plain_weekday ... ok1384test pages::timesheet::tests::day_col_class_today_wins_over_weekend ... ok1385test pages::timesheet::tests::invalid_duration_cannot_start_a_timer_save_or_clear_a_cell ... ok1386test pages::timesheet::tests::only_a_blank_duration_can_start_an_eligible_timer ... ok1387test pages::timesheet::tests::timed_lanes_still_widens_overlapping_entries ... ok1388test pages::timesheet::tests::timed_lanes_terminates_on_a_zero_length_entry ... ok1389test pages::timesheet::tests::today_offset_is_none_after_the_week ... ok1390test pages::timesheet::tests::today_offset_is_none_before_the_week ... ok1391test pages::timesheet::tests::today_offset_is_six_on_the_sunday ... ok1392test pages::timesheet::tests::today_offset_is_zero_on_the_monday ... ok1393test pages::timesheet::tests::value_cell_class_empty_wins_over_today ... ok1394test pages::timesheet::tests::value_cell_class_marks_today_when_nonzero ... ok1395test pages::timesheet::tests::weekend_style_follows_the_date_not_the_column_offset ... ok1396test pages::timesheet::tests::weekly_duration_edit_preserves_nine_am_start_notes_and_billability ... ok1397test pages::timesheet::tests::weekly_new_entries_are_untimed_and_explicit_clears_still_work ... ok1398test notifications::tests::sendmail_failure_does_not_expose_program_output ... ok1399test plugin::database::tests::application_database_owner_is_not_a_plugin_identity ... ok1400test jobs::tests::synthetic_job_executes_through_claim_and_completion ... ok1401test notifications::tests::stale_email_lease_cannot_start_delivery ... ok1402test notifications::tests::sendmail_receives_fixed_arguments_and_stable_message_identity ... ok1403test plugin::database::tests::dedicated_reader_is_accepted_but_new_write_grants_are_rejected ... ok1404test plugin::database::tests::project_configuration_is_private_even_when_plugin_grants_are_misconfigured ... ok1405test plugin::database::tests::reader_cannot_execute_security_definer_functions ... ok1406test plugin::database::tests::reader_accepts_optional_first_party_rounding_helper ... ok1407test plugin::event::tests::active_transition_fires_only_on_a_real_flip ... ok1408test plugin::database::tests::reader_cannot_have_access_to_credentials ... ok1409test plugin::event::tests::new_events_have_stable_hook_names ... ok1410test plugin::event::tests::budget_and_timer_events_serialize ... ok1411test plugin::event::tests::project_membership_payload_excludes_private_configuration ... ok1412test plugin::event::tests::role_change_event_carries_previous_role ... ok1413test plugin::event::tests::submission_event_serializes_payload ... ok1414test jobs::tests::outbox_same_kind_consumers_cannot_claim_the_same_lease ... ok1415test plugin::event::tests::us2_events_have_stable_hook_names ... ok1416test plugin::host::tests::config_lookup::a_set_key_is_returned ... ok1417test plugin::host::tests::config_lookup::an_unset_key_is_none ... ok1418test notifications::tests::verbose_sender_output_is_discarded_without_blocking_delivery ... ok1419test notifications::tests::sendmail_timeout_kills_and_reaps_the_child ... ok1420test plugin::host::tests::database_tests::unconfigured_sql_never_falls_back_to_application_state ... ok1421test plugin::database::tests::reader_cannot_switch_into_another_role ... ok1422test plugin::host::tests::response_shaping::error_json_wraps_the_message ... ok1423test plugin::host::tests::response_shaping::http_body_accepts_the_size_limit_and_rejects_larger_responses ... ok1424test plugin::host::tests::response_shaping::http_response_carries_status_and_body ... ok1425test plugin::host::tests::response_shaping::invalid_http_utf8_is_an_error_not_an_empty_success ... ok1426test plugin::host::tests::statement_is_read_only::a_cte_select_is_allowed ... ok1427test plugin::host::tests::statement_is_read_only::a_second_statement_is_rejected ... ok1428test plugin::host::tests::statement_is_read_only::a_single_trailing_semicolon_is_allowed ... ok1429test plugin::host::tests::statement_is_read_only::a_write_hidden_behind_a_comment_is_rejected ... ok1430test plugin::host::tests::statement_is_read_only::plain_select_is_allowed ... ok1431test plugin::host::tests::statement_is_read_only::writes_are_rejected ... ok1432test plugin::host::tests::wrap_select::strips_a_trailing_semicolon_before_wrapping ... ok1433test plugin::host::tests::wrap_select::wraps_as_a_bounded_row_query ... ok1434test plugin::manifest::tests::accepts_all_published_business_events ... ok1435test plugin::manifest::tests::config_defaults_to_empty_when_absent ... ok1436test plugin::manifest::tests::parse_valid_manifest ... ok1437test plugin::manifest::tests::parses_optional_config_table ... ok1438test plugin::manifest::tests::reject_empty_hooks ... ok1439test plugin::manifest::tests::reject_unknown_hook ... ok1440test plugin::host::tests::database_tests::wasm_host_uses_the_restricted_connection_on_a_current_thread_runtime ... ok1441test jobs::tests::invalid_stored_payloads_reach_a_terminal_error ... ok1442test plugin::host::tests::database_queries_preserve_parameters_and_rollback_session_settings ... ok1443test plugin::host::tests::database_tests::query_discards_session_advisory_locks ... ok1444test plugin::host::tests::database_tests::select_cannot_write_or_gain_application_privileges ... ok1445test plugin::database::tests::reader_rejects_unapproved_invoker_functions ... ok1446test plugin::host::tests::database_tests::query_results_are_bounded_without_silent_truncation ... ok14471448running 1 test1449test plugin::registry::tests::initialization::guest_initializers_have_an_engine_instruction_budget ... ok14501451test result: ok. 1 passed; 0 failed; 0 ignored; 0 measured; 830 filtered out; finished in 0.11s145214531454running 1 test1455test plugin::registry::tests::initialization::guest_initializers_have_an_engine_instruction_budget ... ok14561457test result: ok. 1 passed; 0 failed; 0 ignored; 0 measured; 830 filtered out; finished in 0.12s145814591460running 1 test1461test plugin::registry::tests::initialization::guest_initializers_have_an_engine_instruction_budget ... ok14621463test result: ok. 1 passed; 0 failed; 0 ignored; 0 measured; 830 filtered out; finished in 0.07s146414651466running 1 test1467test plugin::registry::tests::initialization::guest_initializers_have_an_engine_instruction_budget ... ok14681469test result: ok. 1 passed; 0 failed; 0 ignored; 0 measured; 830 filtered out; finished in 0.12s14701471test plugin::registry::tests::initialization::guest_initializers_have_an_engine_instruction_budget ... ok1472test importers::harvest::sync_tests::scale::durable_api_report_preserves_overflow_errors_after_recovery ... ok1473test plugin::registry::tests::isolation::cancelling_a_waiter_keeps_capacity_reserved_until_the_host_call_exits ... ok1474test plugin::registry::tests::isolation::confirmed_dispatch_returns_overload_for_retry ... ok1475test plugin::registry::tests::initialization::instruction_budget_is_replenished_for_each_call ... ok1476test plugin::registry::tests::isolation::confirmed_dispatch_attempts_other_plugins_after_one_fails ... ok1477test plugin::registry::tests::isolation::confirmed_dispatch_waits_for_the_plugin_to_finish ... ok1478test plugin::registry::tests::isolation::confirmed_dispatch_returns_plugin_failure_for_retry ... ok1479test plugin::registry::tests::isolation::events_execute_outside_the_async_worker ... ok1480test plugin::registry::tests::isolation::different_plugins_share_the_running_call_limit ... ok1481test plugin::registry::tests::isolation::loaded_plugins_cannot_start_with_excessive_memory ... ok1482test plugin::registry::tests::isolation::loaded_plugins_cannot_grow_memory_past_the_limit ... ok1483test plugin::registry::tests::isolation::pending_capacity_rejects_new_work_without_spawning_tasks ... ok1484test plugin::registry::tests::isolation::widgets_execute_outside_the_async_worker ... ok1485test plugin::registry::tests::load_empty_directory ... ok1486test plugin::registry::tests::load_nonexistent_directory ... ok1487test plugin::registry::tests::isolation::oversized_wasm_output_is_rejected_before_copying_it ... ok1488test plugin::registry::tests::isolation::oversized_event_payloads_are_not_queued ... ok1489test reports::bounded::tests::cancelled_export_keeps_its_slot_until_the_renderer_exits ... ok1490test reports::bounded::tests::export_admission_stays_reserved_until_the_body_is_dropped ... ok1491test reports::bounded::tests::export_rendering_runs_off_the_async_worker ... ok1492test reports::bounded::tests::output_budget_checks_writes_and_seeks_without_truncation ... ok1493test reports::bounded::tests::rendered_output_limit_rejects_oversized_files_and_releases_admission ... ok1494test render::tests::invoice_template_formats_large_minor_units_exactly ... ok1495test reports::bounded::tests::renderer_errors_and_panics_release_admission ... ok1496test reports::limits::tests::bounded_entries_enforce_the_row_limit_after_all_filters ... ok1497test reports::limits::tests::bounded_entries_reject_large_fields_and_combined_text ... ok1498test reports::bounded::tests::timed_out_export_keeps_its_slot_until_the_renderer_exits ... ok1499test reports::limits::tests::bounded_exports_preserve_real_workbooks_and_deterministic_pdf ... ok1500test plugin::registry::tests::dispatch_event_with_no_subscribers ... ok1501test plugin::host::tests::a_query_cannot_disable_its_own_deadline ... ok1502test plugin::registry::tests::collect_widgets_from_echo_plugin ... ok1503test plugin::registry::tests::load_test_plugins ... ok1504test reports::limits::tests::bounded_invoice_limits_include_branding_and_preserve_tenant_scope ... ok1505test reports::limits::tests::measure_bounded_export_limits ... ignored, manual release export measurement; set HORAE_EXPORT_PROBE_DIR for artifacts1506test reports::limits::tests::bounded_projects_filter_archives_before_size_checks ... ok1507test plugin::registry::tests::failing_plugin_does_not_block_caller ... ok1508test plugin::registry::tests::dispatch_invoice_sent_to_echo_plugin ... ok1509test plugin::registry::tests::dispatch_to_echo_plugin_succeeds ... ok1510test plugin::registry::tests::isolation::a_wasm_timeout_releases_the_worker_and_instance ... ok1511test reports::streaming::database_tests::measure_streaming_csv_export ... ignored, Manual release measurement of a 100,000-row CSV download1512test reports::limits::tests::export_queries_are_read_only_and_have_a_database_deadline ... ok1513test reports::streaming::database_tests::a_real_database_error_interrupts_the_csv_body ... ok1514test reports::streaming::database_tests::dropping_streamed_timesheet_closes_its_database_connection ... ok1515test reports::limits::tests::tag_filter_applies_before_xlsx_size_checks_and_rendering ... ok1516test reports::streaming::database_tests::streamed_fee_invoice_has_no_fabricated_hours_or_hourly_rate ... ok1517test reports::streaming::database_tests::streamed_invoice_metadata_and_lines_share_one_snapshot ... ok1518test reports::streaming::database_tests::streamed_invoice_uses_stored_exact_cents_and_tenant_scoped_metadata ... ok1519test reports::streaming::tests::completed_csv_keeps_admission_until_body_drop ... ok1520test reports::streaming::tests::csv_backpressure_and_body_drop_bound_and_cancel_source_reads ... ok1521test reports::streaming::tests::csv_does_not_truncate_a_quoted_unicode_record_larger_than_a_chunk ... ok1522test reports::streaming::tests::csv_emits_a_chunk_before_the_source_finishes ... ok1523test reports::streaming::tests::csv_failure_or_panic_after_a_chunk_is_not_successful_eof ... ok1524test reports::streaming::tests::csv_startup_errors_are_http_errors_and_release_admission ... ok1525test reports::privacy_tests::unauthorized_project_text_does_not_affect_export_size_limits ... ok1526test reports::streaming::tests::dropping_csv_during_startup_cancels_the_producer ... ok1527test route::tests::client_detail_preserves_identity_and_highlights_only_clients ... ok1528test route::tests::client_workflow_paths_preserve_context_and_navigation_section ... ok1529test route::tests::edit_project_preserves_identity_and_highlights_only_projects ... ok1530test route::tests::malformed_context_reaches_the_workflow_for_validation_after_recovery ... ok1531test route::tests::new_project_is_static_and_highlights_only_projects ... ok1532test reports::limits::tests::fee_exports_preserve_absent_quantities_and_render_a_real_pdf ... ok1533test reports::streaming::database_tests::streamed_tag_filter_excludes_other_projects_without_duplicating_rows ... ok1534test reports::streaming::tests::csv_timeout_interrupts_an_already_started_body ... ok1535test reports::streaming::database_tests::streamed_timesheet_exceeds_xlsx_row_limit_without_one_large_body_chunk ... ok1536test reports::privacy_tests::project_downloads_follow_progress_visibility ... ok1537test reports::streaming::database_tests::streamed_projects_preserve_scope_budget_and_tenant_isolation ... ok1538test seed::tests::concurrent_initializers_cannot_create_two_organizations ... ok1539test seed::tests::concurrent_seed_runs_create_only_one_demo ... ok1540test server_fns::approvals::submission_tests::cancelling_a_submission_releases_its_write_barrier ... ok1541test reports::streaming::database_tests::streamed_timesheet_preserves_csv_escaping_frozen_zero_and_all_filters ... ok1542test server_fns::approvals::submission_tests::submission_accepts_the_organizations_sunday_start ... ok1543test server_fns::approvals::submission_tests::submission_barrier_allows_shared_writers_for_the_same_user ... ok1544test seed::tests::concurrent_init_and_seed_cannot_mix_organizations ... ok1545test server_fns::approvals::submission_tests::submission_does_not_wait_for_another_users_writer ... ok1546test server_fns::approvals::submission_tests::submission_rejects_a_start_that_is_not_the_organizations_week_start ... ok1547test server_fns::approvals::submission_tests::submission_freezes_the_minutes_after_a_competing_edit ... ok1548test reports::limits::tests::invoice_exports_show_saved_adjustments_and_exact_large_amounts ... ok1549test server_fns::approvals::submission_tests::submission_uses_one_pool_connection ... ok1550test server_fns::approvals::tests::ignores_stopped_and_out_of_week_timers ... ok1551test server_fns::approvals::submission_tests::submission_waits_for_a_new_timer_before_checking_the_week ... ok1552test server_fns::approvals::tests::sees_a_running_timer_inside_the_week ... ok1553test server_fns::budget_tests::configured_alert_and_outbox_roll_back_together ... ok1554test server_fns::budget_tests::budget_notification_schema_enforces_tenants_and_no_public_access ... ok1555test seed::tests::repeated_seed_preserves_every_row_and_user_edits ... ok1556test server_fns::budget_tests::concurrent_budget_checks_have_one_band_claimant ... ok1557test server_fns::budget_tests::configured_alert_recipients_are_active_same_org_managers_and_project_leads ... ok1558test server_fns::budget_tests::configured_alerts_deduplicate_concurrent_checks_and_recrossing ... ok1559test reports::limits::tests::export_size_checks_and_reads_share_a_repeatable_read_snapshot ... ok1560test server_fns::budget_tests::configured_amount_budget_uses_resolved_rates_and_explicit_zero ... ok1561test server_fns::budget_tests::configured_alerts_require_enabled_active_project_and_authorized_recipient ... ok1562test server_fns::budget_tests::configured_budget_does_not_read_foreign_or_legacy_projects ... ok1563test server_fns::budget_tests::configured_budget_sweep_recovers_missed_checks_without_duplicates ... ok1564test server_fns::budget_tests::configured_person_budget_excludes_other_people_and_has_its_own_alert ... ok1565test server_fns::budget_tests::configured_task_and_person_budgets_do_not_share_consumption ... ok1566test server_fns::budget_tests::configured_nonbillable_projects_count_time_without_hidden_checkbox ... ok1567test server_fns::budget_tests::configured_monthly_budget_includes_leap_day_and_preserves_locked_rounding ... ok1568test seed::tests::seed_refuses_an_initialized_organization_without_writes ... ok1569test server_fns::budget_tests::configured_monthly_budget_excludes_other_months_and_nonbillable_time ... ok1570test server_fns::budget_tests::configured_task_fee_budget_respects_billability_and_alert_scope ... ok1571test server_fns::budget_tests::overview_budget_progress_batches_projects_without_mixing_scopes ... ok1572test server_fns::budget_tests::overview_budget_progress_includes_people_without_an_allowance ... ok1573test server_fns::budget_tests::overview_budget_progress_is_current_period_scoped_and_authorized ... ok1574test server_fns::clients::tests::client_default_rate_allows_detail_edits_and_equivalent_currency ... ok1575test server_fns::clients::tests::client_default_rate_prevents_currency_relabelling ... ok1576test seed::tests::late_seed_failure_rolls_back_all_demo_data ... ok1577test server_fns::clients::tests::both_activation_transitions_change_once_and_preserve_details ... ok1578test server_fns::clients::tests::client_summaries_exclude_foreign_clients_and_unreadable_project_currencies ... ok1579test server_fns::clients::tests::client_details_hide_foreign_missing_and_inactive_actor_records ... ok1580test server_fns::clients::tests::client_invoices_reject_a_winning_concurrent_revocation ... ok1581test server_fns::clients::tests::client_details_keep_catalog_identity_but_omit_member_billing ... ok1582test server_fns::clients::tests::client_details_distinguish_unset_zero_and_positive_manager_rates ... ok1583test seed::tests::seed_leaves_an_older_or_partial_demo_unchanged ... ok1584test server_fns::clients::tests::client_invoices_require_manager_authority_even_without_invoices ... ok1585test server_fns::clients::tests::client_invoices_keep_exact_client_scope_statuses_and_currencies ... ok1586test server_fns::clients::tests::client_invoices_hold_authority_until_the_read_finishes ... ok1587test server_fns::clients::tests::missing_and_foreign_clients_are_not_noops ... ok1588test server_fns::clients::tests::client_summaries_reject_a_foreign_actor_even_when_client_org_is_known ... ok1589test server_fns::clients::tests::concurrent_deletion_is_not_an_unchanged_mutation ... ok1590test server_fns::clients::tests::client_summaries_keep_catalog_without_projects_and_count_archived_projects ... ok1591test seed::tests::seed_refuses_a_second_organization_even_when_the_demo_exists ... ok1592test server_fns::clients::tests::currency_edit_rechecks_a_concurrently_added_client_default_rate ... ok1593test server_fns::clients::tests::each_field_changes_once_and_preserves_inactive_status ... ok1594test server_fns::clients::tests::client_summaries_follow_existing_progress_visibility_and_revoke_inactive_users ... ok1595test server_fns::clients::tests::profile_create_persists_normalized_identity_and_exact_optional_rate ... ok1596test server_fns::clients::tests::profile_update_rechecks_authority_after_waiting_for_a_concurrent_demotion ... ok1597test server_fns::clients::tests::profile_saves_reject_invalid_input_without_partial_writes ... ok1598test server_fns::clients::tests::profile_saves_recheck_manager_org_and_active_actor ... ok1599test server_fns::clients::tests::profile_noop_preserves_row_and_returns_no_update_event_signal ... ok1600test server_fns::clients::tests::profile_update_requires_explicit_rate_intent_for_currency_changes ... ok1601test server_fns::clients::tests::profile_update_rejects_stale_currency_even_when_the_rate_is_still_unset ... ok1602test server_fns::clients::tests::profile_update_rechecks_financial_snapshot_after_waiting_for_a_concurrent_edit ... ok1603test server_fns::clients::tests::profile_update_rejects_stale_rate_even_when_the_target_currency_is_unchanged ... ok1604test server_fns::importers::authorization_tests::cli_job_endpoints_have_stable_registered_paths ... ok1605test server_fns::clients::tests::profile_update_preserves_historical_rows_and_inactive_status ... ok1606test server_fns::clients::tests::profile_currency_change_without_a_rate_keeps_it_unset ... ok1607test server_fns::importers::authorization_tests::request_bound_import_endpoints_are_not_registered ... ok1608test server_fns::importers::csv_upload::tests::csv_upload_extractor_preserves_raw_bytes ... ok1609test server_fns::importers::csv_upload::tests::csv_upload_requires_its_header_without_reading_the_body ... ok1610test server_fns::importers::tests::concurrent_api_import_returns_a_retryable_conflict ... ok1611test server_fns::importers::tests::submission_identity_rejects_expired_future_and_non_v7_keys ... ok1612test server_fns::importers::tests::csv_route_rejects_invalid_modes_and_headers_without_reading_uploads ... ok1613test server_fns::clients::tests::repeating_a_competing_deactivation_does_not_report_a_transition ... ok1614test server_fns::clients::tests::restoring_values_after_a_competing_edit_reports_a_change ... ok1615test server_fns::clients::tests::unchanged_activation_preserves_the_row ... ok1616test server_fns::clients::tests::restoring_a_competing_deactivation_reports_reactivation ... ok1617test server_fns::invoices::fee_tests::concurrent_invoices_claim_a_single_fee_once ... ok1618test server_fns::clients::tests::repeating_a_competing_edit_does_not_report_a_change ... ok1619test server_fns::clients::tests::unchanged_edit_preserves_the_row ... ok1620test server_fns::invoices::fee_tests::fee_invoice_does_not_claim_hours_or_another_clients_fee ... ok1621test server_fns::invoices::fee_tests::fee_occurrence_rejects_cross_organization_project ... ok1622test server_fns::importers::authorization_tests::job_endpoints_enforce_session_role_and_organization ... ok1623test server_fns::invoices::fee_tests::fee_total_overflow_rolls_back_occurrences_and_invoice ... ok1624test server_fns::invoices::fee_tests::discounted_fee_leaves_a_balance_and_void_releases_only_its_contribution ... ok1625test server_fns::invoices::fee_tests::invoice_line_sources_reject_mixed_sources_and_invented_fee_quantities ... ok1626test server_fns::invoices::fee_tests::draft_fee_edit_requires_current_balance_and_exact_excess_confirmation ... ok1627test server_fns::invoices::fee_tests::fee_preview_keeps_source_identity_and_reports_discounted_draft_balances ... ok1628test server_fns::invoices::fee_tests::milestones_include_unbilled_overdue_fees_but_not_future_fees ... ok1629test server_fns::invoices::fee_tests::concurrent_discounted_invoice_retries_return_one_invoice ... ok1630test server_fns::invoices::fee_tests::invoice_defaults_apply_to_selected_fees_without_claiming_other_projects ... ok1631test server_fns::invoices::fee_tests::monthly_fees_use_calendar_dates_and_skip_already_claimed_months ... ok1632test server_fns::invoices::fee_tests::fee_balance_migration_allocates_discount_without_rewriting_invoice_snapshots ... ok1633test server_fns::invoices::fee_tests::monthly_first_and_fifteenth_respect_partial_period_and_project_end ... ok1634test server_fns::invoices::fee_tests::draft_fee_edit_serializes_retries_and_rejects_stale_revisions ... ok1635test server_fns::invoices::fee_tests::mixed_time_and_fee_discount_conserves_cents_without_reopening_time ... ok1636test server_fns::invoices::fee_tests::prepared_fee_selection_rejects_invalid_values_and_empty_generation ... ok1637test server_fns::invoices::fee_tests::project_fee_context_keeps_monthly_balances_separate ... ok1638test server_fns::invoices::fee_tests::project_fee_context_matches_invoice_balances_and_current_authority ... ok1639test server_fns::invoices::fee_tests::invoice_status_rechecks_authority_after_waiting_for_the_invoice_lock ... ok1640test server_fns::invoices::fee_tests::draft_fee_edit_rejects_invalid_lines_and_current_unauthorized_actors ... ok1641test server_fns::invoices::fee_tests::single_fee_can_be_invoiced_without_time ... ok1642test server_fns::invoices::fee_tests::invoice_preview_does_not_materialize_fees_and_preserves_released_snapshots ... ok1643test server_fns::invoices::fee_tests::void_releases_fee_identity_without_rewriting_the_original_line ... ok1644test server_fns::invoices::preview::tests::excess_rejects_an_unrepresentable_total_even_when_the_remainder_fits ... ok1645test server_fns::invoices::preview::tests::unselected_fee_currencies_do_not_relabel_or_block_selected_charges ... ok1646test server_fns::invoices::fee_tests::reviewed_generation_does_not_materialize_unselected_months ... ok1647test server_fns::invoices::tests::configured_fixed_fee_hours_are_not_invoiced_but_legacy_fees_are_unchanged ... ok1648test server_fns::invoices::fee_tests::reviewed_generation_rejects_changed_time_before_claiming_it ... ok1649test server_fns::invoices::tests::billing_cascade_agrees_across_all_four_levels_including_zero ... ok1650test server_fns::invoices::tests::effective_minutes_migration_preserves_historical_invoice_quantities ... ok1651test server_fns::invoices::fee_tests::settled_fee_sources_remain_reviewable_without_automatic_charges ... ok1652test server_fns::invoices::tests::configured_project_currency_and_cost_override_keep_their_denominations ... ok1653test server_fns::invoices::fee_tests::fee_preview_discount_ties_follow_source_keys_not_display_dates ... ok1654test server_fns::invoices::tests::effective_minutes_sql_matches_domain_rounding ... ok1655test server_fns::invoices::fee_tests::removing_discount_and_billing_the_remainder_cannot_both_succeed ... ok1656test server_fns::invoices::fee_tests::reviewed_generation_requires_exact_excess_and_current_authority ... ok1657test server_fns::invoices::tests::imported_rates::imported_legacy_project_keeps_exact_rates_and_totals_on_retry ... ok1658test server_fns::invoices::tests::imported_rates::imported_task_rates_require_matching_currency_only_for_new_configured_links ... ok1659test server_fns::invoices::tests::imported_rates::rejected_import_rate_does_not_poison_the_next_row_or_its_catalog_rate ... ok1660test server_fns::invoices::tests::invoice_defaults_validate_all_override_fields ... ok1661test server_fns::invoices::tests::invoice_line_overflow_leaves_time_unbilled ... ok1662test server_fns::invoices::tests::invoice_preview_keeps_time_rates_and_defaults_in_one_snapshot ... ok1663test server_fns::invoices::fee_tests::zero_fee_is_invoiced_once_until_voided ... ok1664test server_fns::invoices::tests::invoice_defaults_edit_rechecks_status_after_waiting_for_a_concurrent_send ... ok1665test server_fns::invoices::tests::invoice_defaults_legacy_insert_preserves_dates_and_exact_total ... ok1666test server_fns::invoices::tests::invoice_total_overflow_leaves_all_time_unbilled ... ok1667test server_fns::invoices::tests::invoice_defaults_selection_rejects_unavailable_projects_before_claiming ... ok1668test server_fns::invoices::tests::invoice_transitions_reject_invalid_states_and_foreign_organizations ... ok1669test server_fns::invoices::tests::invoiced_amounts_survive_rate_changes_and_void_uses_current_rates ... ok1670test server_fns::invoices::fee_tests::draft_fee_edit_replaces_amount_and_preserves_source_and_retry_identity ... ok1671test server_fns::invoices::tests::invoiced_billability_survives_later_project_changes ... ok1672test server_fns::invoices::tests::invoicing_uses_and_freezes_effective_minutes ... ok1673test server_fns::invoices::tests::invoicing_leaves_running_time_open ... ok1674test server_fns::invoices::tests::invoice_defaults_apply_exact_adjustments_and_payment_terms ... ok1675test server_fns::invoices::tests::only_running_time_does_not_create_an_invoice ... ok1676test server_fns::invoices::tests::large_invoice_and_reports_agree_without_intermediate_overflow ... ok1677test server_fns::invoices::tests::invoice_defaults_conflict_rolls_back_all_claims ... ok1678test server_fns::invoices::tests::non_billable_context_produces_no_unbilled_amount_on_any_report ... ok1679test server_fns::invoices::tests::mixed_project_currencies_cannot_partially_create_an_invoice ... ok1680test server_fns::invoices::tests::project_rate_is_used_by_invoices_reports_and_spend ... ok1681test server_fns::invoices::tests::void_reopens_time_without_stale_rounding ... ok1682test server_fns::organization::tests::each_branding_field_changes_once_including_null_and_empty ... ok1683test server_fns::invoices::fee_tests::reviewed_generation_bills_partial_fees_and_rejects_stale_balances ... ok1684test server_fns::invoices::tests::void_waits_for_a_concurrent_payment_and_then_refuses ... ok1685test server_fns::invoices::tests::selected_project_rate_modes_agree_across_billing_consumers ... ok1686test server_fns::organization::tests::missing_organization_is_not_an_unchanged_update ... ok1687test server_fns::project_creation::assignment_tests::finalization_reuses_catalog_and_keeps_lead_overrides_local_on_retry ... ok1688test server_fns::invoices::tests::invoice_defaults_are_invoice_owned_and_only_drafts_are_editable ... ok1689test server_fns::organization::tests::unchanged_branding_preserves_the_row ... ok1690test server_fns::organization::tests::restoring_branding_after_a_competing_edit_reports_a_change ... ok1691test server_fns::organization::tests::repeating_a_competing_branding_edit_does_not_report_a_change ... ok1692test server_fns::project_creation::assignment_tests::invalid_assignment_graphs_leave_no_partial_creation_or_draft_change ... ok1693test server_fns::project_creation::editing::tests::editor_keeps_archived_selected_identities_and_nullable_overrides ... ok1694test server_fns::project_creation::editing::tests::editor_preserves_fee_schedule_and_operational_milestone_ids ... ok1695test server_fns::project_creation::editing::tests::editor_loads_legacy_values_without_fabricating_a_billing_mode_or_draft ... ok1696test server_fns::project_creation::editing::tests::concurrent_edits_have_one_winner_and_association_writes_invalidate_open_forms ... ok1697test server_fns::project_creation::editing::tests::editing_milestones_keeps_invoice_snapshots_and_fee_identities_immutable ... ok1698test server_fns::project_creation::editing::tests::editor_rechecks_tenant_role_and_active_status ... ok1699test server_fns::project_creation::editing::tests::editor_recovers_full_configuration_and_redacts_private_values_after_role_change ... ok1700test server_fns::project_creation::editing::tests::editor_recovers_each_budget_scope_without_turning_absence_into_zero ... ok1701test server_fns::project_creation::editing::tests::save_edits_the_same_legacy_project_and_never_creates_a_draft_or_configuration ... ok1702test server_fns::project_creation::editing::tests::manager_edit_preserves_private_settings_and_cannot_remove_them_indirectly ... ok1703test server_fns::invoices::tests::invoice_preview_rejects_large_results_instead_of_truncating_them ... ok1704test server_fns::project_creation::editing::tests::foreign_actor_cannot_save_or_retry_another_organizations_edit ... ok1705test server_fns::project_creation::tests::billing_schema_rejects_partial_fee_schedules ... ok1706test server_fns::project_creation::editing::tests::save_preserves_recorded_time_and_rejects_removing_its_task_or_person ... ok1707test server_fns::project_creation::editing::tests::save_updates_configured_sections_atomically_and_rejects_stale_or_invalid_edits ... ok1708test server_fns::project_creation::editing::tests::saves_recheck_current_authority_and_do_not_repeat_noops ... ok1709test server_fns::project_creation::editing::tests::task_catalog_and_graph_changes_roll_back_together_on_duplicate_resolution ... ok1710test server_fns::invoices::tests::invoice_preview_matches_generation_without_claiming_time ... ok1711test server_fns::project_creation::tests::creation_actor_is_revalidated_inside_the_transaction ... ok1712test server_fns::invoices::tests::invoice_preview_requires_explicit_resolution_and_scopes_selected_projects ... ok1713test server_fns::project_creation::tests::creation_options_are_scoped_bounded_and_redact_manager_costs ... ok1714test server_fns::project_creation::tests::creation_client_must_be_active_and_in_the_same_organization ... ok1715test server_fns::project_creation::tests::draft_save_retries_do_not_overwrite_a_newer_revision ... ok1716test server_fns::project_creation::tests::client_dialog_validates_details_and_persists_an_explicit_zero_rate ... ok1717test server_fns::project_creation::tests::draft_ownership_discard_and_role_changes_are_enforced ... ok1718test server_fns::project_creation::tests::final_validation_checks_invoice_defaults_and_scoped_budget_totals ... ok1719test server_fns::project_creation::tests::final_validation_preserves_exact_budgets_and_rejects_unavailable_email ... ok1720test server_fns::project_creation::tests::final_validation_requires_real_details_and_ignores_hidden_type_settings ... ok1721test server_fns::project_creation::tests::final_validation_requires_complete_fee_schedules_and_distinct_entities ... ok1722test server_fns::project_creation::tests::draft_validation_preserves_incomplete_input_but_bounds_its_size ... ok1723test server_fns::project_creation::tests::draft_schema_enforces_one_current_draft_per_creator ... ok1724test server_fns::project_creation::tests::finalize_is_atomic_and_repeated_submission_returns_one_project ... ok1725test server_fns::project_creation::tests::finalization_persists_task_access_and_project_only_financial_overrides ... ok1726test server_fns::project_creation::tests::draft_schema_rejects_oversize_payload_and_invalid_revision ... ok1727test server_fns::project_creation::tests::managers_cannot_store_administrator_notes_or_costs_in_a_draft ... ok1728test server_fns::project_creation::import_tests::imported_catalog_rate_cannot_be_relabelled_as_workspace_currency ... ok1729test server_fns::project_creation::tests::finalization_rechecks_client_role_revision_and_rate_currency ... ok1730test server_fns::project_creation::tests::draft_schema_rejects_foreign_creator_and_completed_project ... ok1731test server_fns::project_creation::validation::tests::assignment_rejections_identify_the_invalid_row ... ok1732test server_fns::project_creation::tests::existing_projects_have_no_implicit_new_billing_configuration ... ok1733test server_fns::project_creation::validation::tests::billing_rejections_identify_the_active_control ... ok1734test server_fns::project_creation::validation::tests::basic_rejections_identify_the_field_without_echoing_input ... ok1735test server_fns::project_creation::validation::tests::inactive_billing_inputs_remain_in_the_draft_without_blocking_creation ... ok1736test server_fns::project_creation::validation::tests::milestone_rejections_target_the_invalid_row_by_identity ... ok1737test server_fns::project_creation::validation::tests::invoice_rejections_identify_the_field_without_echoing_input ... ok1738test server_fns::project_creation::validation::tests::non_billable_projects_ignore_hidden_invoice_inputs ... ok1739test server_fns::project_creation::validation::tests::task_name_and_access_rejections_identify_the_invalid_row ... ok1740test server_fns::project_creation::tests::invalid_task_rolls_back_project_and_keeps_the_draft ... ok1741test server_fns::projects::bulk_tests::bulk_ids_validate_before_writes_and_normalize_duplicates ... ok1742test server_fns::projects::bulk_tests::bulk_accepts_one_hundred_projects_and_mixed_status_noops ... ok1743test server_fns::project_creation::tests::selected_client_lookup_is_scoped_and_keeps_archived_identity ... ok1744test server_fns::project_creation::tests::selected_catalog_bounds_requests_and_excludes_inactive_people ... ok1745test server_fns::projects::bulk_tests::bulk_database_failure_rolls_back_earlier_changes ... ok1746test server_fns::project_creation::tests::missing_draft_responses_do_not_disclose_foreign_ownership ... ok1747test server_fns::project_creation::tests::selected_catalog_is_scoped_deduplicated_and_redacts_manager_costs ... ok1748test server_fns::project_creation::tests::simultaneous_draft_updates_have_one_winner ... ok1749test server_fns::projects::mutation_tests::project::both_activation_transitions_preserve_details_and_change_once ... ok1750test server_fns::projects::bulk_tests::bulk_status_preserves_details_history_and_noop_versions ... ok1751test server_fns::projects::bulk_tests::bulk_reversed_overlapping_batches_finish_without_deadlock ... ok1752test server_fns::projects::bulk_tests::bulk_preserves_invoiced_history_assignments_and_spend ... ok1753test server_fns::projects::bulk_tests::bulk_missing_or_foreign_project_rolls_back_earlier_changes ... ok1754test server_fns::projects::mutation_tests::project::budgets_and_rates_distinguish_null_zero_and_normalized_values ... ok1755test server_fns::projects::mutation_tests::project::configured_edits_recheck_settings_after_waiting_for_the_project ... ok1756test server_fns::projects::mutation_tests::project::configured_edits_preserve_non_hourly_billing ... ok1757test server_fns::projects::mutation_tests::project::concurrent_deletion_is_rejected_by_both_mutations ... ok1758test server_fns::project_creation::import_tests::imports_preserve_finalized_project_configuration_and_restricted_access ... ok1759test server_fns::projects::mutation_tests::project::configured_edits_preserve_compatible_changes_and_idempotence ... ok1760test server_fns::projects::mutation_tests::project::repeating_a_competing_deactivation_reports_no_transition ... ok1761test server_fns::projects::mutation_tests::project::repeating_a_competing_edit_requires_a_fresh_revision ... ok1762test server_fns::projects::mutation_tests::project::missing_and_foreign_rows_are_not_noops ... ok1763test server_fns::projects::mutation_tests::project::configured_edits_reject_incompatible_financial_changes_atomically ... ok1764test server_fns::projects::details_tests::project_details_and_tags_follow_current_progress_and_private_permissions ... ok1765test server_fns::projects::mutation_tests::project::invalid_project_fields_leave_the_row_unchanged ... ok1766test server_fns::projects::mutation_tests::project::inactive_project_edits_preserve_identity_and_reject_implicit_migrations ... ok1767test server_fns::projects::mutation_tests::project::restoring_a_competing_deactivation_reports_reactivation ... ok1768test server_fns::projects::mutation_tests::task::both_activation_transitions_preserve_details_and_change_once ... ok1769test server_fns::projects::mutation_tests::project::unchanged_activation_preserves_the_row ... ok1770test server_fns::projects::mutation_tests::task::concurrent_deletion_returns_not_found_for_both_mutations ... ok1771test server_fns::projects::mutation_tests::task::each_detail_field_changes_once_and_preserves_inactive_status ... ok1772test server_fns::projects::mutation_tests::project::unchanged_edit_preserves_the_row ... ok1773test server_fns::projects::mutation_tests::project::restoring_a_competing_edit_does_not_overwrite_the_other_session ... ok1774test server_fns::project_creation::editing::tests::editor_load_uses_current_role_across_all_billing_configurations ... ok1775test server_fns::projects::mutation_tests::task::missing_and_foreign_rows_are_not_noops ... ok1776test server_fns::projects::mutation_tests::task::unchanged_activation_preserves_the_row ... ok1777test server_fns::projects::mutation_tests::task::rate_edits_set_currency_without_relabelling_renames_or_noops ... ok1778test server_fns::projects::mutation_tests::task::repeating_a_competing_deactivation_reports_no_transition ... ok1779test server_fns::projects::mutation_tests::task::restoring_a_competing_deactivation_reports_reactivation ... ok1780test server_fns::projects::mutation_tests::task::repeating_a_competing_edit_does_not_report_a_change ... ok1781test server_fns::projects::mutation_tests::task::restoring_a_competing_edit_reports_a_change ... ok1782test server_fns::projects::privacy_tests::legacy_members_retain_progress_without_new_settings ... ok1783test server_fns::projects::mutation_tests::task::unchanged_edit_preserves_the_row ... ok1784test server_fns::projects::privacy_tests::project_reads_use_current_authority_and_reject_foreign_scope ... ok1785test server_fns::projects::details_tests::unlinked_and_private_project_tags_do_not_leak_into_filters ... ok1786test server_fns::projects::privacy_tests::private_progress_does_not_prevent_tracking_or_reveal_financial_fields ... ok1787test server_fns::projects::privacy_tests::project_members_and_leads_receive_progress_without_rates ... ok1788test server_fns::projects::privacy_tests::client_project_filter_preserves_progress_access_and_rate_redaction ... ok1789test server_fns::projects::privacy_tests::revoked_membership_preserves_only_own_historical_tracking_identity ... ok1790test server_fns::projects::privacy_tests::outsiders_and_inactive_viewers_have_no_project_reads ... ok1791test server_fns::projects::tests::enabling_is_tenant_scoped_even_for_existing_links_and_preserves_overrides ... ok1792test server_fns::projects::tests::enabling_tasks_rejects_invalid_or_wrong_currency_explicit_rates_without_linking ... ok1793test server_fns::projects::tests::assignments_are_scoped_to_the_viewers_organization ... ok1794test server_fns::projects::tests::enabling_tasks_only_inherits_rates_used_by_configured_projects ... ok1795test server_fns::projects::tests::failed_project_task_creation_leaves_no_orphan_task ... ok1796test server_fns::projects::tests::project_rate_distinguishes_inheritance_zero_and_exact_amounts ... ok1797test server_fns::projects::tests::enabling_tasks_rejects_explicit_rates_unused_by_the_project ... ok1798test server_fns::projects::tests::enabling_tasks_accepts_exact_project_currency_rates_and_preserves_existing_links ... ok1799test server_fns::projects::tests::enabling_tasks_rejects_incompatible_catalog_currency ... ok1800test server_fns::projects::tests::creating_a_project_task_enables_it_with_its_defaults ... ok1801test server_fns::projects::details_tests::project_details_only_offer_task_rate_currency_to_current_managers ... ok1802test server_fns::projects::tests::unknown_catalog_currency_requires_explicit_configured_rates_but_preserves_legacy ... ok1803test server_fns::projects::tests::project_rate_sql_matches_rust_for_missing_zero_and_present_sources ... ok1804test server_fns::time_entries::tests::a_limit_bounds_a_listing_on_its_own ... ok1805test server_fns::projects::tests::project_rate_helper_has_no_public_execute_grant ... ok1806test server_fns::reports::tests::manager_report_omits_groups_containing_private_project_costs ... ok1807test server_fns::projects::tests::members_can_list_identities_but_not_assignment_rates ... ok1808test server_fns::projects::tests::managers_and_admins_can_read_assignment_rates ... ok1809test server_fns::time_entries::tests::an_unlimited_listing_needs_both_ends_of_the_range ... ok1810test server_fns::time_entries::tests::a_running_timer_cannot_be_moved_to_another_day ... ok1811test server_fns::time_entries::tests::clamps_duration_against_the_snapped_start ... ok1812test server_fns::time_entries::tests::assigned_member_may_log_time ... ok1813test server_fns::reports::tests::report_uses_current_active_actor_and_tenant_for_every_filter ... ok1814test server_fns::time_entries::tests::admin_may_log_time_without_assignment ... ok1815test server_fns::time_entries::tests::an_open_entry_can_move_into_a_day_with_locked_time ... ok1816test server_fns::time_entries::tests::a_reorder_rejects_foreign_missing_timed_and_duplicate_ids ... ok1817test server_fns::time_entries::tests::concurrent_timer_starts_insert_exactly_one_entry ... ok1818test server_fns::time_entries::tests::new_time_and_picker_require_a_project_task_link ... ok1819test server_fns::time_entries::tests::edits_preserve_archived_time_but_cannot_override_non_billability ... ok1820test server_fns::time_entries::tests::rejects_out_of_range_start ... ok1821test server_fns::time_entries::tests::moving_locked_time_rejects_the_entire_reorder ... ok1822test server_fns::time_entries::tests::inactive_project_cannot_accept_new_time_even_for_admin ... ok1823test server_fns::time_entries::tests::snaps_unaligned_start_to_the_grid ... ok1824test server_fns::time_entries::tests::new_time_and_picker_reject_inactive_or_foreign_contexts ... ok1825test server_fns::reports::tests::filters_and_renames_keep_report_identity_and_totals ... ok1826test server_fns::time_entries::tests::untimed_start_is_left_untouched ... ok1827test server_fns::time_entries::tests::unassigned_member_is_forbidden ... ok1828test server_fns::time_entries::update_tests::concurrent_lock_or_delete_is_rechecked_before_editing ... ok1829test server_fns::time_entries::update_tests::competing_edit_that_restores_old_values_still_reports_a_change ... ok1830test server_fns::time_entries::tests::new_time_uses_effective_billability_for_manual_entries_and_timers ... ok1831test server_fns::time_entries::update_tests::competing_identical_edit_is_a_noop_after_the_first_commit ... ok1832test server_fns::time_entries::tests::submission_barrier_blocks_edits_and_cross_week_reorders ... ok1833test server_fns::time_entries::tests::submission_barrier_blocks_manual_entries_and_timer_starts ... ok1834test server_fns::reports::tests::tag_filters_keep_report_dimensions_and_details_in_sync ... ok1835test server_fns::reports::tests::same_names_keep_separate_groups_for_every_dimension ... ok1836test server_fns::time_entries::update_tests::restricted_reordering_rejects_the_whole_batch ... ok1837test server_fns::time_entries::update_tests::restricted_empty_task_rejects_picker_manual_and_timer_starts ... ok1838test server_fns::time_entries::update_tests::normalized_noop_preserves_the_row_and_updated_at ... ok1839test server_fns::time_entries::update_tests::effective_billability_noop_preserves_the_row ... ok1840test server_fns::time_entries::update_tests::restricted_task_rejects_reschedule_and_delete ... ok1841test server_fns::time_entries::update_tests::restricted_empty_task_rejects_changes_and_noop_edits ... ok1842test server_fns::time_entries::update_tests::each_editable_field_changes_once_including_nulls ... ok1843test server_fns::time_entries::update_tests::missing_foreign_and_locked_entries_are_not_noops ... ok1844test server_fns::users::tests::concurrency::access_changes_cannot_target_another_organization ... ok1845test server_fns::users::tests::concurrency::concurrent_demotions_keep_an_active_admin ... ok1846test server_fns::users::tests::concurrency::concurrent_deactivations_keep_an_active_admin ... ok1847test server_fns::users::tests::concurrency::deactivation_and_demotion_keep_an_active_admin ... ok1848test server_fns::time_entries::update_tests::restriction_changes_are_rechecked_before_manual_or_timer_insertion ... ok1849test server_fns::time_entries::update_tests::revoked_grant_does_not_trap_an_own_running_timer ... ok1850test server_fns::time_entries::update_tests::task_grant_revocation_committed_during_an_edit_is_rechecked ... ok1851test server_fns::time_entries::update_tests::revoked_timer_stop_preserves_the_open_state_guard ... ok1852test server_fns::users::tests::hide_rates_clears_both_rate_fields ... ok1853test server_fns::time_entries::update_tests::task_grants_allow_tracking_and_archived_history_for_every_role ... ok1854test server_fns::reports::tests::shared_person_and_task_are_partitioned_by_currency ... ok1855test server_fns::users::tests::concurrency::demotion_and_deactivation_keep_an_active_admin ... ok1856test server_fns::users::tests::concurrency::the_last_admin_cannot_be_demoted_or_deactivated ... ok1857test server_fns::users::tests::concurrency::unchanged_admin_access_is_allowed ... ok18581859failures:18601861---- importers::harvest::engine_tests::completed_imports_allow_immediate_retries stdout ----18621863thread 'importers::harvest::engine_tests::completed_imports_allow_immediate_retries' (88679873) panicked at crates/horae/src/importers/harvest/engine_tests.rs:133:14:1864called `Result::unwrap()` on an `Err` value: error communicating with database: Socket is not connected (os error 57)18651866Caused by:1867 Socket is not connected (os error 57)1868note: run with `RUST_BACKTRACE=1` environment variable to display a backtrace186918701871failures:1872 importers::harvest::engine_tests::completed_imports_allow_immediate_retries18731874test result: FAILED. 820 passed; 1 failed; 10 ignored; 0 measured; 0 filtered out; finished in 68.70s18751876error: test failed, to rerun pass `-p horae --bin horae`