failed attributes
| status |
attribute |
duration |
| failed |
checks.aarch64-darwin.e2e
|
40m 49s |
setup:
/nix/store/8rjshxmy0ydjfbava1scffw9pj9phfzd-closure-info.drv
/nix/store/wcg4kkcf965gb641qa13ifkmi5wa9m2z-run-nixos-vm.drv
/nix/store/k9167w5pxxiyx1 …
setup:
/nix/store/8rjshxmy0ydjfbava1scffw9pj9phfzd-closure-info.drv
/nix/store/wcg4kkcf965gb641qa13ifkmi5wa9m2z-run-nixos-vm.drv
/nix/store/k9167w5pxxiyx1j894gaxjaiw2f3s6z7-nixos-vm.drv
/nix/store/7vlrr7hqgyfspf71v76qhfkmpry1r8rc-driverConfiguration.json.drv
/nix/store/ysjnz5lh0fn0swalzqank2m3kirs1bn4-nixos-test-driver-horae-e2e.drv
/nix/store/5afxhp1cjgp91bljcsmhpn2p1dl184sj-vm-test-run-horae-e2e.drv
Failed to find a machine for remote build!
derivation: 5afxhp1cjgp91bljcsmhpn2p1dl184sj-vm-test-run-horae-e2e.drv
required (system, features): (aarch64-darwin, [apple-virt, nixos-test])
12 available machines:
(systems, maxjobs, supportedFeatures, mandatoryFeatures)
([aarch64-darwin], 8, [big-parallel, kvm, nixos-test, uid-range], [])
([aarch64-darwin], 8, [big-parallel, kvm, nixos-test, uid-range], [])
([aarch64-darwin], 8, [big-parallel, kvm, nixos-test, uid-range], [])
([aarch64-darwin], 8, [big-parallel, kvm, nixos-test, uid-range], [])
([aarch64-linux], 8, [big-parallel, kvm, nixos-test, uid-range], [])
([aarch64-linux], 8, [big-parallel…
error: Cannot build '/nix/store/5afxhp1cjgp91bljcsmhpn2p1dl184sj-vm-test-run-horae-e2e.drv'.
Reason: platform mismatch
Required system: 'aarch64-darwin'
Current system: 'x86_64-linux'
Reason: missing system features
Required features: {apple-virt, nixos-test}
Available features: {benchmark, big-parallel, ca-derivations, kvm, nixos-test, recursive-nix, uid-range}
|
| failed |
checks.aarch64-darwin.e2e-oidc
|
42m 31s |
setup:
/nix/store/ll1ikdckb5620llwd3xpy5yjybshm4ps-closure-info.drv
/nix/store/5g5ymddmyhivgxx8y3z929ga6i2r08aw-run-nixos-vm.drv
/nix/store/d0g5s000apgvcc …
setup:
/nix/store/ll1ikdckb5620llwd3xpy5yjybshm4ps-closure-info.drv
/nix/store/5g5ymddmyhivgxx8y3z929ga6i2r08aw-run-nixos-vm.drv
/nix/store/d0g5s000apgvccj1d4xfpn9w9vd2y5q1-nixos-vm.drv
/nix/store/vq2mrbmjg6hpk9qvk5169qcgxcrvpanz-driverConfiguration.json.drv
/nix/store/dq9gsiypya6kcgnmpd3kiys9mxjacqaw-nixos-test-driver-horae-e2e-oidc.drv
/nix/store/439p841gqxd2awpw3l4i29y3a3wd4967-vm-test-run-horae-e2e-oidc.drv
Failed to find a machine for remote build!
derivation: 439p841gqxd2awpw3l4i29y3a3wd4967-vm-test-run-horae-e2e-oidc.drv
required (system, features): (aarch64-darwin, [apple-virt, nixos-test])
12 available machines:
(systems, maxjobs, supportedFeatures, mandatoryFeatures)
([aarch64-darwin], 8, [big-parallel, kvm, nixos-test, uid-range], [])
([aarch64-darwin], 8, [big-parallel, kvm, nixos-test, uid-range], [])
([aarch64-darwin], 8, [big-parallel, kvm, nixos-test, uid-range], [])
([aarch64-darwin], 8, [big-parallel, kvm, nixos-test, uid-range], [])
([aarch64-linux], 8, [big-parallel, kvm, nixos-test, uid-range], [])
([aarch64-linux], 8, [big-par…
error: Cannot build '/nix/store/439p841gqxd2awpw3l4i29y3a3wd4967-vm-test-run-horae-e2e-oidc.drv'.
Reason: platform mismatch
Required system: 'aarch64-darwin'
Current system: 'x86_64-linux'
Reason: missing system features
Required features: {apple-virt, nixos-test}
Available features: {benchmark, big-parallel, ca-derivations, kvm, nixos-test, recursive-nix, uid-range}
|
| failed |
checks.aarch64-darwin.tests
|
33m 13s |
horae-tests-0.1.0:
called `Result::unwrap()` on an `Err` value: error communicating with database: Socket is not connected (os error 57)
Caused by:
Socket i …
horae-tests-0.1.0:
called `Result::unwrap()` on an `Err` value: error communicating with database: Socket is not connected (os error 57)
Caused by:
Socket is not connected (os error 57)
note: run with `RUST_BACKTRACE=1` environment variable to display a backtrace
failures:
importers::harvest::engine_tests::completed_imports_allow_immediate_retries
test result: FAILED. 820 passed; 1 failed; 10 ignored; 0 measured; 0 filtered out; finished in 68.70s
error: test failed, to rerun pass `-p horae --bin horae`
|
| failed |
checks.aarch64-linux.e2e
|
9m 10s |
vm-test-run-horae-e2e:
)
^
File "/nix/store/yv2q67grjgrymd498bgdfzlhyaj04cqv-nixos-test-driver-1.1/lib/python3.13/site-packages/test_driver/machine/__ …
vm-test-run-horae-e2e:
)
^
File "/nix/store/yv2q67grjgrymd498bgdfzlhyaj04cqv-nixos-test-driver-1.1/lib/python3.13/site-packages/test_driver/machine/__init__.py", line 878, in _execute
self.connect()
~~~~~~~~~~~~^^
File "/nix/store/yv2q67grjgrymd498bgdfzlhyaj04cqv-nixos-test-driver-1.1/lib/python3.13/site-packages/test_driver/machine/__init__.py", line 1057, in connect
raise RuntimeError("Shell did not start in time")
RuntimeError: Shell did not start in time
|
| failed |
checks.aarch64-linux.e2e-oidc
|
8m 36s |
vm-test-run-horae-e2e-oidc:
)
^
File "/nix/store/yv2q67grjgrymd498bgdfzlhyaj04cqv-nixos-test-driver-1.1/lib/python3.13/site-packages/test_driver/machi …
vm-test-run-horae-e2e-oidc:
)
^
File "/nix/store/yv2q67grjgrymd498bgdfzlhyaj04cqv-nixos-test-driver-1.1/lib/python3.13/site-packages/test_driver/machine/__init__.py", line 878, in _execute
self.connect()
~~~~~~~~~~~~^^
File "/nix/store/yv2q67grjgrymd498bgdfzlhyaj04cqv-nixos-test-driver-1.1/lib/python3.13/site-packages/test_driver/machine/__init__.py", line 1057, in connect
raise RuntimeError("Shell did not start in time")
RuntimeError: Shell did not start in time
|